22

17 11
2
f 15 2 s
r 5 0 s
6 9

18 8
10
r 7 0 e
t 11 3 n
f 2 1 s
t 9 2 n
h 0 0 w
t 9 0 n
h 8 0 e
h 3 5 n
h 17 4 e
h 12 6 s
16 2

9 16
4
f 7 14 w
h 0 11 w
r 4 5 s
f 1 0 w
19 3

18 12
3
t 14 5 w
t 16 0 n
r 6 5 w
10 5

9 17
7
t 7 14 n
f 0 10 w
r 8 10 w
r 3 12 e
h 0 6 n
h 4 15 e
h 1 9 n
7 5

19 13
5
t 13 6 e
t 18 1 e
t 2 12 s
f 6 12 w
r 13 11 e
10 14

7 12
8
f 2 3 w
h 3 8 e
t 6 0 s
h 5 9 s
h 4 9 n
f 2 4 w
t 4 10 n
h 0 2 s
19 8

12 7
9
t 5 6 s
h 3 4 s
t 2 5 w
f 3 6 n
r 9 6 s
r 11 3 e
h 4 3 e
h 1 2 w
h 1 0 s
1 8

13 19
9
t 11 10 n
f 6 16 s
h 10 5 w
f 7 5 w
f 10 9 w
h 11 12 s
t 4 4 e
h 5 17 w
t 4 15 s
10 2

18 5
5
t 9 2 n
f 15 2 w
t 5 4 e
t 5 4 s
t 9 2 n
6 10

14 11
6
f 4 0 w
h 6 5 w
t 11 3 w
f 3 0 w
f 6 0 s
t 13 9 n
23 2

14 11
7
t 11 3 s
f 4 5 w
f 0 8 s
h 0 7 n
f 2 9 s
h 11 4 n
r 11 7 w
21 5

8 18
9
t 5 7 s
r 5 0 n
h 6 0 s
h 5 6 s
f 3 16 e
t 4 8 n
r 7 14 n
r 1 8 e
r 5 8 e
15 6

7 15
4
h 4 14 n
r 6 11 s
h 0 10 e
f 4 11 e
10 6

11 6
6
r 5 2 s
h 6 5 s
t 3 0 n
r 6 5 w
f 1 4 e
h 1 0 e
25 11

15 9
1
h 0 8 s
20 9

9 13
8
h 1 0 n
t 4 11 s
h 1 8 e
t 7 6 n
t 1 3 s
t 4 1 s
t 6 4 n
t 4 0 w
1 13

11 15
8
t 2 12 n
f 9 12 s
t 10 0 n
r 0 12 s
t 3 4 e
h 7 6 s
t 9 14 w
r 0 4 n
5 3

13 9
2
t 4 1 n
h 11 0 s
11 13

17 12
6
r 8 2 e
t 16 8 w
h 4 6 w
t 7 7 n
r 16 11 s
h 13 2 s
8 15

8 10
2
r 2 5 w
t 6 0 e
21 9

8 13
3
t 0 3 n
h 1 7 e
h 5 2 e
3 10
