*** Darwin 10x10 ***
Turn = 0.
  0123456789
0 ..........
1 ..h....t..
2 ...h......
3 ....h.....
4 ....f.....
5 ..........
6 ..........
7 ..........
8 ..........
9 ...h......

Turn = 8.
  0123456789
0 ..........
1 ...h...t..
2 h.........
3 .........h
4 ....f.....
5 ..........
6 ..........
7 ..........
8 ..........
9 ..h.......

*** Darwin 14x12 ***
Turn = 0.
  012345678901
0 ............
1 ............
2 hh..........
3 ............
4 ............
5 ....r.......
6 ............
7 ............
8 ............
9 ...........f
0 ....f.......
1 ............
2 rt..........
3 ............

*** Darwin 11x14 ***
Turn = 0.
  01234567890123
0 ..............
1 ..............
2 ..............
3 ..............
4 ..............
5 ..............
6 ......t.......
7 ..............
8 ...r..........
9 ..............
0 .t............

*** Darwin 14x15 ***
Turn = 0.
  012345678901234
0 ...............
1 ..........h....
2 ..........h....
3 ...............
4 ..........t....
5 ...........t...
6 ...............
7 ...............
8 ...............
9 .t.............
0 .....f..r......
1 ...............
2 ...t...........
3 ..............r

*** Darwin 11x14 ***
Turn = 0.
  01234567890123
0 ...t..........
1 ........t.....
2 ..............
3 ..............
4 ..............
5 ............h.
6 ..............
7 ......h.......
8 ....f.........
9 ......r.......
0 .......t......

*** Darwin 15x12 ***
Turn = 0.
  012345678901
0 ............
1 ............
2 f.......r...
3 ............
4 .r....r...r.
5 ............
6 .......f....
7 ...f........
8 .....t......
9 ............
0 ............
1 .......r....
2 .........tr.
3 ......f.....
4 ............

*** Darwin 13x11 ***
Turn = 0.
  01234567890
0 ..h........
1 ...r.......
2 ...........
3 .......h...
4 ...........
5 .r......t..
6 ...r......r
7 .......hf..
8 ...........
9 ...........
0 .......f...
1 r........h.
2 .h.........

*** Darwin 12x12 ***
Turn = 0.
  012345678901
0 ............
1 ..f.........
2 ...f........
3 f..h...fh...
4 f........t.f
5 ........h...
6 .........t..
7 r..........f
8 ............
9 ............
0 .f..........
1 ............

Turn = 2.
  012345678901
0 ............
1 ..f.........
2 ...f........
3 f....h.f....
4 f........t.f
5 ........h...
6 ........tt..
7 ...........f
8 ............
9 r...........
0 .f..........
1 ............

Turn = 4.
  012345678901
0 ............
1 ..f.........
2 ...f........
3 f.....hf....
4 f........t.f
5 ........t...
6 ........tt..
7 ...........f
8 ............
9 ............
0 .f..........
1 r...........

Turn = 6.
  012345678901
0 ............
1 ..f.........
2 ...f........
3 f.....hf....
4 f........t.f
5 ........t...
6 ........tt..
7 ...........f
8 ............
9 ............
0 .f..........
1 r...........

Turn = 8.
  012345678901
0 ............
1 ..f.........
2 ...f........
3 f.....hf....
4 f........t.f
5 ........t...
6 ........tt..
7 ...........f
8 ............
9 ............
0 .f..........
1 r...........

Turn = 10.
  012345678901
0 ............
1 ..f.........
2 ...f........
3 f.....hf....
4 f........t.f
5 ........t...
6 ........tt..
7 ...........f
8 ............
9 r...........
0 .f..........
1 ............

*** Darwin 12x12 ***
Turn = 0.
  012345678901
0 ............
1 ............
2 ............
3 ............
4 ...t........
5 ............
6 ............
7 ............
8 ............
9 ............
0 ............
1 ............

Turn = 1.
  012345678901
0 ............
1 ............
2 ............
3 ............
4 ...t........
5 ............
6 ............
7 ............
8 ............
9 ............
0 ............
1 ............

Turn = 2.
  012345678901
0 ............
1 ............
2 ............
3 ............
4 ...t........
5 ............
6 ............
7 ............
8 ............
9 ............
0 ............
1 ............

*** Darwin 12x15 ***
Turn = 0.
  012345678901234
0 .......h.......
1 ........r......
2 ...............
3 ...............
4 h..........t...
5 ...f.........tr
6 ...............
7 ....f......h...
8 ........f......
9 ........t......
0 ..f........r...
1 ...............

Turn = 1.
  012345678901234
0 ......h........
1 .......r.......
2 ...............
3 h..............
4 ...........t..r
5 ...f.........t.
6 ...............
7 ....f..........
8 ........f..h...
9 ........t..r...
0 ..f............
1 ...............

Turn = 2.
  012345678901234
0 .....h.........
1 ......r........
2 h..............
3 ..............r
4 ...........t...
5 ...f.........t.
6 ...............
7 ....f..........
8 ........f..r...
9 ........t..r...
0 ..f............
1 ...............

Turn = 3.
  012345678901234
0 ....h..........
1 h....r.........
2 ..............r
3 ...............
4 ...........t...
5 ...f.........t.
6 ...............
7 ....f..........
8 ........t..r...
9 ........t..r...
0 ..f............
1 ...............

Turn = 4.
  012345678901234
0 h..h...........
1 ....r.........r
2 ...............
3 ...............
4 ...........t...
5 ...f.........t.
6 ...............
7 ....f..........
8 ........t.r....
9 ........t.r....
0 ..f............
1 ...............

Turn = 5.
  012345678901234
0 h.h...........r
1 ...r...........
2 ...............
3 ...............
4 ...........t...
5 ...f.........t.
6 ...............
7 ....f..........
8 ........tr.....
9 ........tr.....
0 ..f............
1 ...............

Turn = 6.
  012345678901234
0 hh............r
1 ..r............
2 ...............
3 ...............
4 ...........t...
5 ...f.........t.
6 ...............
7 ....f..........
8 ........tt.....
9 ........rr.....
0 ..f............
1 ...............

Turn = 7.
  012345678901234
0 hh............r
1 .r.............
2 ...............
3 ...............
4 ...........t...
5 ...f.........t.
6 ...............
7 ....f..........
8 ........tt.....
9 ........rr.....
0 ..f............
1 ...............

Turn = 8.
  012345678901234
0 hh.............
1 r.............r
2 ...............
3 ...............
4 ...........t...
5 ...f.........t.
6 ...............
7 ....f..........
8 ........tr.....
9 ........rr.....
0 ..f............
1 ...............

Turn = 9.
  012345678901234
0 hh.............
1 r..............
2 ..............r
3 ...............
4 ...........t...
5 ...f.........t.
6 ...............
7 ....f..........
8 ........tr.....
9 ........rr.....
0 ..f............
1 ...............

Turn = 10.
  012345678901234
0 rh.............
1 r..............
2 ...............
3 ..............r
4 ...........t...
5 ...f.........t.
6 ...............
7 ....f..........
8 ........t.r....
9 ........t.r....
0 ..f............
1 ...............

*** Darwin 14x10 ***
Turn = 0.
  0123456789
0 ..........
1 r.t.......
2 ..........
3 .r...f....
4 ..........
5 ..........
6 ..........
7 ..f.......
8 ..........
9 ..........
0 t...h.....
1 ...h...tr.
2 .....t....
3 ..........

*** Darwin 13x15 ***
Turn = 0.
  012345678901234
0 .f........f....
1 ...............
2 ...............
3 ........h....h.
4 ...............
5 ...............
6 .h.............
7 ...............
8 ..r............
9 ...............
0 ...............
1 ..........t....
2 ...............

Turn = 5.
  012345678901234
0 .f........f..h.
1 .h.............
2 ...............
3 .............h.
4 ...............
5 ...............
6 ...............
7 ...............
8 ...............
9 ...............
0 ...............
1 ..........t....
2 ..r............

*** Darwin 12x13 ***
Turn = 0.
  0123456789012
0 .............
1 .............
2 .........r...
3 .............
4 .............
5 ......f......
6 .............
7 .............
8 .............
9 .............
0 .............
1 .............

Turn = 5.
  0123456789012
0 ...........r.
1 .............
2 .............
3 .............
4 .............
5 ......f......
6 .............
7 .............
8 .............
9 .............
0 .............
1 .............

*** Darwin 13x15 ***
Turn = 0.
  012345678901234
0 ...h...........
1 ...............
2 ...............
3 f.....f..h.....
4 t...t.....h....
5 ...............
6 ......t........
7 ...............
8 .t...........t.
9 .......r.......
0 ...............
1 ...............
2 .............r.

*** Darwin 12x11 ***
Turn = 0.
  01234567890
0 ...........
1 ..........f
2 ...........
3 ...........
4 .fh..t.....
5 ...........
6 .....t.h...
7 ...........
8 .r...h.....
9 .......f...
0 ...h.......
1 ...........

Turn = 5.
  01234567890
0 ..h........
1 .......h..f
2 ...........
3 ...........
4 .f...t.....
5 r..........
6 .....t.....
7 ...........
8 ...........
9 .......f...
0 h..........
1 .....h.....

Turn = 10.
  01234567890
0 r.h....h...
1 ..........f
2 ...........
3 ...........
4 .f...t.....
5 ...........
6 .....t.....
7 ...........
8 ...........
9 .......f...
0 h..........
1 .....h.....

*** Darwin 11x14 ***
Turn = 0.
  01234567890123
0 ..f...........
1 ..............
2 .........h....
3 .......t..r.f.
4 t............r
5 ....t........t
6 h..f.h........
7 ..............
8 ..............
9 ..............
0 .....t.....r..

Turn = 1.
  01234567890123
0 ..f...........
1 ..............
2 ..............
3 .......t.h..f.
4 t.........r..t
5 ....t........t
6 h..fh.........
7 ..............
8 ..............
9 ..............
0 .....t....r...

Turn = 2.
  01234567890123
0 ..f...........
1 ..............
2 ..............
3 .......t....f.
4 t........h...t
5 ....t.....r..t
6 h..fh.........
7 ..............
8 ..............
9 ..............
0 .....t...r....

Turn = 3.
  01234567890123
0 ..f...........
1 ..............
2 ..............
3 .......t....f.
4 t............t
5 ....t....h...t
6 h..fh.....r...
7 ..............
8 ..............
9 ..............
0 .....t..r.....

Turn = 4.
  01234567890123
0 ..f...........
1 ..............
2 ..............
3 .......t....f.
4 t............t
5 ....t........t
6 h..tt....h....
7 ..........r...
8 ..............
9 ..............
0 .....t.r......

Turn = 5.
  01234567890123
0 ..f...........
1 ..............
2 ..............
3 .......t....f.
4 t............t
5 ....t........t
6 h..tt.........
7 .........h....
8 ..........r...
9 ..............
0 .....tr.......

Turn = 6.
  01234567890123
0 ..f...........
1 ..............
2 ..............
3 .......t....f.
4 t............t
5 ....t........t
6 h..tt.........
7 ..............
8 .........h....
9 ..........r...
0 .....tt.......

Turn = 7.
  01234567890123
0 ..f...........
1 ..............
2 ..............
3 .......t....f.
4 t............t
5 ....t........t
6 h..tt.........
7 ..............
8 ..............
9 .........h....
0 .....tt...r...

*** Darwin 11x13 ***
Turn = 0.
  0123456789012
0 .............
1 ....t....f...
2 .............
3 .............
4 .............
5 .............
6 ......hh.....
7 .............
8 .............
9 t............
0 .............

*** Darwin 11x14 ***
Turn = 0.
  01234567890123
0 ..............
1 ......r...t...
2 ...f..........
3 ..............
4 ..............
5 ..............
6 .h..h.........
7 ...........r..
8 ..............
9 ..h..........h
0 ..............

*** Darwin 12x13 ***
Turn = 0.
  0123456789012
0 ....r..t.....
1 r...........f
2 .......h.....
3 .............
4 t...h..t.....
5 ..r......r...
6 .............
7 ..t.......t..
8 ....f........
9 .............
0 .............
1 .............

*** Darwin 14x10 ***
Turn = 0.
  0123456789
0 ..........
1 .........t
2 ..........
3 ..........
4 ..........
5 ......h...
6 ..........
7 ..........
8 ......h...
9 ...tt.....
0 ......t...
1 ..........
2 ...f.f..r.
3 ..........
