*** Darwin 18x14 ***
Turn = 0.
  01234567890123
0 ..............
1 ..............
2 ..............
3 ...........h..
4 .......r......
5 ..............
6 ....f.........
7 ..............
8 ..............
9 ..............
0 ......t.......
1 ............f.
2 ...........t..
3 ...........f..
4 ..............
5 ..............
6 ..............
7 ..............

Turn = 7.
  01234567890123
0 ..............
1 ..............
2 ..............
3 ....h.........
4 .............r
5 ..............
6 ....f.........
7 ..............
8 ..............
9 ..............
0 ......t.......
1 ............f.
2 ...........t..
3 ...........t..
4 ..............
5 ..............
6 ..............
7 ..............

Turn = 14.
  01234567890123
0 ..............
1 ..............
2 ..............
3 h.............
4 ..............
5 ..............
6 ....f.........
7 ..............
8 ..............
9 ..............
0 ......t.......
1 ............fr
2 ...........t..
3 ...........t..
4 ..............
5 ..............
6 ..............
7 ..............

Turn = 21.
  01234567890123
0 ..............
1 ..............
2 ..............
3 h.............
4 ..............
5 ..............
6 ....f.........
7 ..............
8 ..............
9 ..............
0 ......t.......
1 ............f.
2 ...........t..
3 ...........t..
4 ..............
5 ..............
6 ..............
7 .............r

*** Darwin 2x7 ***
Turn = 0.
  0123456
0 .......
1 ......h

Turn = 2.
  0123456
0 .......
1 ....h..

Turn = 4.
  0123456
0 .......
1 ..h....

Turn = 6.
  0123456
0 .......
1 h......

Turn = 8.
  0123456
0 .......
1 h......

Turn = 10.
  0123456
0 .......
1 h......

Turn = 12.
  0123456
0 .......
1 h......

Turn = 14.
  0123456
0 .......
1 h......

Turn = 16.
  0123456
0 .......
1 h......

Turn = 18.
  0123456
0 .......
1 h......

Turn = 20.
  0123456
0 .......
1 h......

Turn = 22.
  0123456
0 .......
1 h......

Turn = 24.
  0123456
0 .......
1 h......

Turn = 26.
  0123456
0 .......
1 h......

Turn = 28.
  0123456
0 .......
1 h......

Turn = 30.
  0123456
0 .......
1 h......

Turn = 32.
  0123456
0 .......
1 h......

Turn = 34.
  0123456
0 .......
1 h......

*** Darwin 14x8 ***
Turn = 0.
  01234567
0 ........
1 ........
2 ........
3 ........
4 .h......
5 ........
6 ........
7 ........
8 ........
9 ........
0 ........
1 ........
2 ........
3 ........

Turn = 1.
  01234567
0 ........
1 ........
2 ........
3 .h......
4 ........
5 ........
6 ........
7 ........
8 ........
9 ........
0 ........
1 ........
2 ........
3 ........

Turn = 2.
  01234567
0 ........
1 ........
2 .h......
3 ........
4 ........
5 ........
6 ........
7 ........
8 ........
9 ........
0 ........
1 ........
2 ........
3 ........

Turn = 3.
  01234567
0 ........
1 .h......
2 ........
3 ........
4 ........
5 ........
6 ........
7 ........
8 ........
9 ........
0 ........
1 ........
2 ........
3 ........

Turn = 4.
  01234567
0 .h......
1 ........
2 ........
3 ........
4 ........
5 ........
6 ........
7 ........
8 ........
9 ........
0 ........
1 ........
2 ........
3 ........

Turn = 5.
  01234567
0 .h......
1 ........
2 ........
3 ........
4 ........
5 ........
6 ........
7 ........
8 ........
9 ........
0 ........
1 ........
2 ........
3 ........

Turn = 6.
  01234567
0 .h......
1 ........
2 ........
3 ........
4 ........
5 ........
6 ........
7 ........
8 ........
9 ........
0 ........
1 ........
2 ........
3 ........

Turn = 7.
  01234567
0 .h......
1 ........
2 ........
3 ........
4 ........
5 ........
6 ........
7 ........
8 ........
9 ........
0 ........
1 ........
2 ........
3 ........

Turn = 8.
  01234567
0 .h......
1 ........
2 ........
3 ........
4 ........
5 ........
6 ........
7 ........
8 ........
9 ........
0 ........
1 ........
2 ........
3 ........

Turn = 9.
  01234567
0 .h......
1 ........
2 ........
3 ........
4 ........
5 ........
6 ........
7 ........
8 ........
9 ........
0 ........
1 ........
2 ........
3 ........

Turn = 10.
  01234567
0 .h......
1 ........
2 ........
3 ........
4 ........
5 ........
6 ........
7 ........
8 ........
9 ........
0 ........
1 ........
2 ........
3 ........

Turn = 11.
  01234567
0 .h......
1 ........
2 ........
3 ........
4 ........
5 ........
6 ........
7 ........
8 ........
9 ........
0 ........
1 ........
2 ........
3 ........

Turn = 12.
  01234567
0 .h......
1 ........
2 ........
3 ........
4 ........
5 ........
6 ........
7 ........
8 ........
9 ........
0 ........
1 ........
2 ........
3 ........

Turn = 13.
  01234567
0 .h......
1 ........
2 ........
3 ........
4 ........
5 ........
6 ........
7 ........
8 ........
9 ........
0 ........
1 ........
2 ........
3 ........

Turn = 14.
  01234567
0 .h......
1 ........
2 ........
3 ........
4 ........
5 ........
6 ........
7 ........
8 ........
9 ........
0 ........
1 ........
2 ........
3 ........

Turn = 15.
  01234567
0 .h......
1 ........
2 ........
3 ........
4 ........
5 ........
6 ........
7 ........
8 ........
9 ........
0 ........
1 ........
2 ........
3 ........

Turn = 16.
  01234567
0 .h......
1 ........
2 ........
3 ........
4 ........
5 ........
6 ........
7 ........
8 ........
9 ........
0 ........
1 ........
2 ........
3 ........

Turn = 17.
  01234567
0 .h......
1 ........
2 ........
3 ........
4 ........
5 ........
6 ........
7 ........
8 ........
9 ........
0 ........
1 ........
2 ........
3 ........

Turn = 18.
  01234567
0 .h......
1 ........
2 ........
3 ........
4 ........
5 ........
6 ........
7 ........
8 ........
9 ........
0 ........
1 ........
2 ........
3 ........

Turn = 19.
  01234567
0 .h......
1 ........
2 ........
3 ........
4 ........
5 ........
6 ........
7 ........
8 ........
9 ........
0 ........
1 ........
2 ........
3 ........

Turn = 20.
  01234567
0 .h......
1 ........
2 ........
3 ........
4 ........
5 ........
6 ........
7 ........
8 ........
9 ........
0 ........
1 ........
2 ........
3 ........

Turn = 21.
  01234567
0 .h......
1 ........
2 ........
3 ........
4 ........
5 ........
6 ........
7 ........
8 ........
9 ........
0 ........
1 ........
2 ........
3 ........

Turn = 22.
  01234567
0 .h......
1 ........
2 ........
3 ........
4 ........
5 ........
6 ........
7 ........
8 ........
9 ........
0 ........
1 ........
2 ........
3 ........

Turn = 23.
  01234567
0 .h......
1 ........
2 ........
3 ........
4 ........
5 ........
6 ........
7 ........
8 ........
9 ........
0 ........
1 ........
2 ........
3 ........

Turn = 24.
  01234567
0 .h......
1 ........
2 ........
3 ........
4 ........
5 ........
6 ........
7 ........
8 ........
9 ........
0 ........
1 ........
2 ........
3 ........

Turn = 25.
  01234567
0 .h......
1 ........
2 ........
3 ........
4 ........
5 ........
6 ........
7 ........
8 ........
9 ........
0 ........
1 ........
2 ........
3 ........

Turn = 26.
  01234567
0 .h......
1 ........
2 ........
3 ........
4 ........
5 ........
6 ........
7 ........
8 ........
9 ........
0 ........
1 ........
2 ........
3 ........

Turn = 27.
  01234567
0 .h......
1 ........
2 ........
3 ........
4 ........
5 ........
6 ........
7 ........
8 ........
9 ........
0 ........
1 ........
2 ........
3 ........

Turn = 28.
  01234567
0 .h......
1 ........
2 ........
3 ........
4 ........
5 ........
6 ........
7 ........
8 ........
9 ........
0 ........
1 ........
2 ........
3 ........

Turn = 29.
  01234567
0 .h......
1 ........
2 ........
3 ........
4 ........
5 ........
6 ........
7 ........
8 ........
9 ........
0 ........
1 ........
2 ........
3 ........

Turn = 30.
  01234567
0 .h......
1 ........
2 ........
3 ........
4 ........
5 ........
6 ........
7 ........
8 ........
9 ........
0 ........
1 ........
2 ........
3 ........

Turn = 31.
  01234567
0 .h......
1 ........
2 ........
3 ........
4 ........
5 ........
6 ........
7 ........
8 ........
9 ........
0 ........
1 ........
2 ........
3 ........

Turn = 32.
  01234567
0 .h......
1 ........
2 ........
3 ........
4 ........
5 ........
6 ........
7 ........
8 ........
9 ........
0 ........
1 ........
2 ........
3 ........

Turn = 33.
  01234567
0 .h......
1 ........
2 ........
3 ........
4 ........
5 ........
6 ........
7 ........
8 ........
9 ........
0 ........
1 ........
2 ........
3 ........

Turn = 34.
  01234567
0 .h......
1 ........
2 ........
3 ........
4 ........
5 ........
6 ........
7 ........
8 ........
9 ........
0 ........
1 ........
2 ........
3 ........

Turn = 35.
  01234567
0 .h......
1 ........
2 ........
3 ........
4 ........
5 ........
6 ........
7 ........
8 ........
9 ........
0 ........
1 ........
2 ........
3 ........

Turn = 36.
  01234567
0 .h......
1 ........
2 ........
3 ........
4 ........
5 ........
6 ........
7 ........
8 ........
9 ........
0 ........
1 ........
2 ........
3 ........

*** Darwin 17x19 ***
Turn = 0.
  0123456789012345678
0 ...................
1 ..............h....
2 .......f........r..
3 ...................
4 ..h.....h...f......
5 ...................
6 .......r...........
7 ...................
8 ...................
9 ...................
0 ...................
1 ...................
2 ...................
3 ............f......
4 .........t.........
5 ...................
6 ...................

*** Darwin 14x1 ***
Turn = 0.
  0
0 t
1 .
2 .
3 .
4 .
5 f
6 .
7 f
8 f
9 .
0 .
1 .
2 .
3 t

Turn = 7.
  0
0 t
1 .
2 .
3 .
4 .
5 f
6 .
7 f
8 f
9 .
0 .
1 .
2 .
3 t

*** Darwin 5x2 ***
Turn = 0.
  01
0 ..
1 .h
2 ff
3 .f
4 t.

Turn = 4.
  01
0 ..
1 h.
2 ff
3 .f
4 t.

Turn = 8.
  01
0 ..
1 h.
2 ff
3 .f
4 t.

Turn = 12.
  01
0 ..
1 h.
2 ff
3 .f
4 t.

Turn = 16.
  01
0 ..
1 h.
2 ff
3 .f
4 t.

Turn = 20.
  01
0 ..
1 h.
2 ff
3 .f
4 t.

Turn = 24.
  01
0 ..
1 h.
2 ff
3 .f
4 t.

Turn = 28.
  01
0 ..
1 h.
2 ff
3 .f
4 t.

Turn = 32.
  01
0 ..
1 h.
2 ff
3 .f
4 t.

Turn = 36.
  01
0 ..
1 h.
2 ff
3 .f
4 t.

Turn = 40.
  01
0 ..
1 h.
2 ff
3 .f
4 t.

*** Darwin 10x5 ***
Turn = 0.
  01234
0 .....
1 ....f
2 r....
3 ...h.
4 .....
5 .f...
6 .....
7 ...r.
8 r.r..
9 ....t

Turn = 9.
  01234
0 ..r..
1 ....f
2 .....
3 h....
4 .....
5 .f..r
6 ....r
7 .....
8 .....
9 ...tt

*** Darwin 13x11 ***
Turn = 0.
  01234567890
0 ........r..
1 ...........
2 ...........
3 ...f.......
4 ...........
5 ...........
6 ..f........
7 ...........
8 ....f......
9 ...........
0 ......h....
1 .f......f..
2 .....r.....

Turn = 8.
  01234567890
0 ...........
1 ...........
2 ..........r
3 ...f.......
4 ...........
5 ...........
6 ..f........
7 ...........
8 ....f......
9 ...........
0 r..........
1 rf......f..
2 ...........

Turn = 16.
  01234567890
0 ...........
1 ...........
2 ...........
3 r..f.......
4 ...........
5 ...........
6 ..f........
7 ...........
8 ....f......
9 r..........
0 ..........r
1 .f......f..
2 ...........

Turn = 24.
  01234567890
0 ....r......
1 r..........
2 ...........
3 ...f.......
4 ...........
5 ...........
6 ..f........
7 ...........
8 ....f.....r
9 ...........
0 ...........
1 .f......f..
2 ...........

Turn = 32.
  01234567890
0 ......r...r
1 ..........r
2 ...........
3 ...f.......
4 ...........
5 ...........
6 ..f........
7 ...........
8 ....f......
9 ...........
0 ...........
1 .f......f..
2 ...........

Turn = 40.
  01234567890
0 ...........
1 ..r........
2 ...........
3 ...f.......
4 .........r.
5 ..........r
6 ..f........
7 ...........
8 ....f......
9 ...........
0 ...........
1 .f......f..
2 ...........

Turn = 48.
  01234567890
0 ...........
1 ...........
2 ...........
3 ...f.......
4 ...........
5 ...........
6 r.f........
7 ...........
8 ....f......
9 ...........
0 ...........
1 .f......f..
2 .........rr

Turn = 56.
  01234567890
0 ...........
1 ...........
2 ...........
3 ...f.......
4 ...........
5 ...........
6 ..f........
7 ..........r
8 ....f......
9 ...........
0 ...........
1 .f......f..
2 r.r........

*** Darwin 2x5 ***
Turn = 0.
  01234
0 hf...
1 .rf..

Turn = 5.
  01234
0 hf..r
1 ....r

Turn = 10.
  01234
0 hf...
1 r...r

Turn = 15.
  01234
0 r....
1 rr..r

Turn = 20.
  01234
0 ....r
1 ..rrr

Turn = 25.
  01234
0 ...rr
1 r...r

Turn = 30.
  01234
0 ...rr
1 r..r.

Turn = 35.
  01234
0 ...r.
1 r.rr.

Turn = 40.
  01234
0 .r..r
1 ...rr

Turn = 45.
  01234
0 ..rr.
1 rr...

Turn = 50.
  01234
0 r.r..
1 rr...

Turn = 55.
  01234
0 r.r..
1 ..r.r

Turn = 60.
  01234
0 ...rr
1 ...rr

Turn = 65.
  01234
0 r..r.
1 r...r

Turn = 70.
  01234
0 r.r..
1 rr...

Turn = 75.
  01234
0 ...rr
1 r...r

Turn = 80.
  01234
0 .r...
1 r..rr

Turn = 85.
  01234
0 ...rr
1 .rr..

Turn = 90.
  01234
0 ...r.
1 rr..r

Turn = 95.
  01234
0 ...rr
1 ...rr

*** Darwin 18x18 ***
Turn = 0.
  012345678901234567
0 ..................
1 ..................
2 ..................
3 ..................
4 ..................
5 ..................
6 ..................
7 ..................
8 ..................
9 ..................
0 ..................
1 ..................
2 ..................
3 .......r..........
4 ..................
5 ..................
6 ..................
7 ..................

Turn = 2.
  012345678901234567
0 ..................
1 ..................
2 ..................
3 ..................
4 ..................
5 ..................
6 ..................
7 ..................
8 ..................
9 ..................
0 ..................
1 ..................
2 ..................
3 ..................
4 ..................
5 .......r..........
6 ..................
7 ..................

Turn = 4.
  012345678901234567
0 ..................
1 ..................
2 ..................
3 ..................
4 ..................
5 ..................
6 ..................
7 ..................
8 ..................
9 ..................
0 ..................
1 ..................
2 ..................
3 ..................
4 ..................
5 ..................
6 ..................
7 .......r..........

Turn = 6.
  012345678901234567
0 ..................
1 ..................
2 ..................
3 ..................
4 ..................
5 ..................
6 ..................
7 ..................
8 ..................
9 ..................
0 ..................
1 ..................
2 ..................
3 ..................
4 ..................
5 ..................
6 ..................
7 ......r...........

Turn = 8.
  012345678901234567
0 ..................
1 ..................
2 ..................
3 ..................
4 ..................
5 ..................
6 ..................
7 ..................
8 ..................
9 ..................
0 ..................
1 ..................
2 ..................
3 ..................
4 ..................
5 ..................
6 ..................
7 ....r.............

Turn = 10.
  012345678901234567
0 ..................
1 ..................
2 ..................
3 ..................
4 ..................
5 ..................
6 ..................
7 ..................
8 ..................
9 ..................
0 ..................
1 ..................
2 ..................
3 ..................
4 ..................
5 ..................
6 ..................
7 ..r...............

Turn = 12.
  012345678901234567
0 ..................
1 ..................
2 ..................
3 ..................
4 ..................
5 ..................
6 ..................
7 ..................
8 ..................
9 ..................
0 ..................
1 ..................
2 ..................
3 ..................
4 ..................
5 ..................
6 ..................
7 r.................

Turn = 14.
  012345678901234567
0 ..................
1 ..................
2 ..................
3 ..................
4 ..................
5 ..................
6 ..................
7 ..................
8 ..................
9 ..................
0 ..................
1 ..................
2 ..................
3 ..................
4 ..................
5 ..................
6 ..................
7 r.................

Turn = 16.
  012345678901234567
0 ..................
1 ..................
2 ..................
3 ..................
4 ..................
5 ..................
6 ..................
7 ..................
8 ..................
9 ..................
0 ..................
1 ..................
2 ..................
3 ..................
4 ..................
5 ..................
6 r.................
7 ..................

Turn = 18.
  012345678901234567
0 ..................
1 ..................
2 ..................
3 ..................
4 ..................
5 ..................
6 ..................
7 ..................
8 ..................
9 ..................
0 ..................
1 ..................
2 ..................
3 ..................
4 r.................
5 ..................
6 ..................
7 ..................

Turn = 20.
  012345678901234567
0 ..................
1 ..................
2 ..................
3 ..................
4 ..................
5 ..................
6 ..................
7 ..................
8 ..................
9 ..................
0 ..................
1 ..................
2 r.................
3 ..................
4 ..................
5 ..................
6 ..................
7 ..................

Turn = 22.
  012345678901234567
0 ..................
1 ..................
2 ..................
3 ..................
4 ..................
5 ..................
6 ..................
7 ..................
8 ..................
9 ..................
0 r.................
1 ..................
2 ..................
3 ..................
4 ..................
5 ..................
6 ..................
7 ..................

Turn = 24.
  012345678901234567
0 ..................
1 ..................
2 ..................
3 ..................
4 ..................
5 ..................
6 ..................
7 ..................
8 r.................
9 ..................
0 ..................
1 ..................
2 ..................
3 ..................
4 ..................
5 ..................
6 ..................
7 ..................

Turn = 26.
  012345678901234567
0 ..................
1 ..................
2 ..................
3 ..................
4 ..................
5 ..................
6 r.................
7 ..................
8 ..................
9 ..................
0 ..................
1 ..................
2 ..................
3 ..................
4 ..................
5 ..................
6 ..................
7 ..................

Turn = 28.
  012345678901234567
0 ..................
1 ..................
2 ..................
3 ..................
4 r.................
5 ..................
6 ..................
7 ..................
8 ..................
9 ..................
0 ..................
1 ..................
2 ..................
3 ..................
4 ..................
5 ..................
6 ..................
7 ..................

Turn = 30.
  012345678901234567
0 ..................
1 ..................
2 r.................
3 ..................
4 ..................
5 ..................
6 ..................
7 ..................
8 ..................
9 ..................
0 ..................
1 ..................
2 ..................
3 ..................
4 ..................
5 ..................
6 ..................
7 ..................

Turn = 32.
  012345678901234567
0 r.................
1 ..................
2 ..................
3 ..................
4 ..................
5 ..................
6 ..................
7 ..................
8 ..................
9 ..................
0 ..................
1 ..................
2 ..................
3 ..................
4 ..................
5 ..................
6 ..................
7 ..................

Turn = 34.
  012345678901234567
0 .r................
1 ..................
2 ..................
3 ..................
4 ..................
5 ..................
6 ..................
7 ..................
8 ..................
9 ..................
0 ..................
1 ..................
2 ..................
3 ..................
4 ..................
5 ..................
6 ..................
7 ..................

Turn = 36.
  012345678901234567
0 ...r..............
1 ..................
2 ..................
3 ..................
4 ..................
5 ..................
6 ..................
7 ..................
8 ..................
9 ..................
0 ..................
1 ..................
2 ..................
3 ..................
4 ..................
5 ..................
6 ..................
7 ..................

Turn = 38.
  012345678901234567
0 .....r............
1 ..................
2 ..................
3 ..................
4 ..................
5 ..................
6 ..................
7 ..................
8 ..................
9 ..................
0 ..................
1 ..................
2 ..................
3 ..................
4 ..................
5 ..................
6 ..................
7 ..................

Turn = 40.
  012345678901234567
0 .......r..........
1 ..................
2 ..................
3 ..................
4 ..................
5 ..................
6 ..................
7 ..................
8 ..................
9 ..................
0 ..................
1 ..................
2 ..................
3 ..................
4 ..................
5 ..................
6 ..................
7 ..................

Turn = 42.
  012345678901234567
0 .........r........
1 ..................
2 ..................
3 ..................
4 ..................
5 ..................
6 ..................
7 ..................
8 ..................
9 ..................
0 ..................
1 ..................
2 ..................
3 ..................
4 ..................
5 ..................
6 ..................
7 ..................

Turn = 44.
  012345678901234567
0 ...........r......
1 ..................
2 ..................
3 ..................
4 ..................
5 ..................
6 ..................
7 ..................
8 ..................
9 ..................
0 ..................
1 ..................
2 ..................
3 ..................
4 ..................
5 ..................
6 ..................
7 ..................

Turn = 46.
  012345678901234567
0 .............r....
1 ..................
2 ..................
3 ..................
4 ..................
5 ..................
6 ..................
7 ..................
8 ..................
9 ..................
0 ..................
1 ..................
2 ..................
3 ..................
4 ..................
5 ..................
6 ..................
7 ..................

Turn = 48.
  012345678901234567
0 ...............r..
1 ..................
2 ..................
3 ..................
4 ..................
5 ..................
6 ..................
7 ..................
8 ..................
9 ..................
0 ..................
1 ..................
2 ..................
3 ..................
4 ..................
5 ..................
6 ..................
7 ..................

Turn = 50.
  012345678901234567
0 .................r
1 ..................
2 ..................
3 ..................
4 ..................
5 ..................
6 ..................
7 ..................
8 ..................
9 ..................
0 ..................
1 ..................
2 ..................
3 ..................
4 ..................
5 ..................
6 ..................
7 ..................

Turn = 52.
  012345678901234567
0 ..................
1 .................r
2 ..................
3 ..................
4 ..................
5 ..................
6 ..................
7 ..................
8 ..................
9 ..................
0 ..................
1 ..................
2 ..................
3 ..................
4 ..................
5 ..................
6 ..................
7 ..................

Turn = 54.
  012345678901234567
0 ..................
1 ..................
2 ..................
3 .................r
4 ..................
5 ..................
6 ..................
7 ..................
8 ..................
9 ..................
0 ..................
1 ..................
2 ..................
3 ..................
4 ..................
5 ..................
6 ..................
7 ..................

Turn = 56.
  012345678901234567
0 ..................
1 ..................
2 ..................
3 ..................
4 ..................
5 .................r
6 ..................
7 ..................
8 ..................
9 ..................
0 ..................
1 ..................
2 ..................
3 ..................
4 ..................
5 ..................
6 ..................
7 ..................

Turn = 58.
  012345678901234567
0 ..................
1 ..................
2 ..................
3 ..................
4 ..................
5 ..................
6 ..................
7 .................r
8 ..................
9 ..................
0 ..................
1 ..................
2 ..................
3 ..................
4 ..................
5 ..................
6 ..................
7 ..................

Turn = 60.
  012345678901234567
0 ..................
1 ..................
2 ..................
3 ..................
4 ..................
5 ..................
6 ..................
7 ..................
8 ..................
9 .................r
0 ..................
1 ..................
2 ..................
3 ..................
4 ..................
5 ..................
6 ..................
7 ..................

Turn = 62.
  012345678901234567
0 ..................
1 ..................
2 ..................
3 ..................
4 ..................
5 ..................
6 ..................
7 ..................
8 ..................
9 ..................
0 ..................
1 .................r
2 ..................
3 ..................
4 ..................
5 ..................
6 ..................
7 ..................

*** Darwin 5x1 ***
Turn = 0.
  0
0 t
1 t
2 t
3 .
4 h

Turn = 9.
  0
0 t
1 t
2 t
3 t
4 .

Turn = 18.
  0
0 t
1 t
2 t
3 t
4 .

Turn = 27.
  0
0 t
1 t
2 t
3 t
4 .

Turn = 36.
  0
0 t
1 t
2 t
3 t
4 .

*** Darwin 10x20 ***
Turn = 0.
  01234567890123456789
0 ....................
1 ....................
2 ....................
3 .f..........f.......
4 ....t...............
5 ....................
6 ...................r
7 ..........h.........
8 ..........f........r
9 ....................

Turn = 6.
  01234567890123456789
0 ....................
1 ..........h.........
2 ....................
3 .f..........f.......
4 ....t...............
5 ....................
6 ....................
7 ....................
8 ..........f..r......
9 .................r..

Turn = 12.
  01234567890123456789
0 ..........h.........
1 ....................
2 ....................
3 .f..........f.......
4 ....t...............
5 ....................
6 ....................
7 ....................
8 .......rr...........
9 ...........r........

Turn = 18.
  01234567890123456789
0 ..........h.........
1 ....................
2 ....................
3 .f..........f.......
4 ....t...............
5 ....................
6 ....................
7 ....................
8 .rr.................
9 .....r..............

Turn = 24.
  01234567890123456789
0 ..........h.........
1 ....................
2 ....................
3 .f..........f.......
4 .r..t...............
5 ....................
6 ....................
7 ....................
8 rr..................
9 ....................

Turn = 30.
  01234567890123456789
0 r.........h.........
1 r...................
2 rr..................
3 ............f.......
4 ....t...............
5 ....................
6 ....................
7 ....................
8 ....................
9 ....................

Turn = 36.
  01234567890123456789
0 r.........h.........
1 r...................
2 .r..................
3 ............f.......
4 r...t...............
5 ....................
6 ....................
7 ....................
8 ....................
9 ....................

*** Darwin 8x7 ***
Turn = 0.
  0123456
0 ......f
1 ...h...
2 ....rh.
3 .......
4 .hh....
5 .......
6 rh...t.
7 t......

Turn = 10.
  0123456
0 .h.r.r.
1 .......
2 .r.....
3 ..r.rr.
4 ....r..
5 .......
6 .......
7 .h....r

Turn = 20.
  0123456
0 r....rr
1 ......r
2 .r.....
3 .......
4 .......
5 ...r.r.
6 .r.....
7 rr.....

Turn = 30.
  0123456
0 .r....r
1 ......r
2 .r...r.
3 ..r....
4 .......
5 ..r....
6 .....rr
7 .....r.

Turn = 40.
  0123456
0 r..r...
1 .rr....
2 .r.....
3 .r..r.r
4 ...r...
5 .......
6 r......
7 .......

Turn = 50.
  0123456
0 rr.....
1 .rr....
2 r......
3 r......
4 ......r
5 .......
6 ..r....
7 ..rr...

*** Darwin 17x6 ***
Turn = 0.
  012345
0 f.....
1 ......
2 ....h.
3 ...t..
4 ......
5 .....f
6 ......
7 ......
8 ......
9 ......
0 .....h
1 .....r
2 ......
3 .h...f
4 ......
5 ......
6 ......

Turn = 3.
  012345
0 f.....
1 ......
2 ......
3 ...tt.
4 ......
5 .....f
6 ......
7 ......
8 ......
9 ......
0 .h....
1 .....h
2 .....r
3 ......
4 .....r
5 ......
6 ......

Turn = 6.
  012345
0 f.....
1 ......
2 ......
3 ...tt.
4 ......
5 .....f
6 ......
7 .h....
8 ......
9 ......
0 ......
1 ......
2 .....h
3 ......
4 .....r
5 ......
6 .....r

Turn = 9.
  012345
0 f.....
1 ......
2 ......
3 ...tt.
4 .h....
5 .....f
6 ......
7 ......
8 ......
9 ......
0 ......
1 ......
2 ......
3 ......
4 ......
5 .....h
6 ..r..r

Turn = 12.
  012345
0 f.....
1 .h....
2 ......
3 ...tt.
4 ......
5 .....f
6 ......
7 ......
8 ......
9 ......
0 ......
1 ......
2 ......
3 ......
4 ......
5 ......
6 r.r..h

Turn = 15.
  012345
0 fh....
1 ......
2 ......
3 ...tt.
4 ......
5 .....f
6 ......
7 ......
8 ......
9 ......
0 ......
1 ......
2 ......
3 r.....
4 ......
5 ......
6 r....h

Turn = 18.
  012345
0 fh....
1 ......
2 ......
3 ...tt.
4 ......
5 .....f
6 ......
7 ......
8 ......
9 ......
0 r.....
1 ......
2 ......
3 ......
4 ......
5 ......
6 ..r..h

Turn = 21.
  012345
0 fh....
1 ......
2 ......
3 ...tt.
4 ......
5 .....f
6 ......
7 r.....
8 ......
9 ......
0 ......
1 ......
2 ......
3 ......
4 ......
5 ......
6 ....rr

Turn = 24.
  012345
0 fh....
1 ......
2 ......
3 ...tt.
4 r.....
5 .....f
6 ......
7 ......
8 ......
9 ......
0 ......
1 ......
2 ......
3 ......
4 ......
5 ......
6 ...r.r

Turn = 27.
  012345
0 fh....
1 r.....
2 ......
3 ...tt.
4 ......
5 .....f
6 ......
7 ......
8 ......
9 ......
0 ......
1 ......
2 ......
3 ......
4 ......
5 ......
6 r..r..

Turn = 30.
  012345
0 rh....
1 r.....
2 ......
3 ...tt.
4 ......
5 .....f
6 ......
7 ......
8 ......
9 ......
0 ......
1 ......
2 ......
3 ......
4 ......
5 ......
6 rr....

Turn = 33.
  012345
0 r..r..
1 ......
2 r.....
3 ...tt.
4 ......
5 .....f
6 ......
7 ......
8 ......
9 ......
0 ......
1 ......
2 ......
3 rr....
4 ......
5 ......
6 ......

Turn = 36.
  012345
0 ...r.r
1 ......
2 ......
3 ...tt.
4 ......
5 r....f
6 ......
7 ......
8 ......
9 ......
0 rr....
1 ......
2 ......
3 ......
4 ......
5 ......
6 ......

Turn = 39.
  012345
0 .....r
1 ......
2 ......
3 ...ttt
4 ......
5 .....f
6 ......
7 rr....
8 r.....
9 ......
0 ......
1 ......
2 ......
3 ......
4 ......
5 ......
6 ......

Turn = 42.
  012345
0 ......
1 ......
2 .....r
3 ...ttr
4 .r....
5 .....f
6 ......
7 r.....
8 ......
9 ......
0 r.....
1 ......
2 ......
3 ......
4 ......
5 ......
6 ......

Turn = 45.
  012345
0 ......
1 .r...r
2 ......
3 ...ttt
4 r.....
5 .....f
6 ......
7 ......
8 ......
9 ......
0 ......
1 ......
2 ......
3 r.....
4 ......
5 ......
6 ......

Turn = 48.
  012345
0 ..r..r
1 r.....
2 ......
3 ...ttt
4 ......
5 .....f
6 ......
7 ......
8 ......
9 ......
0 ......
1 ......
2 ......
3 ......
4 ......
5 ......
6 r.....

Turn = 51.
  012345
0 r....r
1 ......
2 .....t
3 ...ttt
4 ......
5 .....f
6 ......
7 ......
8 ......
9 ......
0 ......
1 ......
2 ......
3 ......
4 ......
5 r.....
6 ......

Turn = 54.
  012345
0 .....r
1 ......
2 .....t
3 r..ttt
4 ......
5 .....f
6 ......
7 ......
8 ......
9 ......
0 ......
1 ......
2 r.....
3 ......
4 ......
5 ......
6 ......

Turn = 57.
  012345
0 .....r
1 ......
2 .....t
3 ...ttt
4 ......
5 .....f
6 r.....
7 ......
8 ......
9 r.....
0 ......
1 ......
2 ......
3 ......
4 ......
5 ......
6 ......

Turn = 60.
  012345
0 ....r.
1 ......
2 .....t
3 ...ttt
4 ......
5 .....f
6 ......
7 r.....
8 r.....
9 ......
0 ......
1 ......
2 ......
3 ......
4 ......
5 ......
6 ......

Turn = 63.
  012345
0 .r....
1 ......
2 .....t
3 ...ttt
4 ......
5 .....f
6 r.....
7 ......
8 ......
9 ......
0 ......
1 r.....
2 ......
3 ......
4 ......
5 ......
6 ......

Turn = 66.
  012345
0 r.....
1 ......
2 .....t
3 r..ttt
4 ......
5 .....f
6 ......
7 ......
8 ......
9 ......
0 ......
1 ......
2 ......
3 ......
4 r.....
5 ......
6 ......

Turn = 69.
  012345
0 r.....
1 r.....
2 .....t
3 ...ttt
4 ......
5 .....f
6 ......
7 ......
8 ......
9 ......
0 ......
1 ......
2 ......
3 ......
4 ......
5 ......
6 r.....

Turn = 72.
  012345
0 r.r...
1 ......
2 .....t
3 ...ttt
4 ......
5 .....f
6 ......
7 ......
8 ......
9 ......
0 ......
1 ......
2 ......
3 ......
4 ......
5 ......
6 r.....

Turn = 75.
  012345
0 .....r
1 ......
2 r....t
3 ...ttt
4 ......
5 .....f
6 ......
7 ......
8 ......
9 ......
0 ......
1 ......
2 ......
3 r.....
4 ......
5 ......
6 ......

Turn = 78.
  012345
0 ......
1 .....t
2 .....t
3 ...ttt
4 ......
5 r....f
6 ......
7 ......
8 ......
9 ......
0 r.....
1 ......
2 ......
3 ......
4 ......
5 ......
6 ......

Turn = 81.
  012345
0 ......
1 .....t
2 .....t
3 ...ttt
4 ......
5 .....f
6 ......
7 r.....
8 r.....
9 ......
0 ......
1 ......
2 ......
3 ......
4 ......
5 ......
6 ......

Turn = 84.
  012345
0 ......
1 .....t
2 .....t
3 ...ttt
4 ......
5 .....f
6 r.....
7 ...r..
8 ......
9 ......
0 ......
1 ......
2 ......
3 ......
4 ......
5 ......
6 ......

Turn = 87.
  012345
0 ......
1 .....t
2 .....t
3 r..ttt
4 ......
5 .....f
6 ......
7 .....r
8 ......
9 ......
0 ......
1 ......
2 ......
3 ......
4 ......
5 ......
6 ......

*** Darwin 13x5 ***
Turn = 0.
  01234
0 .t...
1 .....
2 .....
3 .....
4 .....
5 .....
6 ...t.
7 .....
8 .....
9 ..t..
0 ft...
1 .....
2 ....h

Turn = 2.
  01234
0 .t...
1 .....
2 .....
3 .....
4 .....
5 .....
6 ...t.
7 .....
8 .....
9 ..t..
0 ft..h
1 .....
2 .....

Turn = 4.
  01234
0 .t...
1 .....
2 .....
3 .....
4 .....
5 .....
6 ...t.
7 .....
8 ....h
9 ..t..
0 tt...
1 .....
2 .....

Turn = 6.
  01234
0 .t...
1 .....
2 .....
3 .....
4 .....
5 .....
6 ...th
7 .....
8 .....
9 ..t..
0 tt...
1 .....
2 .....

Turn = 8.
  01234
0 .t...
1 .....
2 .....
3 .....
4 ....h
5 .....
6 ...t.
7 .....
8 .....
9 ..t..
0 tt...
1 .....
2 .....

Turn = 10.
  01234
0 .t...
1 .....
2 ....h
3 .....
4 .....
5 .....
6 ...t.
7 .....
8 .....
9 ..t..
0 tt...
1 .....
2 .....

Turn = 12.
  01234
0 .t..h
1 .....
2 .....
3 .....
4 .....
5 .....
6 ...t.
7 .....
8 .....
9 ..t..
0 tt...
1 .....
2 .....

Turn = 14.
  01234
0 .t..h
1 .....
2 .....
3 .....
4 .....
5 .....
6 ...t.
7 .....
8 .....
9 ..t..
0 tt...
1 .....
2 .....

Turn = 16.
  01234
0 .t..h
1 .....
2 .....
3 .....
4 .....
5 .....
6 ...t.
7 .....
8 .....
9 ..t..
0 tt...
1 .....
2 .....

Turn = 18.
  01234
0 .t..h
1 .....
2 .....
3 .....
4 .....
5 .....
6 ...t.
7 .....
8 .....
9 ..t..
0 tt...
1 .....
2 .....

Turn = 20.
  01234
0 .t..h
1 .....
2 .....
3 .....
4 .....
5 .....
6 ...t.
7 .....
8 .....
9 ..t..
0 tt...
1 .....
2 .....

Turn = 22.
  01234
0 .t..h
1 .....
2 .....
3 .....
4 .....
5 .....
6 ...t.
7 .....
8 .....
9 ..t..
0 tt...
1 .....
2 .....

Turn = 24.
  01234
0 .t..h
1 .....
2 .....
3 .....
4 .....
5 .....
6 ...t.
7 .....
8 .....
9 ..t..
0 tt...
1 .....
2 .....

Turn = 26.
  01234
0 .t..h
1 .....
2 .....
3 .....
4 .....
5 .....
6 ...t.
7 .....
8 .....
9 ..t..
0 tt...
1 .....
2 .....

Turn = 28.
  01234
0 .t..h
1 .....
2 .....
3 .....
4 .....
5 .....
6 ...t.
7 .....
8 .....
9 ..t..
0 tt...
1 .....
2 .....

Turn = 30.
  01234
0 .t..h
1 .....
2 .....
3 .....
4 .....
5 .....
6 ...t.
7 .....
8 .....
9 ..t..
0 tt...
1 .....
2 .....

Turn = 32.
  01234
0 .t..h
1 .....
2 .....
3 .....
4 .....
5 .....
6 ...t.
7 .....
8 .....
9 ..t..
0 tt...
1 .....
2 .....

Turn = 34.
  01234
0 .t..h
1 .....
2 .....
3 .....
4 .....
5 .....
6 ...t.
7 .....
8 .....
9 ..t..
0 tt...
1 .....
2 .....

Turn = 36.
  01234
0 .t..h
1 .....
2 .....
3 .....
4 .....
5 .....
6 ...t.
7 .....
8 .....
9 ..t..
0 tt...
1 .....
2 .....

Turn = 38.
  01234
0 .t..h
1 .....
2 .....
3 .....
4 .....
5 .....
6 ...t.
7 .....
8 .....
9 ..t..
0 tt...
1 .....
2 .....

Turn = 40.
  01234
0 .t..h
1 .....
2 .....
3 .....
4 .....
5 .....
6 ...t.
7 .....
8 .....
9 ..t..
0 tt...
1 .....
2 .....

Turn = 42.
  01234
0 .t..h
1 .....
2 .....
3 .....
4 .....
5 .....
6 ...t.
7 .....
8 .....
9 ..t..
0 tt...
1 .....
2 .....

Turn = 44.
  01234
0 .t..h
1 .....
2 .....
3 .....
4 .....
5 .....
6 ...t.
7 .....
8 .....
9 ..t..
0 tt...
1 .....
2 .....

Turn = 46.
  01234
0 .t..h
1 .....
2 .....
3 .....
4 .....
5 .....
6 ...t.
7 .....
8 .....
9 ..t..
0 tt...
1 .....
2 .....

Turn = 48.
  01234
0 .t..h
1 .....
2 .....
3 .....
4 .....
5 .....
6 ...t.
7 .....
8 .....
9 ..t..
0 tt...
1 .....
2 .....

Turn = 50.
  01234
0 .t..h
1 .....
2 .....
3 .....
4 .....
5 .....
6 ...t.
7 .....
8 .....
9 ..t..
0 tt...
1 .....
2 .....

Turn = 52.
  01234
0 .t..h
1 .....
2 .....
3 .....
4 .....
5 .....
6 ...t.
7 .....
8 .....
9 ..t..
0 tt...
1 .....
2 .....

Turn = 54.
  01234
0 .t..h
1 .....
2 .....
3 .....
4 .....
5 .....
6 ...t.
7 .....
8 .....
9 ..t..
0 tt...
1 .....
2 .....

Turn = 56.
  01234
0 .t..h
1 .....
2 .....
3 .....
4 .....
5 .....
6 ...t.
7 .....
8 .....
9 ..t..
0 tt...
1 .....
2 .....

Turn = 58.
  01234
0 .t..h
1 .....
2 .....
3 .....
4 .....
5 .....
6 ...t.
7 .....
8 .....
9 ..t..
0 tt...
1 .....
2 .....

Turn = 60.
  01234
0 .t..h
1 .....
2 .....
3 .....
4 .....
5 .....
6 ...t.
7 .....
8 .....
9 ..t..
0 tt...
1 .....
2 .....

Turn = 62.
  01234
0 .t..h
1 .....
2 .....
3 .....
4 .....
5 .....
6 ...t.
7 .....
8 .....
9 ..t..
0 tt...
1 .....
2 .....

*** Darwin 1x4 ***
Turn = 0.
  0123
0 h...

Turn = 6.
  0123
0 h...

Turn = 12.
  0123
0 h...

Turn = 18.
  0123
0 h...

Turn = 24.
  0123
0 h...

Turn = 30.
  0123
0 h...

*** Darwin 7x8 ***
Turn = 0.
  01234567
0 t.......
1 ........
2 ........
3 .....ft.
4 ........
5 .h.t....
6 .r...h..

Turn = 3.
  01234567
0 t.......
1 ........
2 ........
3 .....tt.
4 ........
5 ..tt....
6 ....rh..

Turn = 6.
  01234567
0 t.......
1 ........
2 ........
3 .....tt.
4 ........
5 ..ttrr..
6 ........

Turn = 9.
  01234567
0 t.......
1 ........
2 ....r...
3 .....tt.
4 .....t..
5 ..tt....
6 ........

Turn = 12.
  01234567
0 t...r...
1 ........
2 ........
3 .....tt.
4 .....t..
5 ..tt....
6 ........

*** Darwin 2x10 ***
Turn = 0.
  0123456789
0 h..r...h.t
1 ..h.....f.

Turn = 7.
  0123456789
0 .......rrr
1 h.h....r..

Turn = 14.
  0123456789
0 ..rr......
1 h.rrr.....

*** Darwin 1x1 ***
Turn = 0.
  0
0 t

Turn = 2.
  0
0 t

Turn = 4.
  0
0 t

Turn = 6.
  0
0 t

Turn = 8.
  0
0 t

Turn = 10.
  0
0 t

Turn = 12.
  0
0 t

Turn = 14.
  0
0 t

Turn = 16.
  0
0 t

Turn = 18.
  0
0 t

Turn = 20.
  0
0 t

Turn = 22.
  0
0 t

Turn = 24.
  0
0 t

Turn = 26.
  0
0 t

Turn = 28.
  0
0 t

Turn = 30.
  0
0 t

Turn = 32.
  0
0 t

Turn = 34.
  0
0 t

Turn = 36.
  0
0 t

Turn = 38.
  0
0 t

Turn = 40.
  0
0 t

Turn = 42.
  0
0 t

Turn = 44.
  0
0 t

Turn = 46.
  0
0 t

Turn = 48.
  0
0 t

*** Darwin 15x14 ***
Turn = 0.
  01234567890123
0 ..............
1 ...r..........
2 ...r..........
3 ..............
4 ..............
5 .r.f..........
6 ..............
7 ..............
8 ..............
9 ..............
0 ..............
1 ..............
2 f............f
3 ..............
4 ..............

Turn = 8.
  01234567890123
0 ...r..........
1 ...........r..
2 ...........r..
3 ..............
4 ..............
5 ...f..........
6 ..............
7 ..............
8 ..............
9 ..............
0 ..............
1 ..............
2 f............f
3 ..............
4 ..............

Turn = 16.
  01234567890123
0 ...........r..
1 ..............
2 .............r
3 ..............
4 ..............
5 ...f..........
6 ..............
7 .............r
8 ..............
9 ..............
0 ..............
1 ..............
2 f............f
3 ..............
4 ..............

Turn = 24.
  01234567890123
0 ..............
1 ..............
2 ..............
3 ..............
4 ..............
5 ...f.........r
6 ..............
7 ..............
8 ..............
9 ..............
0 .............r
1 ..............
2 f........r....
3 ..............
4 .............r

Turn = 32.
  01234567890123
0 ..............
1 ..............
2 ..............
3 ..............
4 ..............
5 ...f..........
6 ..............
7 ..............
8 ..............
9 ..............
0 ..............
1 ............r.
2 fr..........r.
3 .........r....
4 ..............

Turn = 40.
  01234567890123
0 ..............
1 ..............
2 ..............
3 ..............
4 ..............
5 r..f..........
6 ..............
7 r.............
8 ..............
9 ..............
0 ..............
1 ....r.........
2 ....r.........
3 .r............
4 ..............

Turn = 48.
  01234567890123
0 r.............
1 .r............
2 ..............
3 ..............
4 ..............
5 ...f..........
6 ..............
7 ..............
8 ..............
9 ..............
0 r.............
1 ..............
2 ..............
3 ..............
4 r.r...........

Turn = 56.
  01234567890123
0 ........r.....
1 .........r....
2 r.............
3 ..............
4 ..............
5 ...f..........
6 ..............
7 ..............
8 ..............
9 ..............
0 ..............
1 ..............
2 ..............
3 ..............
4 ........r.r...

Turn = 64.
  01234567890123
0 .....r.......r
1 ..............
2 ..............
3 ..............
4 .............r
5 ...f..........
6 ..............
7 ..............
8 ..............
9 ..............
0 ..............
1 ..............
2 ..............
3 ..............
4 ............rr

Turn = 72.
  01234567890123
0 .............r
1 ..............
2 ..............
3 ..............
4 ..............
5 ...f..........
6 ..............
7 ..............
8 .............r
9 ..............
0 ..............
1 ..............
2 .............r
3 ..............
4 ......r.r.....

*** Darwin 20x2 ***
Turn = 0.
  01
0 ..
1 ..
2 .t
3 ..
4 ..
5 ..
6 ..
7 ..
8 ..
9 ..
0 ..
1 ..
2 ..
3 ..
4 ..
5 ..
6 ..
7 ..
8 ..
9 ..

Turn = 3.
  01
0 ..
1 ..
2 .t
3 ..
4 ..
5 ..
6 ..
7 ..
8 ..
9 ..
0 ..
1 ..
2 ..
3 ..
4 ..
5 ..
6 ..
7 ..
8 ..
9 ..

Turn = 6.
  01
0 ..
1 ..
2 .t
3 ..
4 ..
5 ..
6 ..
7 ..
8 ..
9 ..
0 ..
1 ..
2 ..
3 ..
4 ..
5 ..
6 ..
7 ..
8 ..
9 ..

Turn = 9.
  01
0 ..
1 ..
2 .t
3 ..
4 ..
5 ..
6 ..
7 ..
8 ..
9 ..
0 ..
1 ..
2 ..
3 ..
4 ..
5 ..
6 ..
7 ..
8 ..
9 ..

Turn = 12.
  01
0 ..
1 ..
2 .t
3 ..
4 ..
5 ..
6 ..
7 ..
8 ..
9 ..
0 ..
1 ..
2 ..
3 ..
4 ..
5 ..
6 ..
7 ..
8 ..
9 ..

Turn = 15.
  01
0 ..
1 ..
2 .t
3 ..
4 ..
5 ..
6 ..
7 ..
8 ..
9 ..
0 ..
1 ..
2 ..
3 ..
4 ..
5 ..
6 ..
7 ..
8 ..
9 ..

Turn = 18.
  01
0 ..
1 ..
2 .t
3 ..
4 ..
5 ..
6 ..
7 ..
8 ..
9 ..
0 ..
1 ..
2 ..
3 ..
4 ..
5 ..
6 ..
7 ..
8 ..
9 ..

Turn = 21.
  01
0 ..
1 ..
2 .t
3 ..
4 ..
5 ..
6 ..
7 ..
8 ..
9 ..
0 ..
1 ..
2 ..
3 ..
4 ..
5 ..
6 ..
7 ..
8 ..
9 ..

Turn = 24.
  01
0 ..
1 ..
2 .t
3 ..
4 ..
5 ..
6 ..
7 ..
8 ..
9 ..
0 ..
1 ..
2 ..
3 ..
4 ..
5 ..
6 ..
7 ..
8 ..
9 ..

Turn = 27.
  01
0 ..
1 ..
2 .t
3 ..
4 ..
5 ..
6 ..
7 ..
8 ..
9 ..
0 ..
1 ..
2 ..
3 ..
4 ..
5 ..
6 ..
7 ..
8 ..
9 ..

Turn = 30.
  01
0 ..
1 ..
2 .t
3 ..
4 ..
5 ..
6 ..
7 ..
8 ..
9 ..
0 ..
1 ..
2 ..
3 ..
4 ..
5 ..
6 ..
7 ..
8 ..
9 ..

Turn = 33.
  01
0 ..
1 ..
2 .t
3 ..
4 ..
5 ..
6 ..
7 ..
8 ..
9 ..
0 ..
1 ..
2 ..
3 ..
4 ..
5 ..
6 ..
7 ..
8 ..
9 ..

Turn = 36.
  01
0 ..
1 ..
2 .t
3 ..
4 ..
5 ..
6 ..
7 ..
8 ..
9 ..
0 ..
1 ..
2 ..
3 ..
4 ..
5 ..
6 ..
7 ..
8 ..
9 ..

Turn = 39.
  01
0 ..
1 ..
2 .t
3 ..
4 ..
5 ..
6 ..
7 ..
8 ..
9 ..
0 ..
1 ..
2 ..
3 ..
4 ..
5 ..
6 ..
7 ..
8 ..
9 ..

Turn = 42.
  01
0 ..
1 ..
2 .t
3 ..
4 ..
5 ..
6 ..
7 ..
8 ..
9 ..
0 ..
1 ..
2 ..
3 ..
4 ..
5 ..
6 ..
7 ..
8 ..
9 ..

Turn = 45.
  01
0 ..
1 ..
2 .t
3 ..
4 ..
5 ..
6 ..
7 ..
8 ..
9 ..
0 ..
1 ..
2 ..
3 ..
4 ..
5 ..
6 ..
7 ..
8 ..
9 ..

Turn = 48.
  01
0 ..
1 ..
2 .t
3 ..
4 ..
5 ..
6 ..
7 ..
8 ..
9 ..
0 ..
1 ..
2 ..
3 ..
4 ..
5 ..
6 ..
7 ..
8 ..
9 ..

Turn = 51.
  01
0 ..
1 ..
2 .t
3 ..
4 ..
5 ..
6 ..
7 ..
8 ..
9 ..
0 ..
1 ..
2 ..
3 ..
4 ..
5 ..
6 ..
7 ..
8 ..
9 ..

Turn = 54.
  01
0 ..
1 ..
2 .t
3 ..
4 ..
5 ..
6 ..
7 ..
8 ..
9 ..
0 ..
1 ..
2 ..
3 ..
4 ..
5 ..
6 ..
7 ..
8 ..
9 ..

Turn = 57.
  01
0 ..
1 ..
2 .t
3 ..
4 ..
5 ..
6 ..
7 ..
8 ..
9 ..
0 ..
1 ..
2 ..
3 ..
4 ..
5 ..
6 ..
7 ..
8 ..
9 ..

Turn = 60.
  01
0 ..
1 ..
2 .t
3 ..
4 ..
5 ..
6 ..
7 ..
8 ..
9 ..
0 ..
1 ..
2 ..
3 ..
4 ..
5 ..
6 ..
7 ..
8 ..
9 ..

Turn = 63.
  01
0 ..
1 ..
2 .t
3 ..
4 ..
5 ..
6 ..
7 ..
8 ..
9 ..
0 ..
1 ..
2 ..
3 ..
4 ..
5 ..
6 ..
7 ..
8 ..
9 ..

Turn = 66.
  01
0 ..
1 ..
2 .t
3 ..
4 ..
5 ..
6 ..
7 ..
8 ..
9 ..
0 ..
1 ..
2 ..
3 ..
4 ..
5 ..
6 ..
7 ..
8 ..
9 ..

Turn = 69.
  01
0 ..
1 ..
2 .t
3 ..
4 ..
5 ..
6 ..
7 ..
8 ..
9 ..
0 ..
1 ..
2 ..
3 ..
4 ..
5 ..
6 ..
7 ..
8 ..
9 ..

Turn = 72.
  01
0 ..
1 ..
2 .t
3 ..
4 ..
5 ..
6 ..
7 ..
8 ..
9 ..
0 ..
1 ..
2 ..
3 ..
4 ..
5 ..
6 ..
7 ..
8 ..
9 ..

*** Darwin 6x12 ***
Turn = 0.
  012345678901
0 ....h.......
1 .......t..r.
2 ............
3 ............
4 ............
5 ..f..f.t....

Turn = 5.
  012345678901
0 .........h.r
1 .......t....
2 ............
3 ............
4 ............
5 ..f..f.t....

Turn = 10.
  012345678901
0 ...........h
1 .......t....
2 ............
3 ............
4 ...........r
5 ..f..f.t....

Turn = 15.
  012345678901
0 ...........h
1 .......t....
2 ............
3 ............
4 ............
5 ..f..f.tr...

Turn = 20.
  012345678901
0 ...........h
1 .......t....
2 ............
3 ............
4 ............
5 ..f..f.rr...

Turn = 25.
  012345678901
0 ...........h
1 .......t....
2 .....r......
3 ............
4 ............
5 ..fr.......r

*** Darwin 16x14 ***
Turn = 0.
  01234567890123
0 ..............
1 ..............
2 ....r.........
3 ..............
4 ..............
5 ..............
6 ..............
7 ..............
8 ..............
9 ..............
0 ..............
1 ..............
2 ..............
3 ..............
4 ..............
5 ..............

Turn = 5.
  01234567890123
0 ......r.......
1 ..............
2 ..............
3 ..............
4 ..............
5 ..............
6 ..............
7 ..............
8 ..............
9 ..............
0 ..............
1 ..............
2 ..............
3 ..............
4 ..............
5 ..............

Turn = 10.
  01234567890123
0 ...........r..
1 ..............
2 ..............
3 ..............
4 ..............
5 ..............
6 ..............
7 ..............
8 ..............
9 ..............
0 ..............
1 ..............
2 ..............
3 ..............
4 ..............
5 ..............

Turn = 15.
  01234567890123
0 .............r
1 ..............
2 ..............
3 ..............
4 ..............
5 ..............
6 ..............
7 ..............
8 ..............
9 ..............
0 ..............
1 ..............
2 ..............
3 ..............
4 ..............
5 ..............

Turn = 20.
  01234567890123
0 ..............
1 ..............
2 ..............
3 ..............
4 ..............
5 .............r
6 ..............
7 ..............
8 ..............
9 ..............
0 ..............
1 ..............
2 ..............
3 ..............
4 ..............
5 ..............

Turn = 25.
  01234567890123
0 ..............
1 ..............
2 ..............
3 ..............
4 ..............
5 ..............
6 ..............
7 ..............
8 ..............
9 ..............
0 .............r
1 ..............
2 ..............
3 ..............
4 ..............
5 ..............

Turn = 30.
  01234567890123
0 ..............
1 ..............
2 ..............
3 ..............
4 ..............
5 ..............
6 ..............
7 ..............
8 ..............
9 ..............
0 ..............
1 ..............
2 ..............
3 ..............
4 ..............
5 .............r

Turn = 35.
  01234567890123
0 ..............
1 ..............
2 ..............
3 ..............
4 ..............
5 ..............
6 ..............
7 ..............
8 ..............
9 ..............
0 ..............
1 ..............
2 ..............
3 ..............
4 ..............
5 .........r....

Turn = 40.
  01234567890123
0 ..............
1 ..............
2 ..............
3 ..............
4 ..............
5 ..............
6 ..............
7 ..............
8 ..............
9 ..............
0 ..............
1 ..............
2 ..............
3 ..............
4 ..............
5 ....r.........

Turn = 45.
  01234567890123
0 ..............
1 ..............
2 ..............
3 ..............
4 ..............
5 ..............
6 ..............
7 ..............
8 ..............
9 ..............
0 ..............
1 ..............
2 ..............
3 ..............
4 ..............
5 r.............

Turn = 50.
  01234567890123
0 ..............
1 ..............
2 ..............
3 ..............
4 ..............
5 ..............
6 ..............
7 ..............
8 ..............
9 ..............
0 r.............
1 ..............
2 ..............
3 ..............
4 ..............
5 ..............

Turn = 55.
  01234567890123
0 ..............
1 ..............
2 ..............
3 ..............
4 ..............
5 r.............
6 ..............
7 ..............
8 ..............
9 ..............
0 ..............
1 ..............
2 ..............
3 ..............
4 ..............
5 ..............

Turn = 60.
  01234567890123
0 r.............
1 ..............
2 ..............
3 ..............
4 ..............
5 ..............
6 ..............
7 ..............
8 ..............
9 ..............
0 ..............
1 ..............
2 ..............
3 ..............
4 ..............
5 ..............

Turn = 65.
  01234567890123
0 ..............
1 ..............
2 ..............
3 r.............
4 ..............
5 ..............
6 ..............
7 ..............
8 ..............
9 ..............
0 ..............
1 ..............
2 ..............
3 ..............
4 ..............
5 ..............
