21

14 3
8
t 11 1 e
h 4 2 n
h 1 2 w
h 2 1 s
t 2 0 w
r 1 1 w
t 11 2 w
f 4 0 w
1966 34

14 18
10
r 5 7 n
r 13 2 e
t 1 10 e
t 3 10 w
t 8 5 e
f 2 4 s
t 9 16 w
t 0 0 n
r 13 5 n
t 7 8 e
763 168

5 15
8
f 3 13 e
f 4 14 n
f 1 12 n
h 3 6 s
t 2 1 w
f 1 5 s
h 4 2 e
f 1 13 s
318 32

20 1
8
f 13 0 n
t 9 0 s
t 18 0 n
f 19 0 s
t 12 0 e
h 9 0 w
t 4 0 w
h 4 0 w
541 123

16 18
4
t 11 0 s
t 0 8 s
t 15 15 w
t 2 4 e
1392 45

8 15
6
h 5 14 e
t 2 9 n
h 1 7 w
t 0 10 e
r 0 10 w
f 4 12 s
418 7

17 7
4
r 16 2 e
h 0 6 s
h 10 3 e
f 7 0 s
1902 136

11 2
3
f 5 1 e
t 3 1 e
t 10 1 s
62 78

12 2
4
h 0 1 n
h 6 1 e
t 8 0 n
f 4 1 e
1936 81

14 9
8
r 11 2 w
f 4 0 e
r 12 2 e
f 4 8 n
f 7 0 w
t 5 4 e
h 2 5 w
t 3 3 s
1280 53

10 20
2
h 2 9 s
r 7 3 s
538 17

10 15
5
f 9 11 n
f 5 12 e
r 4 3 s
t 2 1 s
f 3 14 n
1981 154

15 17
8
h 12 6 s
t 4 13 s
r 13 16 s
t 13 8 s
h 10 8 e
f 8 9 s
t 12 2 s
f 6 4 e
1498 167

14 10
7
f 4 0 n
h 0 3 w
h 4 3 w
r 1 4 s
t 9 6 s
h 10 4 w
t 0 2 w
1125 72

20 1
7
t 9 0 w
r 16 0 n
f 0 0 e
t 18 0 w
h 6 0 w
t 11 0 n
h 2 0 w
1868 143

3 14
10
t 2 8 e
h 1 3 s
r 2 1 w
r 0 13 n
t 0 2 e
f 1 10 e
t 1 10 n
t 1 0 s
t 1 10 s
r 0 6 s
1031 176

12 20
7
t 1 16 s
t 10 19 w
r 1 12 w
h 11 17 e
t 3 2 s
h 7 4 e
t 3 11 w
1414 37

6 1
10
f 0 0 w
t 4 0 e
f 0 0 n
t 1 0 n
r 5 0 s
f 2 0 e
f 1 0 e
t 5 0 s
f 2 0 e
t 5 0 n
1382 65

2 2
9
h 1 0 n
h 0 0 w
h 1 0 s
h 1 0 e
h 0 0 e
h 1 1 w
f 0 0 e
f 1 0 w
t 0 0 s
370 49

17 7
4
h 8 5 s
h 8 3 e
t 14 3 n
t 11 1 n
1388 168

20 14
7
t 8 13 s
h 14 13 w
f 13 5 e
t 18 0 e
t 7 11 s
t 10 8 n
t 18 5 n
406 184
