23

18 14
7
h 3 11 w
r 4 7 e
t 12 11 n
t 10 6 e
f 11 12 s
f 13 11 n
f 6 4 w
27 7

2 7
1
h 1 6 w
35 2

14 8
1
h 4 1 n
36 1

17 19
9
h 1 14 w
f 4 12 n
f 2 7 e
f 13 12 n
t 14 9 w
r 6 7 s
h 4 8 e
r 2 16 e
h 4 2 e
3 4

14 1
8
t 8 0 n
f 5 0 e
h 7 0 s
f 7 0 n
t 0 0 w
t 13 0 n
t 8 0 s
f 8 0 e
11 7

5 2
6
f 3 1 n
r 2 0 n
h 1 1 w
f 2 1 e
t 4 0 s
f 2 0 n
40 4

10 5
8
f 5 1 s
r 8 0 e
r 2 0 e
r 7 3 s
h 3 3 w
f 1 4 s
r 8 2 n
t 9 4 n
17 9

13 11
8
f 11 8 e
h 10 6 w
f 11 1 w
f 3 3 n
f 8 4 n
r 0 8 n
r 12 5 w
f 6 2 w
58 8

2 5
4
r 1 1 e
f 0 1 w
h 0 0 e
f 1 2 n
99 5

18 18
1
r 13 7 s
63 2

5 1
5
h 4 0 n
t 1 0 w
r 2 0 w
t 2 0 s
t 0 0 s
42 9

10 20
7
f 3 12 n
h 7 10 n
r 8 19 w
r 6 19 s
f 8 10 n
t 4 4 s
f 3 1 e
41 6

8 7
10
h 1 3 e
h 6 1 s
t 6 5 e
h 4 1 n
r 6 0 s
r 2 4 n
f 0 6 n
h 4 2 e
h 2 5 w
t 7 0 s
54 10

17 6
8
f 13 5 s
t 3 3 s
h 2 4 s
h 13 1 n
h 10 5 s
f 5 5 w
r 11 5 s
f 0 0 w
87 3

13 5
6
h 12 4 n
f 10 0 e
t 9 2 s
t 0 1 e
t 10 1 s
t 6 3 e
62 2

1 4
1
h 0 0 s
34 6

7 8
7
f 3 5 e
h 6 5 s
t 0 0 n
t 3 6 e
r 6 1 e
t 5 3 n
h 5 1 e
13 3

2 10
6
t 0 9 s
h 0 0 s
h 1 2 s
h 0 7 e
r 0 3 e
f 1 8 e
19 7

1 1
9
r 0 0 w
r 0 0 w
r 0 0 n
t 0 0 e
r 0 0 s
r 0 0 e
r 0 0 s
h 0 0 s
t 0 0 w
49 2

15 14
6
f 12 13 w
f 5 3 w
r 5 1 n
r 1 3 e
r 2 3 e
f 12 0 e
79 8

20 2
1
t 2 1 n
72 3

6 12
6
r 1 10 n
t 1 7 n
t 5 7 e
h 0 4 e
f 5 2 e
f 5 5 s
27 5

16 14
1
r 2 4 n
66 5
