24

3 9
3
r 1 4 e
f 0 1 n
h 2 5 n
690 4

5 1
3
f 2 0 e
t 0 0 e
h 4 0 s
1676 104

17 10
18
r 0 4 w
f 2 3 w
h 3 9 n
h 1 5 w
r 2 8 s
h 7 7 n
r 13 8 n
h 15 2 w
r 4 4 w
f 12 2 s
t 6 1 e
r 2 0 e
f 0 8 n
r 8 1 s
f 3 2 s
h 14 4 s
f 13 2 e
h 12 1 w
1939 52

3 16
1
r 1 2 s
147 162

3 10
1
r 0 4 w
1551 81

4 2
8
f 1 1 e
r 3 0 n
f 0 0 w
r 0 1 s
t 2 0 s
r 0 0 n
f 1 0 s
t 1 0 s
1435 73

10 11
13
f 5 6 e
r 8 2 e
t 5 7 s
t 7 9 w
h 9 5 w
f 1 10 w
r 8 6 s
f 5 6 w
f 7 0 n
t 6 5 n
f 2 1 s
r 9 4 e
t 7 0 w
1455 65

9 20
9
f 6 15 n
t 3 10 e
r 2 17 w
f 4 8 n
r 6 5 n
h 3 13 w
f 8 1 w
r 5 8 w
f 2 16 e
869 95

7 4
8
t 2 3 s
t 3 0 w
f 0 2 s
f 0 1 s
f 4 0 w
h 0 2 w
t 2 3 e
f 2 2 s
998 181

19 19
5
t 7 11 n
r 6 10 e
h 17 10 n
r 17 9 s
r 14 15 w
794 168

6 19
18
t 4 18 e
t 4 18 e
h 1 4 e
h 2 4 e
h 0 11 w
f 1 16 s
f 5 4 n
t 4 2 w
t 5 18 n
t 3 16 n
f 2 10 n
f 2 7 n
f 0 12 e
r 4 11 s
t 5 4 e
t 0 18 w
h 4 10 e
f 3 18 s
1014 170

12 5
8
f 4 2 n
r 9 1 w
t 0 0 e
r 11 2 e
r 6 3 e
t 10 1 n
t 1 3 w
t 6 3 n
243 86

17 1
5
r 4 0 e
f 9 0 s
r 16 0 w
t 11 0 n
f 14 0 e
666 7

7 8
3
t 0 5 s
f 4 1 w
h 3 6 e
818 159

5 9
6
r 1 4 n
t 4 3 e
r 4 6 w
f 4 5 w
f 1 8 w
f 1 4 n
622 61

2 19
9
h 1 16 s
h 1 11 e
r 1 15 w
t 1 2 s
t 1 8 s
h 0 13 s
h 0 5 s
h 1 12 n
f 0 13 w
1085 99

1 1
5
f 0 0 n
t 0 0 n
h 0 0 s
h 0 0 w
t 0 0 w
283 77

6 12
17
t 1 11 w
r 0 4 n
t 5 6 s
r 0 7 n
t 1 1 e
r 0 5 s
r 2 8 w
r 1 4 n
r 3 6 s
h 5 4 e
h 0 6 w
t 2 7 e
r 3 8 e
h 0 0 w
t 5 6 s
f 3 3 s
t 4 10 e
1102 137

12 16
14
r 4 1 w
r 0 13 s
r 4 10 e
t 1 8 n
r 5 5 e
t 0 11 n
t 6 12 n
r 9 2 s
f 11 1 e
f 7 8 s
t 3 14 e
h 9 15 s
h 1 12 e
t 8 11 n
1511 162

18 10
12
h 9 8 s
f 8 8 w
r 8 6 s
r 13 2 n
r 7 8 s
f 17 2 s
h 5 1 n
f 0 3 w
r 17 0 n
h 6 1 e
t 9 5 n
f 17 7 e
918 66

16 4
2
t 15 0 w
t 3 3 w
1008 25

6 7
10
r 1 1 n
t 3 5 w
t 1 0 w
f 1 5 n
h 5 6 w
h 1 4 e
r 2 6 n
r 1 5 w
r 1 3 s
t 2 3 e
384 152

5 10
4
f 1 3 s
r 0 9 w
f 3 5 w
f 1 5 w
1647 74

9 9
2
f 5 3 s
t 5 5 e
298 191
