22

1 8
9
h 0 4 s
t 0 4 n
r 0 2 s
r 0 5 s
t 0 7 w
f 0 6 e
t 0 5 s
t 0 1 w
h 0 4 w
23 3

5 9
6
t 0 1 s
f 4 2 n
r 0 7 w
t 3 4 n
f 0 5 s
h 1 1 n
22 2

9 10
10
r 3 3 s
t 0 2 e
f 0 9 n
h 3 4 n
f 1 7 n
f 0 4 w
r 7 5 s
h 3 9 s
h 0 2 e
t 5 8 s
22 4

10 7
4
t 1 3 w
f 3 5 n
r 2 5 n
h 6 3 w
23 5

8 2
8
t 1 1 s
r 3 1 s
t 0 1 s
r 3 0 e
t 1 0 n
r 2 0 e
r 0 1 w
t 5 0 w
21 2

3 8
2
r 1 0 n
f 0 4 w
23 1

4 5
1
h 1 2 n
22 2

5 2
2
h 2 1 n
h 3 1 s
23 1

5 7
6
t 3 0 s
r 4 5 n
f 3 1 e
t 4 6 w
h 3 0 n
h 3 0 n
21 3

9 8
1
r 4 1 w
21 3

3 2
3
f 0 0 e
t 1 0 n
t 2 0 w
23 2

9 9
8
r 7 3 w
f 8 7 n
r 2 1 w
r 8 8 w
f 0 3 n
r 8 5 n
t 1 4 n
r 4 6 n
23 2

4 1
4
r 0 0 s
h 1 0 s
f 2 0 s
h 3 0 e
24 3

6 3
6
t 5 0 w
r 1 0 e
f 5 2 e
h 5 0 e
f 4 0 n
r 2 0 e
20 5

6 10
4
h 3 7 n
f 1 4 n
r 0 5 n
h 2 4 n
23 1

8 7
7
f 0 4 n
r 1 2 w
f 2 1 w
r 3 1 s
f 6 5 s
r 1 2 w
h 5 2 e
23 5

6 10
9
r 3 0 w
f 2 9 n
t 2 2 n
f 0 1 n
r 5 3 w
f 5 0 w
f 1 2 s
r 5 3 n
t 4 5 w
21 5

10 3
3
h 7 0 s
h 6 0 s
f 4 2 n
23 1

10 8
10
r 5 7 w
h 1 2 n
t 7 7 e
r 5 5 e
f 8 7 s
r 2 4 s
h 0 5 e
t 3 1 n
h 1 3 w
f 8 3 n
20 2

4 2
5
f 3 1 n
t 0 0 w
h 1 0 n
h 2 1 w
t 3 1 w
20 4

2 4
3
t 0 1 s
h 0 3 w
f 0 1 s
21 4

10 4
1
t 1 1 s
20 2
