23

5 3
6
f 0 1 w
f 4 2 s
f 0 0 n
h 1 2 n
f 1 1 s
h 4 0 s
18 2

4 4
6
r 2 1 e
r 2 1 e
f 2 0 e
r 2 1 e
h 2 1 n
t 3 3 s
16 1

3 2
4
f 0 1 s
h 1 0 n
t 2 1 w
h 2 0 e
19 2

3 4
7
h 0 1 e
t 0 2 e
t 1 0 e
h 1 2 n
h 1 3 e
h 2 2 e
r 0 2 n
16 1

3 3
6
t 0 1 w
h 0 2 n
f 2 1 s
f 1 0 s
r 1 0 w
f 0 2 n
15 1

5 6
5
t 3 3 s
r 0 4 e
f 3 3 n
r 1 4 e
h 3 3 n
18 2

6 3
5
f 0 2 e
t 4 1 n
f 5 1 s
r 1 0 n
h 3 0 w
15 3

5 5
6
f 2 4 n
f 4 1 e
h 4 2 n
f 2 2 s
t 4 4 s
h 0 4 n
15 1

4 3
4
r 1 0 e
f 3 2 w
f 2 1 n
r 3 1 n
20 1

4 6
7
t 0 0 s
h 0 1 s
t 0 0 n
r 3 4 w
h 3 1 w
f 3 4 s
f 1 1 n
16 3

2 5
4
f 0 0 w
f 0 2 e
f 1 1 e
f 1 0 e
19 3

5 4
8
h 4 1 s
t 1 1 n
h 3 2 n
r 0 3 w
f 1 1 w
f 2 2 e
h 1 1 s
h 1 2 e
20 2

5 3
7
h 1 2 n
h 3 0 w
r 0 0 w
r 0 0 e
t 4 1 s
f 0 1 e
f 0 1 s
15 3

3 4
6
r 2 2 w
t 2 2 n
f 2 3 w
r 0 1 w
f 1 2 n
r 2 1 s
16 2

2 6
5
f 0 0 s
r 0 4 s
r 0 3 e
r 1 0 w
r 1 3 n
19 2

2 3
4
h 0 1 n
r 1 0 n
f 1 0 w
r 0 2 n
15 3

2 4
4
h 0 2 e
h 0 3 w
f 1 2 w
f 1 2 e
15 3

2 5
8
t 0 3 s
f 1 1 w
f 1 0 n
h 0 0 w
f 0 4 w
t 0 3 e
r 1 0 e
r 1 0 e
15 1

6 3
7
r 2 1 e
t 3 0 n
r 3 1 n
r 0 2 n
f 2 2 s
h 4 2 w
h 3 2 w
15 3

2 6
5
f 0 1 s
h 0 1 w
r 1 4 n
t 1 5 e
r 1 4 e
19 2

2 2
5
f 0 1 w
r 1 0 s
t 1 1 e
t 0 0 e
f 0 1 w
19 1

3 5
6
r 2 1 n
r 1 1 s
r 2 2 e
f 2 4 e
r 2 4 s
r 2 2 e
18 2

4 3
7
t 1 1 s
r 3 1 e
t 3 1 n
t 2 2 n
r 2 1 s
h 1 0 s
t 2 2 s
19 1
