155846 883514
890314 748597
380775 619509
874683 935562
539607 554070
673704 199701
37362 315374
608562 350578
649902 139904
754071 185003
234747 698518
710200 855413
663723 172821
308730 823432
939360 412513
154078 309181
511997 409454
336790 888475
656311 220950
223677 735991
886170 341502
346485 466119
430951 754219
700605 864448
30063 440888
504988 460291
18327 693306
961975 334188
428303 133979
547254 37234
33710 316958
855732 447740
729185 774992
96978 127156
460895 804303
435354 321217
235297 52981
986511 834036
539928 746916
676732 914672
127750 106294
209159 411307
797222 940230
110620 270427
89948 803093
7949 980617
559799 2322
367078 535737
273913 366235
610097 252309
373128 762517
633579 658849
388351 384406
875278 686165
989080 178845
990996 677075
168011 655778
656411 496121
418110 255569
470703 561571
813994 249863
440847 247471
64860 382483
942970 927642
757590 678814
632476 38531
229988 792218
365409 143712
397037 34738
642393 892672
76555 694897
674603 631830
776937 939302
4994 666136
281410 770540
722019 260892
653374 133440
315434 883434
452035 688466
981996 598207
133815 878800
387912 91067
138528 429398
331330 346792
137374 992059
401733 438876
419117 575388
296556 213752
615633 495527
835979 437182
129284 387811
705630 252302
233271 217835
264199 671547
880444 959192
687650 444398
725462 36846
511492 533852
866787 414112
828863 53517
437704 702807
528428 661658
673523 535681
957232 263767
542948 509367
669032 944287
98637 523295
671267 922579
89687 148849
256279 898674
513652 877007
670265 207542
398500 40195
399940 56674
416081 455473
162784 872244
218096 642749
542958 657067
51724 370346
420526 831570
512452 820127
699287 784988
893090 442938
134956 563426
541035 163290
795007 79072
896727 475978
811348 653646
21466 764637
681257 749046
113915 732502
14891 677374
463005 175119
789314 781212
919461 558030
303114 376173
126761 391766
362348 717606
451450 478559
900692 145629
966212 912138
406182 459306
862007 796514
257967 453650
339220 479404
231885 343537
427399 816900
265925 630221
814491 597618
392973 735302
703513 901117
218849 586982
545384 714059
325329 859392
575966 653647
328457 711706
667839 379561
358842 389604
887794 313464
751633 26264
127462 498940
963384 661837
565718 919625
81909 909484
840704 443373
922490 584440
597995 428745
498406 609957
774001 352124
200226 470499
426794 722491
292392 241329
152655 828749
344231 734032
968621 431948
598432 228763
925482 747460
46675 153239
936324 819436
40719 688731
801563 976053
282900 587496
399989 341643
242815 669025
494324 282686
610733 634638
921692 977385
560428 757125
577668 294014
747601 392811
651497 502698
625307 226691
811278 485481
986271 357287
409208 335214
504633 710277
645742 845594
453787 429026
724124 24128
210629 817312
997864 31219
892103 553468
503681 403892
168902 957609
268978 817713
610910 295898
986423 365353
561786 724799
443421 728937
577485 723789
971771 335503
