69268 905933 525
958612 108267 525
350052 519257 470
960782 128962 525
851553 57962 525
93825 972 351
37972 222681 386
809040 246709 509
754093 19786 509
691025 490692 509
923882 154387 525
555285 409673 470
892830 561838 525
933569 309365 525
508383 897359 525
813391 915218 525
229247 495033 449
246387 395938 441
486537 693880 509
359714 389514 436
650181 956183 525
166686 134672 383
955710 710135 525
690438 250613 509
402480 205172 443
272063 271996 208
884299 962431 507
201344 657091 509
562709 408502 470
81755 778665 509
69508 148545 375
204963 329584 443
216151 426650 449
69873 296031 443
887597 535894 525
480186 846641 525
367258 722180 509
785974 316355 509
66849 605567 470
896392 684206 525
792207 655793 504
414801 416286 312
401224 14575 443
354723 679957 509
153895 578074 470
980069 384730 525
342182 114640 443
2500 709018 509
9725 924473 525
766057 473073 509
854143 226018 525
610634 882600 525
653620 522643 509
106408 518725 470
574009 179080 470
343387 907105 525
801041 481628 509
773625 521154 509
970129 883385 507
697508 736570 504
4614 820231 509
921134 804095 525
234879 101689 443
451125 443336 387
721381 166837 509
29469 608816 470
746118 621549 509
128841 554458 470
950703 447660 525
733738 424262 509
710016 308331 509
907866 806868 525
919294 393449 525
819707 957483 525
963963 122683 525
225542 924153 525
264710 574704 470
4051 67361 340
576145 339235 470
944500 688474 525
473201 432377 444
222436 608665 470
500911 499854 364
784313 329619 509
170453 868680 525
999094 28126 525
910804 657390 525
694391 49424 509
153523 924315 525
24672 737470 509
294046 445619 449
291497 48921 443
29483 408446 443
939746 468963 525
206608 527381 470
619265 705623 509
196055 632885 509
193124 903583 525
610709 385204 470
198020 214162 373
637867 548210 509
93202 173378 383
614893 299979 470
178538 729894 509
696831 197805 509
687384 124382 509
45246 642216 509
336095 22391 443
123868 882606 525
493755 706232 509
174173 966109 525
394787 128754 443
659816 531596 509
835826 99408 509
192496 327872 443
412992 140328 449
196745 872180 525
692395 912033 525
952009 408697 525
570646 368334 470
585388 5898 470
299177 124966 443
480421 454376 444
429531 75210 449
676364 710499 504
872858 594438 525
518595 895315 525
637888 653150 416
172538 617366 470
68090 102578 351
794303 704278 504
68635 308449 443
779606 811245 468
812774 913872 525
428790 667184 509
161713 749794 509
570970 444498 470
198583 91746 383
676780 314307 509
395006 596070 470
864903 775814 525
987725 804834 525
796592 303057 509
273628 193151 443
352888 677156 509
751020 353345 509
971723 454174 525
511477 744655 509
68427 553211 470
291543 138821 443
908272 191378 525
132728 74071 354
350367 185001 443
797519 31328 509
302979 165981 443
142391 676017 509
667805 974643 525
436081 118907 449
458506 751885 509
705142 600333 509
504148 183460 449
838269 743825 525
398016 434609 449
545350 372705 470
949520 693960 525
22211 958359 525
954060 975531 458
649700 977704 525
27361 675473 509
491300 288685 449
908970 659807 525
672619 68808 509
352758 443360 449
479438 246920 449
477242 405261 449
694177 50664 509
768496 933885 525
241316 433070 449
580119 391788 470
959964 316522 525
90036 906478 525
350382 836614 509
699901 938039 525
404781 873532 525
241803 347768 441
431472 957157 525
669407 313084 509
130265 838125 525
98727 823675 509
319131 567078 470
356628 592176 470
924500 117161 525
427702 808043 509
385127 700416 509
943197 615592 525
125546 710707 509
751006 153577 509
295136 268969 407
602908 329693 470
387296 992825 525
604903 908805 525
634269 640663 416
809136 713064 468
928050 405696 525
667153 558170 509
695270 915634 525
