891940 697805 525
862359 234376 525
26367 606307 470
995151 801575 525
825345 605847 509
506365 974326 525
986413 61873 525
226434 430525 449
898085 535727 525
333755 509408 449
263446 122120 443
92052 532178 470
53963 597662 470
199878 29184 383
41778 991807 525
548208 753765 509
910217 675320 525
571173 539622 452
229600 607783 470
104989 669944 509
412648 256099 449
925125 480212 525
336588 793016 509
455132 917752 525
162597 38649 383
199021 842943 525
427801 397838 449
547151 109332 470
847244 682474 525
446186 9685 449
480471 426243 444
99454 409506 443
18444 890917 525
2965 781477 509
220511 722978 509
169775 599267 470
728733 225107 509
233114 311148 407
447073 280849 449
249274 774588 509
411694 49639 449
852165 759129 525
517221 109272 470
333911 934335 525
997160 111519 525
631843 725683 504
96347 468257 449
508349 326658 449
2218 187396 383
837082 160516 509
861679 160578 525
360031 111738 443
824023 737413 468
905382 459751 525
508739 774342 509
439865 682239 509
380912 687702 509
910123 61571 525
167514 870883 525
434481 544219 470
404289 861418 525
684065 807330 504
737384 660131 504
624796 734424 509
962545 547597 525
507634 29136 449
552078 830906 509
518955 418384 470
557831 171471 470
104633 124032 354
94774 24513 351
455041 875854 525
118314 307239 443
598263 13126 470
375103 973669 525
451808 532510 470
155467 798452 509
443051 590492 470
339112 844688 525
674664 304540 509
919728 662910 525
733423 979969 525
701064 582416 509
218762 738856 509
566200 781544 509
756133 440666 509
552912 965321 525
45952 658423 509
324941 430490 449
360795 841684 525
555753 664437 509
246370 203597 443
298167 235028 407
344671 81789 443
769518 909621 525
221482 182934 386
300930 151651 443
994034 60223 525
951328 282890 525
684852 140321 509
17948 943380 525
425764 812403 509
863824 425672 525
119461 28125 354
601595 137060 470
844999 902536 445
3427 821888 509
573860 507441 470
212618 929322 525
833914 840235 525
865091 693511 525
176997 598228 470
416384 276403 449
418452 329986 449
672858 311673 509
36470 679523 509
958595 94745 525
383625 890104 525
741613 306225 509
163530 428717 449
483351 923624 525
967536 161917 525
465080 441275 444
492537 735854 509
120532 480440 449
986064 761157 525
732717 118007 509
294847 563370 470
558657 443812 470
821161 343143 509
667704 176658 509
710977 782580 468
426517 244673 449
730693 862125 525
591690 269283 470
684825 989564 525
846906 589916 525
367391 214899 443
743900 562824 509
250120 561027 470
762823 47038 509
911175 770099 525
766391 767683 318
419481 18266 449
343430 774642 509
146115 107161 375
835524 307095 509
56707 435044 449
304514 541616 470
750839 269421 509
350614 847604 525
559586 80053 470
531344 949266 525
690888 801254 504
503844 13911 449
593586 25575 470
81954 845082 525
872022 713210 525
836916 818275 450
154368 670002 509
954892 493533 525
711641 787073 468
889915 774201 525
766400 719016 424
509118 994749 525
609439 320766 470
942093 300968 525
512738 528336 439
940895 43726 525
812451 917119 525
376860 316447 441
813969 233093 509
748421 707961 424
229214 612881 470
262435 514381 470
738828 71468 509
914485 49903 525
34592 937963 525
499203 855890 525
341352 536628 470
399893 430638 449
335133 508678 449
102643 741581 509
576932 663822 509
417769 897852 525
110193 12550 354
417599 419001 343
572451 484120 470
879057 676789 525
81519 565866 470
856896 631421 525
459535 445460 387
838365 71355 525
508999 301670 449
290922 874793 525
935459 159889 525
428059 49281 449
504720 234897 449
317455 150506 443
370669 467456 449
