459153 214156 449
552814 148601 470
70737 153123 375
764356 362518 509
113273 650445 509
218889 503382 449
928951 389119 525
898711 614588 525
862073 722298 525
49200 257633 443
816270 866226 525
256867 737454 509
35290 504047 449
190110 546847 470
113638 628680 509
809 169070 383
9923 373034 443
258426 83337 443
406060 274382 441
433632 424640 387
758063 711098 424
55291 752982 509
364675 577438 470
392553 196320 443
355394 276426 441
838969 906192 445
616555 642877 509
670303 424704 509
493991 64081 449
592012 85263 470
605364 362448 470
475276 822150 509
725737 869364 525
338268 680633 509
478114 38425 449
426876 683946 509
811310 811676 251
224792 596666 470
127895 933845 525
303496 141256 443
509209 555605 470
315971 306738 384
468423 119464 449
345412 679546 509
570253 975245 525
404748 849104 525
515305 279760 470
518604 573482 452
177661 89744 383
876538 969076 507
904829 358223 525
828928 468428 509
114670 297457 443
560931 70904 470
760289 785101 468
751882 664707 504
555224 707423 509
466034 345957 449
308447 480546 449
90917 665752 509
118585 147363 375
467520 673202 509
90669 265920 443
113567 908627 525
841608 234515 525
853122 553587 525
431346 357178 449
257523 694466 509
443107 23483 449
198446 748500 509
310930 720744 509
730469 207015 509
171392 91838 383
238617 358689 441
904503 543088 525
527232 467475 470
529333 717647 509
664757 505278 509
334273 264234 407
207495 972227 525
862203 240845 525
767081 860052 525
405881 538945 470
624977 265130 470
222797 634434 509
798247 677594 504
73260 844160 525
841406 750723 525
335588 706854 509
705915 162938 509
505355 570038 470
449745 259771 449
720837 321375 509
193103 268564 443
59780 920853 525
699706 349487 509
212303 536974 470
184758 585722 470
158297 254430 443
531543 657147 509
431226 984103 525
137629 754540 509
135471 149320 375
693261 823691 504
740163 47173 509
351570 878184 525
376350 867802 525
476685 107059 449
488563 29505 449
993602 261666 525
361075 407818 436
965650 617790 525
444726 262514 449
4247 31964 308
632111 544550 509
416285 963458 525
667358 430090 509
264280 584362 470
219678 37799 386
731047 872789 525
195325 182694 360
160274 974798 525
381494 791252 509
829311 309906 509
578023 715997 509
668611 500277 509
949437 800563 525
561572 129593 470
29974 887787 525
818718 346893 509
12209 153390 375
113338 2223 354
220973 993750 525
283105 674026 509
442694 631994 509
649373 642508 385
544305 860520 525
631712 849003 525
854623 392615 525
886927 871427 432
736001 997775 525
591411 664965 509
305588 669652 509
994374 78670 525
27977 163785 383
601485 151102 470
208883 59749 383
2711 765133 509
573892 795920 509
576810 776620 509
198034 928785 525
659173 56045 509
965332 550397 525
849634 76622 525
707039 616305 509
881977 303775 525
47952 455498 449
515105 807986 509
922516 248807 525
970434 241125 525
555014 470214 470
243517 756513 509
531666 561470 452
553222 232982 470
982441 720503 525
857199 419813 525
452579 27134 449
768373 899127 525
903302 955149 507
42729 446942 449
130165 438773 449
497038 986933 525
411732 264763 449
235258 968053 525
127856 157550 383
517777 262719 470
828106 88948 509
887605 805156 525
987451 664975 525
549398 457932 470
867773 192069 525
704665 398220 509
531351 652717 509
86600 346652 443
70156 610018 470
993542 740141 525
662506 444151 509
771705 45978 509
103702 523302 470
849324 869664 419
376334 734811 509
628990 788119 504
27632 330109 443
946505 215820 525
86760 699999 509
612115 701748 509
532843 352246 470
785348 292472 509
502312 708836 509
883003 696594 525
942639 309798 525
537054 762530 509
101525 55958 351
541994 138996 470
316868 195924 443
180943 481909 449
499829 951396 525
886124 983634 507
472037 986537 525
842153 392979 525
364966 259413 441
422563 907251 525
550136 617931 447
624182 461044 470
587892 934206 525
863151 882012 432
947242 470012 525
435274 313036 449
481454 982187 525
381168 631812 509
580790 784463 509
227465 627528 509
351550 250747 441
312663 392834 441
757394 641426 504
653851 549804 509
613968 698197 509
310083 482033 449
511510 609052 470
990201 878631 507
139312 347524 443
107566 93233 354
632789 185413 509
106327 870172 525
938476 539146 525
434962 951587 525
524750 614786 452
592451 380974 470
378396 867646 525
213846 233164 443
2440 949023 525
260290 51707 443
858145 431459 525
39985 933890 525
134924 358070 443
892481 354223 525
334487 375086 441
930254 294945 525
491844 42609 449
11785 554625 470
428080 187442 449
772821 839265 525
780865 66285 509
790812 422950 509
365973 835223 509
170866 650984 509
916479 326062 525
903941 383477 525
518144 540150 439
902033 708368 525
359363 273905 441
317044 586116 470
89218 600284 470
964633 744002 525
517373 443525 470
998880 576885 525
88172 293221 443
938621 568071 525
845378 141406 525
742688 129689 509
349843 949810 525
526025 893109 525
519691 15697 470
939728 460023 525
731315 52001 509
65781 502369 449
152943 192497 383
546369 8746 470
421593 391645 449
683808 914459 525
497785 59789 449
276722 5811 443
58693 89027 351
253073 938466 525
916403 537485 525
430839 499490 444
674448 233279 509
737282 977387 525
186709 831627 509
904181 357337 525
946551 225583 525
46750 630131 509
414326 241462 449
994458 873647 507
505052 779408 509
992925 525098 525
996499 557288 525
296364 823998 509
630700 432524 509
916695 172890 525
