277632 894902 525
885924 699334 525
837239 140376 509
980896 975217 383
263942 382642 441
527648 151239 470
997685 276826 525
450162 712203 509
480899 202083 449
469101 897094 525
863322 109286 525
976559 965984 458
593751 727702 509
529531 55460 470
569705 539053 452
608342 20076 470
95669 509714 449
622568 978592 525
956472 909906 507
603345 737174 509
24050 933342 525
514928 255387 470
948696 529675 525
268230 401421 441
320535 563526 470
527800 958171 525
402983 448495 449
325647 967012 525
52990 219559 386
4824 680755 509
710585 90976 509
170703 76023 383
30304 950243 525
983971 432059 525
847470 288160 525
778832 458070 509
347777 903164 525
519282 139616 470
120738 715454 509
654662 412935 509
654213 660943 429
134748 608314 470
523110 521436 333
669439 680191 385
686180 312225 509
411851 355506 449
675084 855850 525
302864 341259 384
97882 8949 351
969840 399049 525
195039 194051 342
820498 992806 525
487028 976339 525
840722 792713 525
270969 984628 525
86989 865616 525
290254 384523 441
874979 775617 525
994976 909876 507
370408 738602 509
777087 601886 509
659285 614624 509
986600 866262 507
200228 721655 509
217864 875773 525
166117 192781 365
92680 310031 443
52007 453941 449
812767 13591 509
76748 904081 525
227520 137697 386
71933 414598 449
786297 344848 509
204309 90499 383
336057 40828 443
603802 727709 509
259985 689151 509
978667 568072 525
766022 768749 468
341692 969224 525
408943 396172 405
505005 119075 449
689819 16532 509
991921 400440 525
485227 459297 444
620508 527220 452
362520 270723 441
134417 227663 386
452271 649287 509
482079 153578 449
443654 795409 509
92490 565335 470
424529 46407 449
157853 484507 449
162878 867468 525
617412 648917 509
171038 25953 383
595781 785393 509
779822 795639 437
364645 480612 449
725730 382998 509
949550 589295 525
307061 267825 407
211793 527304 470
2860 120758 354
507667 82977 449
720762 125610 509
324920 307423 384
467784 933725 525
754532 926376 525
682835 486613 509
487601 923967 525
743779 504614 509
63946 126563 354
151152 699257 509
743796 409489 509
250426 316036 407
612903 457020 470
564287 394483 470
284618 59246 443
228082 383796 443
182455 525474 470
743105 301414 509
794852 211325 509
372959 46098 443
816318 280155 509
278640 180363 443
270509 299179 389
569858 990499 525
479562 808438 509
700174 135813 509
765045 383697 509
183346 687689 509
268584 106057 443
921080 285559 525
391857 299788 441
123097 972479 525
304270 232733 407
733712 755831 424
171109 692393 509
986436 759330 525
96086 60171 351
30415 958816 525
839176 427342 525
271507 842757 525
638594 144312 509
138389 518984 470
343663 384443 441
774131 161131 509
784229 37777 509
419658 309312 449
623899 512894 452
609147 411764 470
10626 911352 525
36042 75347 340
663270 136354 509
450054 606527 470
517394 992313 525
730194 580806 509
299781 422248 449
908620 112314 525
659705 509254 509
700687 363833 509
352840 153923 443
106791 738258 509
727941 745258 424
877778 301114 525
602848 867599 525
411613 694733 509
177958 316041 443
34701 267404 443
912312 476940 525
516775 916278 525
920015 234606 525
896012 846432 445
738860 660612 504
172217 889341 525
765816 297729 509
766926 130530 509
839391 641324 525
779060 785956 375
336295 264498 407
434365 767094 509
105035 94237 341
489387 31460 449
144982 132180 375
104786 937551 525
532057 592490 452
503281 496512 426
757415 118871 509
836532 22643 509
848574 252177 525
685992 564816 509
887234 178891 525
179029 823554 509
922797 107232 525
116888 836748 509
569132 156403 470
956812 697899 525
292408 3664 443
135286 537797 470
116640 520951 470
542895 813695 509
56413 753431 509
50791 843027 525
971527 90899 525
969595 50118 525
675132 319125 509
638658 760644 504
170258 890217 525
962389 815547 525
127619 480139 449
556478 943002 525
315546 114264 443
895579 816111 525
149451 76844 375
301580 8230 443
701978 107316 509
963633 304783 525
141951 893014 525
44514 117094 354
518781 121654 470
923071 510141 525
843698 296494 525
434679 486455 444
731771 238818 509
686459 388952 509
34790 84442 351
756719 738155 424
173017 140595 383
313101 609147 470
804819 864040 525
794509 790341 437
851037 584575 525
84060 556880 470
534574 681080 509
584563 794344 509
62370 805161 509
667482 197882 509
87412 553537 470
833920 761131 468
477649 353210 449
