909120 650687 525
936006 777373 525
939765 283980 525
477466 2955 449
426721 614944 470
598360 125512 470
749667 152145 509
506235 721969 509
264768 916998 525
540461 817969 509
462182 408207 449
234827 933997 525
441213 998007 525
603327 67831 470
53737 305894 443
99269 247542 443
200155 93635 383
727761 315194 509
429351 140499 449
843359 307713 525
841690 498574 525
694943 873394 525
701573 509083 509
476707 822755 509
24372 468043 449
602435 305136 470
130458 858866 525
448681 603254 470
722260 12195 509
461653 607319 470
222843 894360 525
877056 438461 525
562374 575404 421
747938 536216 509
957641 801935 525
537879 612769 452
958468 465409 525
968756 630389 525
813877 100183 509
88544 412008 449
8602 679720 509
102096 88025 341
679946 570990 509
470431 471619 307
723828 424185 509
723353 228044 509
625194 679632 509
196489 595853 470
55313 151829 375
715300 732149 411
541643 962279 525
450077 379041 449
256671 675750 509
705220 586895 509
433268 997645 525
328598 879479 525
5270 175697 383
270325 66609 443
847879 746215 525
718854 920274 525
243798 520438 470
644117 419999 509
719574 682107 504
806899 949307 525
480110 766513 509
57746 942079 525
740717 468294 509
730572 993345 525
904985 6737 525
266949 369079 441
224024 734004 509
359021 388608 423
643421 992710 525
305593 185945 443
61538 761546 509
855952 106842 525
821962 890010 525
807468 672755 504
97584 150808 375
239180 939167 525
908921 410508 525
537949 413483 470
997771 137097 525
426883 409614 449
893810 614149 525
10684 85137 351
695671 450671 509
765530 82971 509
343659 960646 525
148997 968115 525
367888 299687 441
766981 236338 509
53737 52290 340
82184 559527 470
395567 964832 525
409 648295 509
567554 414348 470
823558 701727 504
700036 472310 509
409379 540366 470
410145 98583 449
612404 152462 470
886177 762029 525
188362 989989 525
235872 934099 525
497007 6319 449
19324 435894 449
684882 469533 509
91478 918854 525
541929 968889 525
55610 240552 443
551048 508188 470
501513 37718 449
953874 171987 525
547464 16207 470
767817 697971 504
956969 756525 525
756644 472414 509
615406 528817 452
390345 245844 441
79983 182679 383
993388 756523 525
917102 121331 525
785343 80281 509
523836 247679 470
564087 228273 470
442440 275042 449
318663 984802 525
372737 228138 443
250675 904816 525
261735 708755 509
860900 710461 525
432217 596289 470
400169 226470 443
875435 727011 525
228866 455735 449
484731 702062 509
665976 628258 442
260128 204582 443
726219 30403 509
401891 957145 525
529391 952145 525
101750 583308 470
512222 54785 470
864155 478128 525
61853 885335 525
54662 797072 509
295970 463242 449
245457 507332 449
354431 973420 525
540392 673332 509
853033 243656 525
202238 801738 509
199619 448163 449
139644 53392 354
766983 172653 509
270479 186664 443
37023 210085 383
440138 444311 356
39511 149576 375
502408 997 449
124369 852477 525
403440 306531 441
168646 454967 449
85904 818967 509
611382 693347 509
829359 38469 509
34740 213841 383
878380 875816 401
91078 645134 509
468021 443727 444
496606 543646 470
259378 880722 525
966333 734356 525
945608 552757 525
622223 486525 470
224956 665081 509
288107 118620 443
375562 191092 443
530344 778492 509
623017 922098 525
414202 875222 525
343299 751359 509
594499 894596 525
374877 672905 509
734035 155900 509
548480 620788 447
421699 958252 525
530950 620726 452
69852 262558 443
852748 421563 525
808530 283494 509
566573 548639 421
851124 192496 525
713423 123024 509
502391 391763 449
909752 463168 525
750608 321379 509
842757 106411 525
372435 916131 525
674917 381274 509
990296 74378 525
308571 517124 470
230321 587375 470
171402 786005 509
997632 962391 458
632472 618439 509
147296 84277 375
619685 127764 470
817460 832854 450
973987 792799 525
612262 288082 470
869595 712666 525
195851 725039 509
807054 762014 468
115198 262758 443
51063 402536 443
113232 78767 354
349077 809035 509
515222 68296 470
211993 985519 525
343340 598605 470
723969 283668 509
526487 461867 470
220423 193309 386
909497 639745 525
532804 241977 470
794444 33409 509
330218 645353 509
744792 160218 509
885201 677546 525
392769 401215 405
499327 161378 449
599111 389209 470
372407 259909 441
496931 923095 525
696343 189684 509
484757 154931 449
691810 327262 509
377108 783908 509
933491 634342 525
754408 96860 509
681684 94778 509
44323 385835 443
908312 921945 476
733608 713363 411
833644 370879 509
785025 86028 509
212555 943957 525
722181 48477 509
978325 191422 525
139539 700100 509
443204 763400 509
288586 63403 443
105303 267810 443
786949 381236 509
465260 268916 449
674515 397204 509
315763 742638 509
562724 38430 470
640368 588249 509
144829 60640 375
562495 694276 509
582901 677367 509
393649 495918 449
747827 724762 424
283522 592737 470
402051 43960 443
412626 522223 470
700817 762870 504
181871 197543 360
992084 962848 458
237870 550901 470
130074 832151 509
560110 933248 525
960246 14170 525
831082 371467 509
862787 882931 432
50166 890441 525
770244 844141 525
569200 855040 525
381747 736569 509
537967 362085 470
632986 474576 509
525218 122805 470
79993 783167 509
342658 935821 525
316913 477916 449
496201 574122 470
293810 216459 443
182616 55702 383
251094 833514 509
913044 537916 525
896774 173291 525
670488 766404 504
934618 103707 525
276484 316387 389
962735 574383 525
5172 970130 525
11975 941671 525
