792094 395348
767975 773604
67735 987898
815871 346943
910436 981550
726762 857937
656115 468724
313307 182106
200831 927597
252420 606318
779855 472867
921380 702475
779709 179689
344185 610651
501306 577688
209545 566185
555301 269193
925704 910795
695842 983972
629602 128718
305667 828282
971013 577442
434394 620605
715299 990655
978094 667519
946846 564123
372758 427105
49281 466668
776441 427250
629731 902571
528178 350538
769629 646910
324663 164473
837890 914150
322083 931697
817936 1477
332399 365899
643849 194123
978674 501645
290745 277615
318776 314514
553497 806457
731077 951147
210546 223863
538939 792671
9853 748642
519176 754047
888087 646362
39013 627217
369354 664874
448014 947349
774941 782156
815411 567435
199389 653455
630931 812701
886120 798052
257944 880930
641745 848161
673157 40355
230733 269652
292035 231524
491062 704244
476148 299439
914450 102065
950951 678026
347113 893112
153149 518845
460564 567370
699874 598688
229820 581079
519490 482428
481519 273731
497429 769000
744022 807468
291625 356660
593640 879238
396876 491965
150286 346440
1123 897144
656114 604378
348712 252465
171250 714780
836244 694037
594843 203384
296467 35382
116366 682331
333342 494775
2759 829016
690232 777504
533932 67346
776037 651408
794939 523929
298499 556026
246826 715331
427508 596599
446926 526197
37905 123319
513567 928553
52473 421786
447995 418451
390994 753919
664159 732090
613221 909687
637504 593088
531791 118967
648320 836115
917229 601228
308843 351307
272741 72744
596324 898973
229864 333867
57974 474350
958369 925100
390988 293210
195507 692110
448640 285115
155695 942328
286303 488343
893778 438525
310608 748703
793580 947345
626705 349480
854585 492924
510526 294168
49006 774204
759491 25112
498813 228009
840045 549837
249720 850536
653551 43566
921678 156871
808774 682783
999619 929375
648697 493200
284738 596661
197108 914264
970152 439758
414150 138558
279593 933671
409272 864867
984576 277937
724678 523558
393365 470597
305129 188460
869016 393964
25996 118539
465962 85772
323424 12610
625572 107615
126436 288469
946631 83232
890307 748334
647210 737129
97 756816
559674 895268
390190 12923
547875 735039
558423 536611
339738 595378
596459 425623
256361 385759
815098 399668
526590 448596
889507 838506
85696 868713
976822 212750
885621 909419
85469 106445
763702 450989
283144 728005
837763 984311
707337 920657
846146 971069
497728 66082
970356 226520
714003 300981
149584 25985
970801 179911
304951 553047
250242 626320
836500 507425
855198 597303
220821 704913
361900 261580
827311 508793
139787 706711
888050 673545
46945 509746
923046 33191
427898 850300
285906 259248
300562 143309
27261 966830
945179 72785
271 922672
369080 689437
417181 70802
49421 104435
951278 225908
13342 513869
809563 198637
316913 709538
193370 466808
931322 270747
263256 857380
426624 258860
180235 920621
853749 643461
791724 859408
204645 250816
106577 417794
266501 803952
762952 241542
620320 643038
787211 140738
925443 98788
412802 885661
337671 245347
397952 67396
640626 189100
546258 861525
416169 316499
191935 208195
907269 607795
791378 995904
501153 758656
918607 765771
126429 392967
892782 135423
219863 417619
304087 432412
498085 94781
767871 114416
9071 576679
581291 407242
400689 215301
441378 783829
844798 352114
83695 29881
494687 491673
392558 184143
512081 594744
953203 798240
786741 626882
715328 843974
9564 49773
168714 247325
760124 682753
72503 523113
15884 378691
