889813 149238 525
724257 461325 509
961327 903918 507
326716 620218 470
69528 996247 525
564428 380790 470
98892 606008 470
693925 551575 509
853277 872361 432
979305 972037 383
624904 944841 525
783461 337677 509
933230 443111 525
677650 578420 509
717986 406179 509
613365 913647 525
94938 652667 509
436968 468890 444
649681 413224 509
808572 376908 509
455565 792465 509
993468 51077 525
138198 780795 509
503549 928990 525
168902 270316 443
113941 359095 443
317318 6176 443
643916 94027 509
650184 300507 509
594248 555294 434
62448 644882 509
374072 454398 449
603897 281973 470
775071 105371 509
784291 438628 509
258729 7142 443
406252 478507 449
945736 664292 525
61773 110747 354
41198 167918 383
527460 838619 525
723564 228739 509
726187 764235 424
603403 218450 470
279439 592654 470
345516 642526 509
882771 224557 525
306554 328418 384
624807 820209 509
555379 588553 434
823382 115089 509
560902 710107 509
205522 9778 383
407137 113336 443
497520 122956 449
934575 565253 525
369375 727719 509
702478 265152 509
428745 446601 400
254932 143832 443
731080 762990 424
685214 939101 525
799546 845098 525
107635 752185 509
222291 524284 470
896690 626926 525
646344 271982 509
664140 399612 509
773550 63328 509
224711 699644 509
61014 748673 509
59263 412319 449
863203 618570 525
786528 292258 509
463326 983267 525
287588 196746 443
297933 68722 443
769369 380099 509
304808 74845 443
273148 785537 509
220209 8541 386
750516 849157 525
783336 941740 525
211635 79164 383
843984 359548 525
790118 466974 509
949152 74481 525
2455 221279 386
898587 138312 525
620342 849400 525
20664 761020 509
636918 63337 509
54872 739198 509
409231 702442 509
433053 523140 470
264736 893789 525
966710 582955 525
136509 886179 525
155495 263711 443
973354 836210 525
928356 305162 525
20218 654936 509
674371 788871 504
277439 174193 443
651836 158113 509
893818 714619 525
255022 17257 443
394641 713666 509
137993 508610 449
634708 307256 509
813167 491671 509
924904 565805 525
871478 69140 525
531542 668902 509
46357 865362 525
799255 759929 468
375923 730807 509
737511 952995 525
991496 128210 525
207589 82362 383
79327 412336 449
328227 40473 443
249464 475250 449
524260 571853 452
77468 456780 449
986650 945954 458
454045 808359 509
575110 950409 525
455211 664375 509
133209 396451 443
697729 401617 509
380420 772155 509
160435 977104 525
911375 709809 525
976426 207207 525
599947 725666 509
800421 409524 509
657033 921924 525
368381 612644 470
278350 640075 509
608726 112820 470
854963 760182 525
410813 335510 449
347592 164486 443
475056 324908 449
960112 237652 525
894825 410443 525
810898 909239 525
927089 242196 525
329301 760102 509
157480 381738 443
952156 902746 507
772547 617505 509
731542 72996 509
315775 746570 509
280102 129075 443
438875 504485 444
220948 520236 470
210557 419214 449
304223 793535 509
859479 530302 525
716502 848971 525
196653 702763 509
491436 920649 525
832155 710993 468
617613 46203 470
482792 201060 449
733075 799264 468
275313 206273 443
710292 734699 411
384959 609500 470
875864 413641 525
558205 738815 509
774993 315709 509
187979 960998 525
997388 683542 525
727365 535026 509
547263 308295 470
554906 692255 509
56782 686963 509
795067 261378 509
272448 534268 470
849315 495994 525
100151 37206 351
899985 278983 525
774965 338151 509
998587 912100 507
637265 236679 509
30013 188905 383
801316 235998 509
653148 91803 509
727964 114256 509
967803 518806 525
659931 65761 509
776046 759106 468
213623 816939 509
253014 792913 509
897046 989689 507
259167 166560 443
423541 565283 470
84455 374544 443
578432 71986 470
953508 220815 525
978645 157172 525
508365 115780 449
489963 309651 449
192032 774259 509
96884 275997 443
41837 678442 509
696372 137072 509
12953 643744 509
406940 394801 405
536166 254124 470
60874 208522 383
62381 261989 443
862251 72500 525
267124 909440 525
644932 577258 509
278126 474433 449
439787 412526 418
147704 907425 525
888744 866484 445
188279 631362 509
498814 575169 470
783717 198021 509
159426 282473 443
465382 838980 525
627234 134599 509
546059 871043 525
510923 113533 449
253475 211455 443
253466 825573 509
796029 877224 525
988732 620747 525
953659 308136 525
465897 131379 449
606321 13595 470
146101 912798 525
965287 975363 458
211527 179554 373
654174 591197 509
606460 779730 509
929041 987382 507
729643 971976 525
435354 704485 509
178629 262307 443
107904 832482 509
972423 826648 525
539933 79599 470
88319 586730 470
369703 793665 509
37763 799752 509
379784 169500 443
603492 532130 452
167392 89389 383
