451200 102000 449
191100 365600 443
412000 604500 470
81300 493700 449
193300 907700 525
228100 717200 509
47700 200300 383
186800 143400 383
317600 673100 509
175000 754600 509
3200 852800 525
419400 150500 449
213600 735400 509
171800 910100 525
322400 381000 441
361200 62200 443
462000 840600 525
363800 592200 470
458700 985600 525
124300 42800 354
249600 13600 443
476600 370700 449
2500 663300 509
184900 850100 525
102200 360300 443
315000 569200 470
374800 230900 441
354800 364300 410
311500 228200 443
229200 13500 386
338700 130500 443
106600 742400 509
313600 791700 509
144400 844100 525
282600 140700 443
423600 967000 525
497200 216500 449
14600 632100 509
448400 684200 509
171700 739000 509
366800 945900 525
474600 76300 449
447900 103500 449
432300 328400 449
354600 670700 509
294500 995300 525
60500 343400 443
167400 987600 525
204000 732900 509
313300 847000 525
349200 944500 525
107700 352000 443
196700 487500 449
351900 218700 443
114300 332900 443
162600 962300 525
1200 957700 525
225400 478700 449
367200 392200 436
76600 621300 470
61900 473800 449
444000 400900 449
477200 832200 509
461400 529400 470
57600 292600 443
226800 803400 509
296700 41700 443
475500 422800 444
86300 988000 525
52800 41200 340
222500 329000 443
88700 596500 470
497800 998600 525
3500 529100 470
222700 64600 386
376800 483800 449
310300 417100 449
288400 986200 525
439600 890200 525
197100 232400 443
444000 79000 449
84700 11600 351
440700 558300 470
226000 999100 525
434300 580000 470
330300 599100 470
356100 759400 509
321200 970400 525
335800 467700 449
269800 76800 443
473500 288200 449
178100 662700 509
188300 873600 525
82700 830400 509
347900 367500 410
167300 824200 509
475500 846400 525
134700 30100 354
102000 761400 509
65300 10100 340
65300 274400 443
416200 84300 449
125700 136200 344
435900 298600 449
362800 878300 525
47600 369600 443
444400 442200 356
156100 784700 509
478100 528800 470
163500 834100 509
1600 556100 470
415100 614100 470
227700 6700 386
238300 53900 443
427200 231000 449
135000 13700 354
209800 277300 443
347400 313700 441
456600 242700 449
480300 325100 449
256900 250400 363
471500 684400 509
71900 284000 443
182000 917500 525
390400 607600 470
61100 274200 443
418100 381100 449
474000 703800 509
444000 744800 509
5200 792200 509
344100 100000 443
302900 545900 470
284100 550700 470
19300 816700 509
155800 927900 525
412600 280000 449
297000 504700 449
221700 956000 525
182700 221100 386
217500 995200 525
407800 811100 509
496100 795600 509
296400 522500 470
95300 994700 525
339200 812900 509
491300 921900 525
303500 447800 449
93600 536300 470
270400 885000 525
319200 443900 449
30300 360800 443
318000 680600 509
426400 659600 509
221700 641100 509
112200 624300 470
340000 342300 335
244300 898800 525
375900 942300 525
196400 865600 525
312000 809400 509
347600 200000 443
111200 533900 470
262600 329100 407
178300 735900 509
410300 412500 374
133600 320100 443
137500 495500 449
232900 544800 470
298000 158900 443
382500 166600 443
270500 994400 525
53700 440300 449
210700 672300 509
235500 457600 449
315900 518100 470
425100 46100 449
49600 228300 386
304000 366400 441
174200 301100 443
321700 903900 525
320100 628100 509
406700 794900 509
145100 855700 525
254700 395600 441
325700 413800 449
118600 879900 525
23300 810400 509
146900 323200 443
398900 415600 449
255600 368800 441
36800 147600 375
430200 313400 449
126500 171300 383
286300 771700 509
122100 425300 449
389600 831700 509
130600 408000 443
27100 598400 470
164400 182300 365
471200 43600 449
477600 687000 509
406700 602000 470
25400 163000 383
454200 369000 449
391800 402800 405
442200 145600 449
470700 727300 509
476300 353100 449
350700 562000 470
178800 208200 373
353400 594800 470
154300 368800 443
290300 530300 470
237700 505700 449
53700 398800 443
335700 303700 384
451700 518300 470
141000 428700 449
268300 969900 525
87700 184600 383
179600 192600 365
433100 933100 525
229400 397600 443
365900 17800 443
336800 683800 509
117400 885900 525
275100 347900 441
469800 623600 470
143300 97900 375
282700 771200 509
470700 120700 449
436600 904100 525
371000 59600 443
299700 592100 470
369100 379600 423
187300 17800 383
63200 439500 449
3200 358200 443
49000 921400 525
164100 493200 449
29900 339100 443
99700 256100 443
92100 827000 509
286600 271900 389
324500 45200 443
340900 366400 441
51000 356200 443
461000 274900 449
374400 92500 443
90000 80700 333
