<svg width="30" height="30" viewBox="0 0 30 30" fill="none" xmlns="http://www.w3.org/2000/svg">
<path d="M21.9413 5.94047C21.844 5.94081 21.7484 5.91594 21.6636 5.86828C19.3453 4.67719 17.3411 4.17188 14.9263 4.17188C12.5477 4.17188 10.2778 4.73734 8.21315 5.86828C7.92347 6.02469 7.56128 5.91641 7.39222 5.62766C7.23518 5.33891 7.34378 4.96594 7.63362 4.80953C9.8794 3.57031 12.3425 2.96875 14.9263 2.96875C17.5102 2.96875 19.756 3.53422 22.2189 4.77344C22.5208 4.95391 22.6296 5.31484 22.4725 5.60359C22.3639 5.82016 22.1707 5.94047 21.9413 5.94047ZM4.66347 12.2569C4.53865 12.2562 4.41685 12.2185 4.31347 12.1486C4.05972 11.9561 3.97518 11.5831 4.16847 11.3064C5.36378 9.62203 6.88503 8.29859 8.69612 7.37219C12.5116 5.42312 17.3411 5.41109 21.1444 7.36016C22.9555 8.28656 24.4767 9.58594 25.6721 11.2703C25.8653 11.535 25.7928 11.92 25.5272 12.1125C25.2496 12.305 24.8752 12.2448 24.6821 11.9922C23.5953 10.4522 22.2189 9.26109 20.5889 8.43094C17.1238 6.66234 12.6927 6.66234 9.23956 8.44297C7.59737 9.28516 6.22097 10.4883 5.1344 11.9922C5.03784 12.1727 4.85659 12.2569 4.66347 12.2569ZM12.2097 26.7786C12.0527 26.7786 11.9078 26.7184 11.7871 26.5981C10.7367 25.5514 10.1692 24.8777 9.36018 23.4219C8.52706 21.942 8.09253 20.1373 8.09253 18.2003C8.09253 14.627 11.1592 11.7155 14.9263 11.7155C18.6935 11.7155 21.7602 14.627 21.7602 18.2003C21.7602 18.3598 21.6966 18.5128 21.5833 18.6256C21.47 18.7386 21.3165 18.802 21.1564 18.802C20.9964 18.802 20.8429 18.7386 20.7296 18.6256C20.6736 18.5698 20.6291 18.5036 20.5988 18.4306C20.5685 18.3576 20.5529 18.2793 20.5528 18.2003C20.5528 15.2887 18.0294 12.9186 14.9263 12.9186C11.8233 12.9186 9.29972 15.2887 9.29972 18.2003C9.29972 19.9328 9.68628 21.533 10.4227 22.8203C11.1955 24.2159 11.7267 24.8055 12.6564 25.7439C12.7668 25.8587 12.8285 26.0118 12.8285 26.171C12.8285 26.3303 12.7668 26.4833 12.6564 26.5981C12.5116 26.7184 12.3667 26.7786 12.2097 26.7786ZM20.8667 24.5528C19.4299 24.5528 18.1622 24.1919 17.1238 23.482C15.3247 22.2669 14.2502 20.2937 14.2502 18.2003C14.2502 18.0408 14.3138 17.8878 14.4271 17.775C14.5404 17.6621 14.6939 17.5987 14.8539 17.5987C15.014 17.5987 15.1674 17.6621 15.2808 17.775C15.3368 17.8308 15.3812 17.8971 15.4116 17.97C15.4419 18.043 15.4575 18.1213 15.4575 18.2003C15.4575 19.8967 16.3269 21.4969 17.7999 22.4834C18.6572 23.0609 19.6592 23.3377 20.8667 23.3377C21.1564 23.3377 21.6394 23.3016 22.1224 23.2173C22.4485 23.1572 22.7744 23.3737 22.8227 23.7106C22.883 24.0234 22.6657 24.3483 22.3277 24.4084C21.6394 24.5408 21.0358 24.5528 20.8667 24.5528ZM18.4399 27.0312H18.2828C16.3632 26.4778 15.1074 25.768 13.7914 24.4806C12.101 22.8203 11.1713 20.5825 11.1713 18.2003C11.1713 16.2512 12.8375 14.6631 14.89 14.6631C16.9427 14.6631 18.6089 16.2512 18.6089 18.2003C18.6089 19.4877 19.756 20.5344 21.1202 20.5344C22.5088 20.5344 23.6316 19.4877 23.6316 18.2003C23.6316 13.6645 19.7075 9.98297 14.878 9.98297C11.4491 9.98297 8.28565 11.8839 6.89722 14.8316C6.42628 15.8061 6.18472 16.9491 6.18472 18.2003C6.18472 19.1387 6.26925 20.6186 6.99378 22.5436C7.11456 22.8564 6.95753 23.2053 6.64362 23.3136C6.32956 23.4219 5.97956 23.2655 5.87081 22.9647C5.26722 21.3886 4.98956 19.8125 4.98956 18.2003C4.98956 16.7566 5.26722 15.4452 5.8105 14.3022C7.41628 10.9455 10.9782 8.76781 14.878 8.76781C20.3596 8.76781 24.8391 12.9908 24.8391 18.1883C24.8391 20.1373 23.1728 21.7255 21.1202 21.7255C19.0677 21.7255 17.4014 20.1373 17.4014 18.1883C17.4014 16.9009 16.2786 15.8542 14.89 15.8542C13.5016 15.8542 12.3788 16.9009 12.3788 18.1883C12.3788 20.2456 13.1757 22.1706 14.6366 23.6144C15.7836 24.7453 16.8824 25.3709 18.5847 25.8281C18.9107 25.9244 19.0919 26.2612 19.0074 26.5741C18.9469 26.8508 18.6935 27.0312 18.4399 27.0312Z" fill="black" stroke="black" stroke-width="0.008"/>
</svg>
