<svg width="30" height="30" viewBox="0 0 30 30" fill="none" xmlns="http://www.w3.org/2000/svg">
<path d="M9.06245 3.64902C8.96549 3.77696 8.85115 3.85655 8.81167 3.87956C8.79851 3.88494 8.78562 3.8921 8.77335 3.90087C8.72384 3.93857 8.69966 4.00231 8.71318 4.06311C8.72635 4.12363 8.77398 4.17099 8.83468 4.18442C8.88446 4.19543 8.93093 4.19418 9.0731 4.08531C9.13622 4.03705 9.2297 3.95477 9.31591 3.84098L9.35361 3.79102C9.67637 3.36117 10.4329 2.35573 11.5253 2.41025C12.4261 2.47579 13.0646 3.15605 13.3718 4.37781C13.3821 4.41918 13.3886 4.44496 13.3953 4.46403C13.4425 4.66422 13.5212 4.91303 13.635 4.99451C13.6632 5.01501 13.6956 5.02468 13.7279 5.02468C13.7772 5.02468 13.8261 5.00185 13.8568 4.95879C13.9065 4.88976 13.8933 4.79503 13.8281 4.74239C13.7966 4.70165 13.738 4.5319 13.7025 4.37996C13.7006 4.37092 13.6975 4.36214 13.6943 4.35364C13.6916 4.34334 13.6856 4.32069 13.6805 4.30037C13.632 4.10689 13.5027 3.59261 13.1886 3.10851C12.7836 2.48412 12.2314 2.14246 11.5468 2.09313C11.5454 2.09313 11.5445 2.09313 11.5433 2.09286C10.2814 2.02867 9.45308 3.13009 9.09952 3.6004L9.06245 3.64902Z" fill="black"/>
<path d="M10.2566 3.60694C10.1845 3.68627 10.1196 3.77159 10.05 3.85324C9.9584 3.96014 9.85884 4.06006 9.75435 4.15407C9.64745 4.25077 9.56052 4.32006 9.43401 4.39276C9.2998 4.46967 9.16299 4.54757 9.02404 4.61516C8.97587 4.63844 8.93513 4.65384 8.88124 4.66987C8.79806 4.69502 8.74658 4.78062 8.77013 4.86567C8.79233 4.94777 8.8824 5.00158 8.96566 4.97669C9.12852 4.92772 9.27554 4.84392 9.42246 4.76056C9.54637 4.68992 9.66957 4.62653 9.78354 4.53996C10.0057 4.37083 10.1967 4.17377 10.3724 3.95826C10.4437 3.87106 10.5199 3.78762 10.5993 3.70766C10.6425 3.6637 10.6874 3.62216 10.7335 3.5808C10.7574 3.55949 10.7816 3.53854 10.806 3.51812C10.8183 3.50774 10.8308 3.49735 10.8437 3.4867C10.8469 3.4841 10.8704 3.46602 10.8773 3.46002C10.9884 3.37496 11.1063 3.29931 11.2308 3.23529C11.3482 3.17539 11.4659 3.13314 11.6087 3.10323C11.656 3.09329 11.6664 3.09267 11.7018 3.08855C11.7877 3.07977 11.861 3.02301 11.861 2.92936C11.861 2.84968 11.7888 2.76158 11.7018 2.77035C11.1272 2.83007 10.6354 3.18927 10.2566 3.60694Z" fill="black"/>
<path d="M13.8681 6.10372C13.9073 6.03631 13.8906 5.91991 13.811 5.88634C13.6783 5.82976 13.5395 5.77111 13.4279 5.67827C13.3049 5.57638 13.2478 5.44199 13.2224 5.28701C13.1892 5.08494 12.8826 5.17089 12.9156 5.37171C12.9836 5.78392 13.2874 6.00775 13.6503 6.16111C13.7304 6.19442 13.8197 6.18565 13.8681 6.10372Z" fill="black"/>
<path d="M23.0149 19.4788C23.0891 18.6282 22.885 17.9082 22.4095 17.3377C21.7072 16.4991 20.6296 16.2374 20.1697 16.1617C19.8768 15.4273 19.4301 14.9432 18.8399 14.7227C18.6089 14.6365 18.3576 14.5922 18.0935 14.5922C17.6505 14.5922 17.2509 14.7143 16.9826 14.8225C16.6281 14.1796 16.1547 13.7801 15.5756 13.6343C15.4157 13.5938 15.2473 13.5731 15.0746 13.5731C14.5222 13.5731 14.017 13.7808 13.6732 13.9678C13.554 13.1722 13.3975 11.2812 13.2822 9.89004L13.2813 9.8741C13.1615 8.41983 13.0799 7.46739 13.0134 6.83547C13.1415 6.91274 13.276 6.97917 13.4173 7.0225C13.614 7.08303 13.6974 6.7762 13.502 6.71594C13.3823 6.67915 13.2917 6.63214 13.1655 6.55783C13.0953 6.51629 13.0287 6.46776 12.9651 6.41503C12.9104 5.9902 12.8628 5.78436 12.8057 5.68391C12.7618 5.53358 12.682 5.36571 12.576 5.19981C12.6771 5.06775 12.7624 4.93246 12.8179 4.79414C12.9377 4.49447 12.9409 4.18442 12.8257 3.94421C12.7232 3.7296 12.5317 3.57453 12.2727 3.49547C11.8928 3.37899 11.4314 3.59002 11.0091 4.07403C11.0067 4.0768 10.8762 4.21236 10.6788 4.39411C10.592 4.4489 10.5058 4.52205 10.424 4.61838C10.2286 4.78303 10.0023 4.95753 9.77079 5.09899C9.76604 5.10195 9.30397 5.3795 8.82139 5.51066C8.73642 5.53394 8.68646 5.62141 8.70974 5.70611C8.73284 5.79081 8.82013 5.84113 8.90519 5.81749C9.43003 5.67469 9.91511 5.38362 9.93642 5.37081C9.98226 5.34288 10.0265 5.31181 10.0711 5.28191C10.0103 5.46052 9.95683 5.66752 9.91484 5.90872C9.44426 6.15816 9.05551 6.30356 8.91522 6.35119C8.90832 6.35361 8.90394 6.35558 8.90232 6.3562C8.82022 6.38736 8.77868 6.47895 8.81011 6.56105C8.83437 6.62444 8.8948 6.66366 8.95891 6.66366C8.97717 6.66366 8.99517 6.66043 9.01308 6.65417L9.01872 6.65211C9.14478 6.60877 9.46172 6.49211 9.86086 6.2947C9.85423 6.35065 9.84743 6.40428 9.84205 6.4632C9.84205 6.57842 9.84205 6.69195 9.84179 6.80628C9.58411 6.94801 9.32599 7.08052 9.09876 7.1773C9.01791 7.21159 8.98049 7.30542 9.01469 7.38627C9.04074 7.44635 9.09938 7.48261 9.16125 7.48261C9.18193 7.48261 9.20324 7.47849 9.22357 7.46972C9.41427 7.38824 9.62682 7.28018 9.84107 7.16602C9.82853 13.0594 9.66478 17.3728 9.62771 18.2775C9.0727 18.53 8.56604 19.1024 8.50982 19.1673C6.72463 21.1391 7.57071 22.5881 7.60742 22.6478C8.97225 25.0372 11.7915 29.7406 11.8176 29.7837L11.8728 29.8751L11.8998 29.8588V29.9015H20.9159L21.2486 29.9999L21.7144 28.4066C23.5867 24.8308 23.0793 20.0069 23.0149 19.4788ZM12.1795 3.79961C12.354 3.85288 12.4748 3.94788 12.5388 4.08164C12.6157 4.2419 12.6099 4.45803 12.5228 4.67622C12.4899 4.75805 12.4412 4.84365 12.3789 4.93219C12.0864 4.5823 11.6883 4.28917 11.2786 4.25166C11.5339 3.97026 11.895 3.71259 12.1795 3.79961ZM21.1125 28.1625L20.7942 29.235H12.2492C11.6499 28.2337 9.35428 24.3909 8.17174 22.3221C8.14569 22.2771 7.54869 21.2013 8.99947 19.5989C9.15445 19.4181 9.64132 18.9263 10.0295 18.824L10.2601 18.7624L10.27 18.5243C10.2726 18.4873 10.4944 13.6534 10.4921 6.49346C10.5798 5.53081 10.8373 4.92029 11.1618 4.90077L11.1768 4.90014C11.58 4.90014 12.1117 5.53895 12.1911 5.90935L12.2375 6.12781L12.2649 6.1321C12.3635 6.68649 12.5114 8.48 12.6317 9.92755C13.0245 14.684 13.0718 14.6981 13.3823 14.7912L13.5422 14.8377L13.6736 14.737C13.744 14.6846 14.3774 14.2256 15.075 14.2256C15.1944 14.2256 15.3101 14.2398 15.417 14.2666C15.8783 14.3825 16.2545 14.7598 16.5356 15.3864L16.6835 15.7172L16.9963 15.5353C17.0172 15.5243 17.5261 15.2461 18.0933 15.2461C18.2798 15.2461 18.4538 15.2755 18.6116 15.3343C19.0602 15.5019 19.4006 15.9158 19.6249 16.5645L19.6941 16.7651L19.9048 16.7841C19.9172 16.7854 21.2071 16.9163 21.9081 17.7566C22.2733 18.1938 22.4265 18.7604 22.3634 19.4436L22.3615 19.4911L22.3646 19.5116C22.3886 19.7195 22.9448 24.6503 21.1125 28.1625Z" fill="black"/>
<path d="M13.5754 10.7892H16.0675V8.29753H15.7243V10.4459H13.5754V10.7892Z" fill="black"/>
<path d="M9.36568 10.4459H7.21682V8.29753H6.87427V10.7892H9.36568V10.4459Z" fill="black"/>
<path d="M7.21682 0.343044H9.36568V4.57764e-05H6.87427V2.49137H7.21682V0.343044Z" fill="black"/>
<path d="M15.7243 2.49164H16.0675V4.57764e-05H13.5754V0.343044H15.7243V2.49164Z" fill="black"/>
</svg>
