<svg width="30" height="30" viewBox="0 0 30 30" fill="none" xmlns="http://www.w3.org/2000/svg">
<path d="M11.301 3.13132C10.2806 2.8788 9.0051 2.62627 7.9847 2.62627C6.96429 2.62627 5.68877 2.8788 4.66836 3.13132C3.77551 3.25759 3.13775 4.01516 3.0102 4.899C2.88265 5.9091 2.5 7.9293 2.5 9.31819C2.5 10.7071 2.7551 12.4748 2.88265 13.7374C3.0102 14.6212 3.64796 15.3787 4.54081 15.505C5.43367 15.7576 6.83674 15.8839 7.85714 15.8839C8.87755 15.8839 10.1531 15.6314 11.1735 15.505C12.0663 15.3787 12.7041 14.6212 12.8316 13.7374C13.0867 12.4748 13.2142 10.7071 13.2142 9.31819C13.2142 7.9293 12.9591 5.9091 12.8316 4.899C12.8316 4.01516 12.1939 3.25759 11.301 3.13132Z" fill="black"/>
<path d="M25.3317 14.4947C24.4388 14.2422 23.0358 14.116 22.0155 14.116C20.995 14.116 19.7195 14.3685 18.6991 14.4947C17.8062 14.621 17.1685 15.3786 17.041 16.2625C16.7858 17.5251 16.6582 19.2927 16.6582 20.6816C16.6582 22.0705 16.9133 23.8382 17.041 25.1009C17.1685 25.9846 17.8062 26.7422 18.6991 26.8685C19.592 27.121 20.995 27.2472 22.0155 27.2472C23.0358 27.2472 24.3113 26.9947 25.3317 26.8685C26.2246 26.7422 26.8623 25.9846 26.9898 25.1009C27.245 23.8382 27.3726 22.0705 27.3726 20.6816C27.3726 19.2927 27.245 17.5251 26.9898 16.2625C26.8623 15.3786 26.2246 14.621 25.3317 14.4947Z" fill="black"/>
<path d="M11.4286 19.5452C10.4082 19.2927 9.13265 19.1665 7.9847 19.1665C6.83674 19.1665 5.56122 19.419 4.54081 19.5452C3.77551 19.6715 3.13775 20.3029 2.88265 21.0604C2.62755 21.9443 2.5 22.7019 2.5 23.3331C2.5 23.9645 2.62755 24.5957 2.88265 25.6059C3.13775 26.3635 3.77551 26.8685 4.54081 27.121C5.56122 27.3736 6.83674 27.4999 7.9847 27.4999C9.13265 27.4999 10.4082 27.2472 11.4286 27.121C12.1939 26.9947 12.8316 26.3635 13.0868 25.6059C13.3419 24.722 13.4694 23.9645 13.4694 23.3331C13.4694 22.7019 13.3419 22.0705 13.0868 21.0604C12.8316 20.1766 12.1939 19.6715 11.4286 19.5452Z" fill="black"/>
<path d="M18.5713 10.4544C19.5918 10.707 20.8673 10.8332 22.0151 10.8332C23.1631 10.8332 24.4386 10.5807 25.459 10.4544C26.2244 10.3282 26.8621 9.69685 27.1173 8.93927C27.3724 8.05544 27.4999 7.29786 27.4999 6.66655C27.4999 6.03524 27.3724 5.40392 27.1173 4.39382C26.8621 3.63625 26.2244 3.1312 25.459 2.87867C24.4386 2.62615 23.1631 2.49989 22.0151 2.49989C20.8673 2.49989 19.5918 2.75241 18.5713 2.87867C17.806 3.00494 17.1683 3.63625 16.9131 4.39382C16.658 5.27766 16.5305 6.03524 16.5305 6.66655C16.5305 7.29786 16.658 7.92917 16.9131 8.93927C17.1683 9.82311 17.806 10.3282 18.5713 10.4544Z" fill="black"/>
</svg>
