22-08-2018 10:55:35 AutomationLog -------------- HOME PAGE LOAD VERIFICATION -----------------
22-08-2018 10:55:35 AutomationLog Deleting all the cookies!
22-08-2018 10:55:38 AutomationLog          Executing isElementPresent method for FANCYBOX
22-08-2018 10:55:38 AutomationLog --> Closing the Fancy Box Pop-Up
22-08-2018 10:55:38 AutomationLog          Executing returnLocator method for FANCYBOX
22-08-2018 10:55:39 AutomationLog          Executing waitForLocator method for MY_ACCOUNT
22-08-2018 10:55:44 AutomationLog          Executing isElementPresent method for MY_ACCOUNT
22-08-2018 10:55:44 AutomationLog          Home page loaded successfully in: 2.573 seconds
22-08-2018 10:55:44 AutomationLog --------------------------
22-08-2018 10:55:44 AutomationLog ----------- MY ACCOUNT SIGN IN ------------
22-08-2018 10:55:44 AutomationLog --> Clicking on the My Account button
22-08-2018 10:55:44 AutomationLog          Current URL: https://us.davines.com/
22-08-2018 10:55:44 AutomationLog          Executing returnLocator method for MY_ACCOUNT
22-08-2018 10:55:44 AutomationLog          Executing waitForLocator method for USERNAME
22-08-2018 10:55:49 AutomationLog          My Account page loaded successfully in: 5.341 seconds
22-08-2018 10:55:49 AutomationLog --> Entering the Valid Login Credentials
22-08-2018 10:55:49 AutomationLog          Executing returnLocator method for USERNAME
22-08-2018 10:55:50 AutomationLog          Executing returnLocator method for USERNAME
22-08-2018 10:55:50 AutomationLog          Executing returnLocator method for USERNAME
22-08-2018 10:55:50 AutomationLog          Executing waitForLocator method for PASSWORD
22-08-2018 10:55:55 AutomationLog          Executing returnLocator method for PASSWORD
22-08-2018 10:55:56 AutomationLog          Executing returnLocator method for PASSWORD
22-08-2018 10:55:56 AutomationLog          Executing returnLocator method for PASSWORD
22-08-2018 10:55:56 AutomationLog --> Clicking on Log-In button
22-08-2018 10:55:56 AutomationLog          Executing waitForLocator method for LOG_IN
22-08-2018 10:56:01 AutomationLog          Executing returnLocator method for LOG_IN
22-08-2018 10:56:01 AutomationLog          Current URL: https://us.davines.com/
22-08-2018 10:56:01 AutomationLog          Executing waitForLocator method for SHOPPING_CART
22-08-2018 10:56:07 AutomationLog          Executing isElementPresent method for SHOPPING_CART
22-08-2018 10:56:07 AutomationLog          Signed in to my account successfully in: 10.412 seconds
22-08-2018 10:56:07 AutomationLog -------------------------
22-08-2018 10:56:07 AutomationLog -------------- ACCOUNT VERIFICATION  -------------
22-08-2018 10:56:07 AutomationLog          Executing returnLocator method for SIGNED_USER
22-08-2018 10:56:07 AutomationLog --> User account verified and displayed as xxxx: HI, AUTOMATION1
22-08-2018 10:56:07 AutomationLog --------------------
22-08-2018 10:56:07 AutomationLog ----------- SHOPPING CART VERIFICATION ------------
22-08-2018 10:56:07 AutomationLog          Executing waitForLocator method for SHOPPING_CART
22-08-2018 10:56:12 AutomationLog          Executing returnLocator method for SHOPPING_CART
22-08-2018 10:56:15 AutomationLog ----------------------
22-08-2018 10:56:15 AutomationLog ---------------------- PLP VERIFICATION ----------------------
22-08-2018 10:56:15 AutomationLog --> Navigating to the PLP
22-08-2018 10:56:15 AutomationLog ----------------------
22-08-2018 10:56:15 AutomationLog --> Automation Test Successful
