22-08-2018 08:55:44 AutomationLog -------------- HOME PAGE LOAD VERIFICATION -----------------
22-08-2018 08:55:44 AutomationLog Deleting all the cookies!
22-08-2018 08:55:46 AutomationLog          Executing isElementPresent method for FANCYBOX
22-08-2018 08:55:46 AutomationLog --> Closing the Fancy Box Pop-Up
22-08-2018 08:55:46 AutomationLog          Executing returnLocator method for FANCYBOX
22-08-2018 08:55:47 AutomationLog          Executing waitForLocator method for MY_ACCOUNT
22-08-2018 08:55:52 AutomationLog          Executing isElementPresent method for MY_ACCOUNT
22-08-2018 08:55:52 AutomationLog          Home page loaded successfully in: 1.684 seconds
22-08-2018 08:55:52 AutomationLog --------------------------
22-08-2018 08:55:52 AutomationLog ----------- MY ACCOUNT SIGN IN ------------
22-08-2018 08:55:52 AutomationLog --> Clicking on the My Account button
22-08-2018 08:55:52 AutomationLog          Current URL: http://www.joesjeans.com/
22-08-2018 08:55:52 AutomationLog          Executing returnLocator method for MY_ACCOUNT
22-08-2018 08:55:55 AutomationLog          Executing waitForLocator method for USERNAME
22-08-2018 08:56:00 AutomationLog          My Account page loaded successfully in: 7.757 seconds
22-08-2018 08:56:00 AutomationLog --> Entering the Valid Login Credentials
22-08-2018 08:56:00 AutomationLog          Executing returnLocator method for USERNAME
22-08-2018 08:56:00 AutomationLog          Executing returnLocator method for USERNAME
22-08-2018 08:56:01 AutomationLog          Executing returnLocator method for USERNAME
22-08-2018 08:56:01 AutomationLog          Executing waitForLocator method for PASSWORD
22-08-2018 08:56:06 AutomationLog          Executing returnLocator method for PASSWORD
22-08-2018 08:56:06 AutomationLog          Executing returnLocator method for PASSWORD
22-08-2018 08:56:07 AutomationLog          Executing returnLocator method for PASSWORD
22-08-2018 08:56:07 AutomationLog --> Clicking on Log-In button
22-08-2018 08:56:07 AutomationLog          Executing waitForLocator method for LOG_IN
22-08-2018 08:56:12 AutomationLog          Executing returnLocator method for LOG_IN
22-08-2018 08:56:12 AutomationLog          Current URL: https://www.joesjeans.com/login?returnUrl=https://www.joesjeans.com/
22-08-2018 08:56:12 AutomationLog          Executing waitForLocator method for SHOPPING_CART
22-08-2018 08:56:17 AutomationLog          Executing isElementPresent method for SHOPPING_CART
22-08-2018 08:56:18 AutomationLog          Signed in to my account successfully in: 10.468 seconds
22-08-2018 08:56:18 AutomationLog -------------------------
22-08-2018 08:56:18 AutomationLog -------------- ACCOUNT VERIFICATION  -------------
22-08-2018 08:56:18 AutomationLog          Executing returnLocator method for SIGNED_USER
22-08-2018 08:56:18 AutomationLog --> User account verified and displayed as xxxx: HI, AUTOMATION1
22-08-2018 08:56:18 AutomationLog --------------------
22-08-2018 08:56:18 AutomationLog ----------- SHOPPING CART VERIFICATION ------------
22-08-2018 08:56:18 AutomationLog --> Hovering over the Shopping Cart button
22-08-2018 08:56:18 AutomationLog          Executing returnLocator method for SHOPPING_CART
22-08-2018 08:56:18 AutomationLog          Executing isElementPresent method for SHOPPING_CART_CHECKOUT
22-08-2018 08:57:48 AutomationLog ***** Warning: OR ISSUE with SHOPPING_CART_CHECKOUT Object!. Unable to locate it @isElementPresent method and Timed out after 90 seconds waiting for visibility of element located by By.xpath: /html/body/section/header/div/div/div[2]/ul/li[6]/div/div/div[3]/ul[3]/li[1]/a

22-08-2018 08:57:48 AutomationLog --> Shopping Cart is empty
22-08-2018 08:57:48 AutomationLog ----------------------
22-08-2018 08:57:48 AutomationLog --> Automation Test Successful
