22-08-2018 14:43:44 AutomationLog -------------- HOME PAGE LOAD VERIFICATION -----------------
22-08-2018 14:43:44 AutomationLog Deleting all the cookies!
22-08-2018 14:43:48 AutomationLog          Executing isElementPresent method for MY_ACCOUNT
22-08-2018 14:43:48 AutomationLog          Home page loaded successfully in: 3.318 seconds
22-08-2018 14:43:48 AutomationLog --------------------------
22-08-2018 14:43:48 AutomationLog ----------- MY ACCOUNT SIGN IN ------------
22-08-2018 14:43:48 AutomationLog --> Clicking on the My Account button
22-08-2018 14:43:48 AutomationLog          Current URL: https://www.aquatalia.com/
22-08-2018 14:43:48 AutomationLog          Executing returnLocator method for MY_ACCOUNT
22-08-2018 14:43:48 AutomationLog          Executing waitForLocator method for USERNAME
22-08-2018 14:43:53 AutomationLog          My Account page loaded successfully in: 5.37 seconds
22-08-2018 14:43:53 AutomationLog --> Entering the Valid Login Credentials
22-08-2018 14:43:53 AutomationLog          Executing returnLocator method for USERNAME
22-08-2018 14:43:54 AutomationLog          Executing returnLocator method for USERNAME
22-08-2018 14:43:54 AutomationLog          Executing returnLocator method for USERNAME
22-08-2018 14:43:54 AutomationLog          Executing waitForLocator method for PASSWORD
22-08-2018 14:43:59 AutomationLog          Executing returnLocator method for PASSWORD
22-08-2018 14:44:00 AutomationLog          Executing returnLocator method for PASSWORD
22-08-2018 14:44:00 AutomationLog          Executing returnLocator method for PASSWORD
22-08-2018 14:44:00 AutomationLog --> Clicking on Log-In button
22-08-2018 14:44:00 AutomationLog          Executing waitForLocator method for LOG_IN
22-08-2018 14:44:05 AutomationLog          Executing returnLocator method for LOG_IN
22-08-2018 14:44:06 AutomationLog          Current URL: https://www.aquatalia.com/
22-08-2018 14:44:06 AutomationLog          Executing waitForLocator method for SHOPPING_CART
22-08-2018 14:44:11 AutomationLog          Executing isElementPresent method for SHOPPING_CART
22-08-2018 14:44:11 AutomationLog          Signed in to my account successfully in: 10.368 seconds
22-08-2018 14:44:11 AutomationLog -------------------------
22-08-2018 14:44:11 AutomationLog -------------- ACCOUNT VERIFICATION  -------------
22-08-2018 14:44:11 AutomationLog          Executing returnLocator method for SIGNED_USER
22-08-2018 14:44:11 AutomationLog --> User account verified and displayed as xxxx: HI, AUTOMATION1
22-08-2018 14:44:11 AutomationLog --------------------
22-08-2018 14:44:11 AutomationLog ----------- SHOPPING CART VERIFICATION ------------
22-08-2018 14:44:11 AutomationLog --> Clicking on the Shopping Cart button
22-08-2018 14:44:11 AutomationLog          Executing returnLocator method for SHOPPING_CART
22-08-2018 14:44:12 AutomationLog --> Removing Items from the Shopping Cart
22-08-2018 14:44:12 AutomationLog          Executing isElementPresent method for EMPTY_CART
22-08-2018 14:44:12 AutomationLog --> Shopping Cart has been emptied
22-08-2018 14:44:12 AutomationLog ----------------------
22-08-2018 14:44:12 AutomationLog ---------------------- PLP VERIFICATION ----------------------
22-08-2018 14:44:12 AutomationLog --> Navigating to the PLP
22-08-2018 14:44:12 AutomationLog          Executing waitForLocator method for PLP1
22-08-2018 14:44:17 AutomationLog          Executing returnLocator method for PLP1
22-08-2018 14:44:21 AutomationLog          Executing waitForLocator method for PDP
22-08-2018 14:44:26 AutomationLog ----------------------
22-08-2018 14:44:27 AutomationLog ---------- PDP VERIFICATION ------------
22-08-2018 14:44:27 AutomationLog --> Navigating to the PDP
22-08-2018 14:44:27 AutomationLog          Executing waitForLocator method for PDP
22-08-2018 14:44:32 AutomationLog          Executing returnLocator method for PDP
22-08-2018 14:44:35 AutomationLog          Current URL: https://www.aquatalia.com/small-flap-crossbody/d/70004C12871?CategoryId=337
22-08-2018 14:44:35 AutomationLog          Executing waitForLocator method for ADD_TO_CART
22-08-2018 14:44:40 AutomationLog          Executing isElementPresent method for SHOPPING_CART
22-08-2018 14:44:40 AutomationLog          PDP loaded successfully in: 13.235 seconds
22-08-2018 14:44:40 AutomationLog ----------------------
22-08-2018 14:44:40 AutomationLog ------------------ SIZE VERIFICATION ------------------
22-08-2018 14:44:40 AutomationLog          Executing isElementPresent method for SIZE
22-08-2018 14:46:11 AutomationLog ***** Warning: OR ISSUE with SIZE Object!. Unable to locate it @isElementPresent method and Timed out after 90 seconds waiting for visibility of element located by By.xpath: No Size is available

22-08-2018 14:46:11 AutomationLog --> No Size is available for selection
22-08-2018 14:46:11 AutomationLog ----------------------
22-08-2018 14:46:11 AutomationLog --> Clicking on the Add To Cart button
22-08-2018 14:46:11 AutomationLog          Executing returnLocator method for ADD_TO_CART
22-08-2018 14:46:11 AutomationLog          Executing waitForLocator method for SHOPPING_CART
22-08-2018 14:46:16 AutomationLog --> Performing checkout
22-08-2018 14:46:16 AutomationLog          Executing returnLocator method for SHOPPING_CART
22-08-2018 14:46:17 AutomationLog          Executing waitForLocator method for SHOPPING_CART
22-08-2018 14:46:22 AutomationLog --> Automation Test Successful
