22-08-2018 14:48:31 AutomationLog -------------- HOME PAGE LOAD VERIFICATION -----------------
22-08-2018 14:48:31 AutomationLog Deleting all the cookies!
22-08-2018 14:48:33 AutomationLog          Executing isElementPresent method for MY_ACCOUNT
22-08-2018 14:48:34 AutomationLog          Home page loaded successfully in: 2.563 seconds
22-08-2018 14:48:34 AutomationLog --------------------------
22-08-2018 14:48:34 AutomationLog ----------- MY ACCOUNT SIGN IN ------------
22-08-2018 14:48:34 AutomationLog --> Clicking on the My Account button
22-08-2018 14:48:34 AutomationLog          Current URL: https://www.aquatalia.com/
22-08-2018 14:48:34 AutomationLog          Executing returnLocator method for MY_ACCOUNT
22-08-2018 14:48:35 AutomationLog          Executing waitForLocator method for USERNAME
22-08-2018 14:48:40 AutomationLog          My Account page loaded successfully in: 5.339 seconds
22-08-2018 14:48:40 AutomationLog --> Entering the Valid Login Credentials
22-08-2018 14:48:40 AutomationLog          Executing returnLocator method for USERNAME
22-08-2018 14:48:40 AutomationLog          Executing returnLocator method for USERNAME
22-08-2018 14:48:40 AutomationLog          Executing returnLocator method for USERNAME
22-08-2018 14:48:40 AutomationLog          Executing waitForLocator method for PASSWORD
22-08-2018 14:48:45 AutomationLog          Executing returnLocator method for PASSWORD
22-08-2018 14:48:46 AutomationLog          Executing returnLocator method for PASSWORD
22-08-2018 14:48:46 AutomationLog          Executing returnLocator method for PASSWORD
22-08-2018 14:48:46 AutomationLog --> Clicking on Log-In button
22-08-2018 14:48:46 AutomationLog          Executing waitForLocator method for LOG_IN
22-08-2018 14:48:51 AutomationLog          Executing returnLocator method for LOG_IN
22-08-2018 14:48:52 AutomationLog          Current URL: https://www.aquatalia.com/
22-08-2018 14:48:52 AutomationLog          Executing waitForLocator method for SHOPPING_CART
22-08-2018 14:48:57 AutomationLog          Executing isElementPresent method for SHOPPING_CART
22-08-2018 14:48:57 AutomationLog          Signed in to my account successfully in: 10.369 seconds
22-08-2018 14:48:57 AutomationLog -------------------------
22-08-2018 14:48:57 AutomationLog -------------- ACCOUNT VERIFICATION  -------------
22-08-2018 14:48:57 AutomationLog          Executing returnLocator method for SIGNED_USER
22-08-2018 14:48:57 AutomationLog --> User account verified and displayed as xxxx: HI, AUTOMATION1
22-08-2018 14:48:57 AutomationLog --------------------
22-08-2018 14:48:57 AutomationLog ----------- SHOPPING CART VERIFICATION ------------
22-08-2018 14:48:57 AutomationLog --> Clicking on the Shopping Cart button
22-08-2018 14:48:57 AutomationLog          Executing returnLocator method for SHOPPING_CART
22-08-2018 14:48:58 AutomationLog --> Removing Items from the Shopping Cart
22-08-2018 14:48:58 AutomationLog          Executing isElementPresent method for EMPTY_CART
22-08-2018 14:48:58 AutomationLog --> Shopping Cart has been emptied
22-08-2018 14:48:58 AutomationLog ----------------------
22-08-2018 14:48:58 AutomationLog ---------------------- PLP VERIFICATION ----------------------
22-08-2018 14:48:58 AutomationLog --> Navigating to the PLP
22-08-2018 14:48:58 AutomationLog          Executing waitForLocator method for PLP1
22-08-2018 14:49:03 AutomationLog          Executing returnLocator method for PLP1
22-08-2018 14:49:06 AutomationLog          Executing waitForLocator method for PDP
22-08-2018 14:49:11 AutomationLog ----------------------
22-08-2018 14:49:12 AutomationLog ---------- PDP VERIFICATION ------------
22-08-2018 14:49:12 AutomationLog --> Navigating to the PDP
22-08-2018 14:49:12 AutomationLog          Executing waitForLocator method for PDP
22-08-2018 14:49:17 AutomationLog          Executing returnLocator method for PDP
22-08-2018 14:49:20 AutomationLog          Current URL: https://www.aquatalia.com/small-flap-crossbody/d/70004C12871?CategoryId=337
22-08-2018 14:49:20 AutomationLog          Executing waitForLocator method for ADD_TO_CART
22-08-2018 14:49:25 AutomationLog          Executing isElementPresent method for SHOPPING_CART
22-08-2018 14:49:26 AutomationLog          PDP loaded successfully in: 13.045 seconds
22-08-2018 14:49:26 AutomationLog ----------------------
22-08-2018 14:49:26 AutomationLog ------------------ SIZE VERIFICATION ------------------
22-08-2018 14:49:26 AutomationLog          Executing isElementPresent method for SIZE
22-08-2018 14:50:56 AutomationLog ***** Warning: OR ISSUE with SIZE Object!. Unable to locate it @isElementPresent method and Timed out after 90 seconds waiting for visibility of element located by By.xpath: No Size is available

22-08-2018 14:50:56 AutomationLog --> No Size is available for selection
22-08-2018 14:50:56 AutomationLog ----------------------
22-08-2018 14:50:56 AutomationLog --> Clicking on the Add To Cart button
22-08-2018 14:50:56 AutomationLog          Executing returnLocator method for ADD_TO_CART
22-08-2018 14:50:56 AutomationLog          Executing waitForLocator method for SHOPPING_CART
22-08-2018 14:51:01 AutomationLog --> Performing checkout
22-08-2018 14:51:01 AutomationLog          Executing returnLocator method for SHOPPING_CART
22-08-2018 14:51:02 AutomationLog          Executing waitForLocator method for SHOPPING_CART
22-08-2018 14:51:07 AutomationLog -->
22-08-2018 14:51:07 AutomationLog --> Automation Test Successful
