22-08-2018 09:15:26 AutomationLog -------------- HOME PAGE LOAD VERIFICATION -----------------
22-08-2018 09:15:26 AutomationLog Deleting all the cookies!
22-08-2018 09:15:28 AutomationLog          Executing isElementPresent method for MY_ACCOUNT
22-08-2018 09:15:29 AutomationLog          Home page loaded successfully in: 2.235 seconds
22-08-2018 09:15:29 AutomationLog --------------------------
22-08-2018 09:15:29 AutomationLog ----------- MY ACCOUNT SIGN IN ------------
22-08-2018 09:15:29 AutomationLog --> Clicking on the My Account button
22-08-2018 09:15:29 AutomationLog          Current URL: https://www.aquatalia.com/
22-08-2018 09:15:29 AutomationLog          Executing returnLocator method for MY_ACCOUNT
22-08-2018 09:15:29 AutomationLog          Executing waitForLocator method for USERNAME
22-08-2018 09:15:35 AutomationLog          My Account page loaded successfully in: 5.876 seconds
22-08-2018 09:15:35 AutomationLog --> Entering the Valid Login Credentials
22-08-2018 09:15:35 AutomationLog          Executing returnLocator method for USERNAME
22-08-2018 09:15:35 AutomationLog          Executing returnLocator method for USERNAME
22-08-2018 09:15:35 AutomationLog          Executing returnLocator method for USERNAME
22-08-2018 09:15:35 AutomationLog          Executing waitForLocator method for PASSWORD
22-08-2018 09:15:40 AutomationLog          Executing returnLocator method for PASSWORD
22-08-2018 09:15:41 AutomationLog          Executing returnLocator method for PASSWORD
22-08-2018 09:15:41 AutomationLog          Executing returnLocator method for PASSWORD
22-08-2018 09:15:41 AutomationLog --> Clicking on Log-In button
22-08-2018 09:15:41 AutomationLog          Executing waitForLocator method for LOG_IN
22-08-2018 09:15:46 AutomationLog          Executing returnLocator method for LOG_IN
22-08-2018 09:15:52 AutomationLog          Current URL: https://www.aquatalia.com/
22-08-2018 09:15:52 AutomationLog          Executing waitForLocator method for SHOPPING_CART
22-08-2018 09:15:57 AutomationLog          Executing isElementPresent method for SHOPPING_CART
22-08-2018 09:15:57 AutomationLog          Signed in to my account successfully in: 15.513 seconds
22-08-2018 09:15:57 AutomationLog -------------------------
22-08-2018 09:15:57 AutomationLog -------------- ACCOUNT VERIFICATION  -------------
22-08-2018 09:15:57 AutomationLog          Executing returnLocator method for SIGNED_USER
22-08-2018 09:15:58 AutomationLog --> User account verified and displayed as xxxx: HI, AUTOMATION1
22-08-2018 09:15:58 AutomationLog --------------------
22-08-2018 09:15:58 AutomationLog ----------- SHOPPING CART VERIFICATION ------------
22-08-2018 09:15:58 AutomationLog --> Clicking on the Shopping Cart button
22-08-2018 09:15:58 AutomationLog          Executing returnLocator method for SHOPPING_CART
22-08-2018 09:16:03 AutomationLog --> Removing Items from the Shopping Cart
22-08-2018 09:16:03 AutomationLog          Executing isElementPresent method for EMPTY_CART
22-08-2018 09:16:04 AutomationLog --> Shopping Cart has been emptied
22-08-2018 09:16:04 AutomationLog ----------------------
22-08-2018 09:16:04 AutomationLog --> Automation Test Successful
