Key : Content-Type ,Value : text/html; charset=utf-8
Key : ETag ,Value : 12716733
Key : Vary ,Value : *, Accept-Encoding
Key : X-Generator ,Value : Orchard
Key : X-Cached-On ,Value : Wed, 22 Aug 2018 15:28:29 GMT
Key : X-Cached-Until ,Value : Thu, 23 Aug 2018 15:28:29 GMT
Key : Access-Control-Allow-Origin ,Value : *
Key : Access-Control-Allow-Headers ,Value : X-Requested-With, Content-Type
Key : X-OS-Node ,Value : 22.3.127
Key : Cache-Control ,Value : public, max-age=1800
Key : X-Yottaa-Optimizations ,Value : ob/1000000100001000 si/3211a5fec63a-1519845472-2079174669 tts/1534792748574 ti/579f8a312bb0ac2ef1000025 ai/579f8a302bb0ac2ef100001b tm/0
Key : Date ,Value : Wed, 22 Aug 2018 15:31:06 GMT
Key : Age ,Value : 0
Key : Connection ,Value : keep-alive
Key : X-Yottaa-Metrics ,Value : 3221a5fec613/[125,95,-] 3211a5fec63a/[-,142.620]
