frame,k_bend,mean,var
0,13,1.1780361266363026,0.018198156588664513
0,26,1.1762526807091305,0.01666478807877143
2000,13,1.1556500247010608,0.030391791865293574
2000,26,1.145720946023116,0.03127160044832994
4000,13,1.1505734093901303,0.03270953004086138
4000,26,1.1632457355571826,0.03316071301239414
