info face="Arial-Black" size=24 bold=0 italic=0 charset="" unicode=0 stretchH=100 smooth=1 aa=1 padding=1,1,1,1 spacing=-2,-2
common lineHeight=35 base=27 scaleW=512 scaleH=512 pages=1 packed=0
page id=0 file="font.png"
chars count=97
char id=0       x=107  y=47   width=14   height=17   xoffset=-1   yoffset=11   xadvance=18   page=0    chnl=0 
char id=10      x=0    y=0    width=0    height=0    xoffset=-1   yoffset=0    xadvance=0    page=0    chnl=0 
char id=32      x=0    y=0    width=0    height=0    xoffset=-1   yoffset=0    xadvance=8    page=0    chnl=0 
char id=33      x=503  y=26   width=8    height=20   xoffset=0    yoffset=8    xadvance=8    page=0    chnl=0 
char id=34      x=429  y=47   width=14   height=10   xoffset=-1   yoffset=8    xadvance=12   page=0    chnl=0 
char id=35      x=487  y=0    width=18   height=21   xoffset=-1   yoffset=8    xadvance=16   page=0    chnl=0 
char id=36      x=83   y=0    width=18   height=24   xoffset=-1   yoffset=7    xadvance=16   page=0    chnl=0 
char id=37      x=463  y=0    width=24   height=21   xoffset=0    yoffset=8    xadvance=24   page=0    chnl=0 
char id=38      x=0    y=26   width=22   height=21   xoffset=0    yoffset=8    xadvance=21   page=0    chnl=0 
char id=39      x=443  y=47   width=8    height=10   xoffset=-1   yoffset=8    xadvance=7    page=0    chnl=0 
char id=40      x=12   y=0    width=10   height=26   xoffset=0    yoffset=8    xadvance=9    page=0    chnl=0 
char id=41      x=22   y=0    width=11   height=26   xoffset=-1   yoffset=8    xadvance=9    page=0    chnl=0 
char id=42      x=417  y=47   width=12   height=12   xoffset=1    yoffset=8    xadvance=13   page=0    chnl=0 
char id=43      x=361  y=47   width=16   height=15   xoffset=0    yoffset=11   xadvance=16   page=0    chnl=0 
char id=44      x=409  y=47   width=8    height=12   xoffset=0    yoffset=21   xadvance=8    page=0    chnl=0 
char id=45      x=483  y=47   width=10   height=7    xoffset=-1   yoffset=17   xadvance=8    page=0    chnl=0 
char id=46      x=475  y=47   width=8    height=7    xoffset=0    yoffset=21   xadvance=8    page=0    chnl=0 
char id=47      x=444  y=0    width=9    height=21   xoffset=-1   yoffset=8    xadvance=7    page=0    chnl=0 
char id=48      x=426  y=0    width=18   height=21   xoffset=-1   yoffset=8    xadvance=16   page=0    chnl=0 
char id=49      x=490  y=26   width=13   height=20   xoffset=0    yoffset=8    xadvance=16   page=0    chnl=0 
char id=50      x=0    y=47   width=17   height=20   xoffset=-1   yoffset=8    xadvance=16   page=0    chnl=0 
char id=51      x=338  y=0    width=18   height=21   xoffset=-1   yoffset=8    xadvance=16   page=0    chnl=0 
char id=52      x=17   y=47   width=18   height=20   xoffset=-1   yoffset=8    xadvance=16   page=0    chnl=0 
char id=53      x=356  y=0    width=18   height=21   xoffset=-1   yoffset=8    xadvance=16   page=0    chnl=0 
char id=54      x=374  y=0    width=17   height=21   xoffset=0    yoffset=8    xadvance=16   page=0    chnl=0 
char id=55      x=35   y=47   width=16   height=20   xoffset=0    yoffset=8    xadvance=16   page=0    chnl=0 
char id=56      x=391  y=0    width=18   height=21   xoffset=-1   yoffset=8    xadvance=16   page=0    chnl=0 
char id=57      x=409  y=0    width=17   height=21   xoffset=-1   yoffset=8    xadvance=16   page=0    chnl=0 
char id=58      x=353  y=47   width=8    height=15   xoffset=0    yoffset=13   xadvance=8    page=0    chnl=0 
char id=59      x=67   y=47   width=8    height=20   xoffset=0    yoffset=13   xadvance=8    page=0    chnl=0 
char id=60      x=75   y=47   width=16   height=17   xoffset=0    yoffset=10   xadvance=16   page=0    chnl=0 
char id=61      x=393  y=47   width=16   height=13   xoffset=0    yoffset=12   xadvance=16   page=0    chnl=0 
char id=62      x=91   y=47   width=16   height=17   xoffset=0    yoffset=10   xadvance=16   page=0    chnl=0 
char id=63      x=51   y=47   width=16   height=20   xoffset=-1   yoffset=8    xadvance=15   page=0    chnl=0 
char id=64      x=101  y=0    width=21   height=23   xoffset=-2   yoffset=8    xadvance=18   page=0    chnl=0 
char id=65      x=22   y=26   width=21   height=20   xoffset=-1   yoffset=8    xadvance=19   page=0    chnl=0 
char id=66      x=43   y=26   width=19   height=20   xoffset=0    yoffset=8    xadvance=19   page=0    chnl=0 
char id=67      x=143  y=0    width=19   height=21   xoffset=0    yoffset=8    xadvance=19   page=0    chnl=0 
char id=68      x=62   y=26   width=19   height=20   xoffset=0    yoffset=8    xadvance=19   page=0    chnl=0 
char id=69      x=81   y=26   width=18   height=20   xoffset=0    yoffset=8    xadvance=17   page=0    chnl=0 
char id=70      x=99   y=26   width=16   height=20   xoffset=0    yoffset=8    xadvance=16   page=0    chnl=0 
char id=71      x=162  y=0    width=20   height=21   xoffset=0    yoffset=8    xadvance=20   page=0    chnl=0 
char id=72      x=115  y=26   width=20   height=20   xoffset=0    yoffset=8    xadvance=20   page=0    chnl=0 
char id=73      x=135  y=26   width=9    height=20   xoffset=0    yoffset=8    xadvance=9    page=0    chnl=0 
char id=74      x=182  y=0    width=17   height=21   xoffset=-1   yoffset=8    xadvance=16   page=0    chnl=0 
char id=75      x=144  y=26   width=21   height=20   xoffset=0    yoffset=8    xadvance=20   page=0    chnl=0 
char id=76      x=165  y=26   width=17   height=20   xoffset=0    yoffset=8    xadvance=16   page=0    chnl=0 
char id=77      x=182  y=26   width=23   height=20   xoffset=0    yoffset=8    xadvance=23   page=0    chnl=0 
char id=78      x=205  y=26   width=20   height=20   xoffset=0    yoffset=8    xadvance=20   page=0    chnl=0 
char id=79      x=199  y=0    width=20   height=21   xoffset=0    yoffset=8    xadvance=20   page=0    chnl=0 
char id=80      x=225  y=26   width=18   height=20   xoffset=0    yoffset=8    xadvance=17   page=0    chnl=0 
char id=81      x=122  y=0    width=21   height=22   xoffset=0    yoffset=8    xadvance=20   page=0    chnl=0 
char id=82      x=243  y=26   width=20   height=20   xoffset=0    yoffset=8    xadvance=19   page=0    chnl=0 
char id=83      x=219  y=0    width=19   height=21   xoffset=-1   yoffset=8    xadvance=17   page=0    chnl=0 
char id=84      x=263  y=26   width=19   height=20   xoffset=-1   yoffset=8    xadvance=17   page=0    chnl=0 
char id=85      x=238  y=0    width=20   height=21   xoffset=0    yoffset=8    xadvance=20   page=0    chnl=0 
char id=86      x=282  y=26   width=21   height=20   xoffset=-1   yoffset=8    xadvance=19   page=0    chnl=0 
char id=87      x=303  y=26   width=28   height=20   xoffset=-2   yoffset=8    xadvance=24   page=0    chnl=0 
char id=88      x=331  y=26   width=21   height=20   xoffset=-1   yoffset=8    xadvance=19   page=0    chnl=0 
char id=89      x=352  y=26   width=21   height=20   xoffset=-1   yoffset=8    xadvance=19   page=0    chnl=0 
char id=90      x=373  y=26   width=19   height=20   xoffset=-1   yoffset=8    xadvance=17   page=0    chnl=0 
char id=91      x=57   y=0    width=10   height=25   xoffset=0    yoffset=8    xadvance=9    page=0    chnl=0 
char id=92      x=453  y=0    width=10   height=21   xoffset=-2   yoffset=8    xadvance=7    page=0    chnl=0 
char id=93      x=67   y=0    width=10   height=25   xoffset=-1   yoffset=8    xadvance=9    page=0    chnl=0 
char id=94      x=377  y=47   width=16   height=13   xoffset=0    yoffset=8    xadvance=16   page=0    chnl=0 
char id=95      x=493  y=47   width=16   height=4    xoffset=-2   yoffset=27   xadvance=12   page=0    chnl=0 
char id=96      x=467  y=47   width=8    height=7    xoffset=-1   yoffset=8    xadvance=8    page=0    chnl=0 
char id=97      x=121  y=47   width=18   height=16   xoffset=-1   yoffset=13   xadvance=16   page=0    chnl=0 
char id=98      x=258  y=0    width=17   height=21   xoffset=0    yoffset=8    xadvance=16   page=0    chnl=0 
char id=99      x=139  y=47   width=18   height=16   xoffset=-1   yoffset=13   xadvance=16   page=0    chnl=0 
char id=100     x=275  y=0    width=17   height=21   xoffset=-1   yoffset=8    xadvance=16   page=0    chnl=0 
char id=101     x=157  y=47   width=18   height=16   xoffset=-1   yoffset=13   xadvance=16   page=0    chnl=0 
char id=102     x=392  y=26   width=14   height=20   xoffset=-1   yoffset=8    xadvance=9    page=0    chnl=0 
char id=103     x=292  y=0    width=17   height=21   xoffset=-1   yoffset=13   xadvance=16   page=0    chnl=0 
char id=104     x=406  y=26   width=16   height=20   xoffset=0    yoffset=8    xadvance=16   page=0    chnl=0 
char id=105     x=422  y=26   width=8    height=20   xoffset=0    yoffset=8    xadvance=8    page=0    chnl=0 
char id=106     x=0    y=0    width=12   height=26   xoffset=-3   yoffset=8    xadvance=8    page=0    chnl=0 
char id=107     x=430  y=26   width=18   height=20   xoffset=0    yoffset=8    xadvance=16   page=0    chnl=0 
char id=108     x=448  y=26   width=8    height=20   xoffset=0    yoffset=8    xadvance=8    page=0    chnl=0 
char id=109     x=225  y=47   width=24   height=15   xoffset=0    yoffset=13   xadvance=24   page=0    chnl=0 
char id=110     x=249  y=47   width=16   height=15   xoffset=0    yoffset=13   xadvance=16   page=0    chnl=0 
char id=111     x=175  y=47   width=18   height=16   xoffset=-1   yoffset=13   xadvance=16   page=0    chnl=0 
char id=112     x=456  y=26   width=17   height=20   xoffset=0    yoffset=13   xadvance=16   page=0    chnl=0 
char id=113     x=473  y=26   width=17   height=20   xoffset=-1   yoffset=13   xadvance=16   page=0    chnl=0 
char id=114     x=265  y=47   width=13   height=15   xoffset=0    yoffset=13   xadvance=11   page=0    chnl=0 
char id=115     x=193  y=47   width=16   height=16   xoffset=-1   yoffset=13   xadvance=15   page=0    chnl=0 
char id=116     x=309  y=0    width=12   height=21   xoffset=-1   yoffset=8    xadvance=11   page=0    chnl=0 
char id=117     x=209  y=47   width=16   height=16   xoffset=0    yoffset=13   xadvance=16   page=0    chnl=0 
char id=118     x=278  y=47   width=17   height=15   xoffset=-1   yoffset=13   xadvance=15   page=0    chnl=0 
char id=119     x=295  y=47   width=25   height=15   xoffset=-1   yoffset=13   xadvance=23   page=0    chnl=0 
char id=120     x=320  y=47   width=18   height=15   xoffset=-1   yoffset=13   xadvance=16   page=0    chnl=0 
char id=121     x=321  y=0    width=17   height=21   xoffset=-1   yoffset=13   xadvance=15   page=0    chnl=0 
char id=122     x=338  y=47   width=15   height=15   xoffset=-1   yoffset=13   xadvance=13   page=0    chnl=0 
char id=123     x=33   y=0    width=12   height=26   xoffset=-1   yoffset=8    xadvance=9    page=0    chnl=0 
char id=124     x=77   y=0    width=6    height=25   xoffset=0    yoffset=8    xadvance=7    page=0    chnl=0 
char id=125     x=45   y=0    width=12   height=26   xoffset=-1   yoffset=8    xadvance=9    page=0    chnl=0 
char id=126     x=451  y=47   width=16   height=9    xoffset=0    yoffset=14   xadvance=16   page=0    chnl=0 
