{
  "dependencies": {
    "storage1": {
      "resourceId": "/subscriptions/[parameters('subscriptionId')]/resourceGroups/[parameters('resourceGroupName')]/providers/Microsoft.Storage/storageAccounts/storageaccountfinala8c6",
      "type": "storage.azure",
      "connectionId": "AzureWebJobsStorage"
    }
  }
}