<svg width="1920" height="807" viewBox="0 0 1920 807" fill="none" xmlns="http://www.w3.org/2000/svg">
  <path
    d="M1812.09 601.618C1786.47 576.002 1786.47 534.47 1812.09 508.854C1837.7 483.238 1879.24 483.238 1904.85 508.854C1930.47 534.47 1930.47 576.002 1904.85 601.618C1879.24 627.234 1837.7 627.234 1812.09 601.618Z"
    stroke="#CFC2E7" stroke-miterlimit="10" />
  <path
    d="M1819.11 594.601C1797.36 572.86 1797.36 537.612 1819.11 515.871C1840.85 494.13 1876.09 494.13 1897.83 515.871C1919.58 537.612 1919.58 572.86 1897.83 594.601C1876.09 616.341 1840.85 616.341 1819.11 594.601Z"
    stroke="#CFC2E7" stroke-miterlimit="10" />
  <path
    d="M1826.82 588.588C1808.39 571.104 1807.63 541.996 1825.12 523.574C1842.6 505.152 1871.71 504.392 1890.13 521.877C1908.55 539.361 1909.31 568.469 1891.83 586.891C1874.35 605.313 1845.24 606.073 1826.82 588.588Z"
    stroke="#CFC2E7" stroke-miterlimit="10" />
  <path
    d="M1834.17 581.877C1819.46 568.454 1818.41 545.644 1831.83 530.928C1845.25 516.213 1868.06 515.165 1882.78 528.587C1897.5 542.01 1898.54 564.821 1885.12 579.536C1871.7 594.252 1848.89 595.3 1834.17 581.877Z"
    stroke="#CFC2E7" stroke-miterlimit="10" />
  <path
    d="M1841.25 574.888C1830.4 565.371 1829.31 548.856 1838.83 538.001C1848.34 527.145 1864.86 526.06 1875.72 535.577C1886.57 545.095 1887.66 561.61 1878.14 572.465C1868.62 583.321 1852.11 584.405 1841.25 574.888Z"
    stroke="#CFC2E7" stroke-miterlimit="10" />
  <path
    d="M1842.35 555.218C1842.35 564.174 1849.61 571.435 1858.57 571.435C1867.52 571.435 1874.78 564.174 1874.78 555.218C1874.78 546.263 1867.52 539.001 1858.57 539.001C1849.61 539.001 1842.35 546.021 1842.35 555.218Z"
    stroke="#CFC2E7" stroke-miterlimit="10" />
  <path
    d="M1852.03 555.218C1852.03 558.849 1854.93 561.512 1858.32 561.512C1861.95 561.512 1864.62 558.607 1864.62 555.218C1864.62 551.588 1861.71 548.925 1858.32 548.925C1854.93 548.683 1852.03 551.588 1852.03 555.218Z"
    stroke="#CFC2E7" stroke-miterlimit="10" />
  <path fill-rule="evenodd" clip-rule="evenodd"
    d="M1718.23 666V659H1716.23V666H1709.23V668H1716.23V675H1718.23V668H1725.23V666H1718.23Z" fill="#CFC2E7" />
  <path
    d="M1880.11 724.564C1880.11 726.501 1881.81 728.195 1883.74 728.195C1885.68 728.195 1887.37 726.501 1887.37 724.564C1887.37 722.628 1885.68 720.934 1883.74 720.934C1881.81 721.176 1880.11 722.628 1880.11 724.564Z"
    fill="#CFC2E7" />
  <path
    d="M1857.84 724.564C1857.84 726.501 1859.54 728.195 1861.48 728.195C1863.41 728.195 1865.11 726.501 1865.11 724.564C1865.11 722.628 1863.41 720.934 1861.48 720.934C1859.54 721.176 1857.84 722.628 1857.84 724.564Z"
    fill="#CFC2E7" />
  <path
    d="M1835.58 724.564C1835.58 726.501 1837.27 728.195 1839.21 728.195C1841.14 728.195 1842.84 726.501 1842.84 724.564C1842.84 722.628 1841.14 720.934 1839.21 720.934C1837.27 721.176 1835.58 722.628 1835.58 724.564Z"
    fill="#CFC2E7" />
  <path
    d="M1813.31 724.564C1813.31 726.501 1815 728.195 1816.94 728.195C1818.88 728.195 1820.57 726.501 1820.57 724.564C1820.57 722.628 1818.88 720.934 1816.94 720.934C1815 721.176 1813.31 722.628 1813.31 724.564Z"
    fill="#CFC2E7" />
  <path
    d="M1791.04 724.564C1791.04 726.501 1792.73 728.195 1794.67 728.195C1796.61 728.195 1798.3 726.501 1798.3 724.564C1798.3 722.628 1796.61 720.934 1794.67 720.934C1792.73 721.176 1791.04 722.628 1791.04 724.564Z"
    fill="#CFC2E7" />
  <path
    d="M1880.11 746.833C1880.11 748.769 1881.81 750.463 1883.74 750.463C1885.68 750.463 1887.37 748.769 1887.37 746.833C1887.37 744.896 1885.68 743.202 1883.74 743.202C1881.81 743.444 1880.11 744.896 1880.11 746.833Z"
    fill="#CFC2E7" />
  <path
    d="M1857.84 746.833C1857.84 748.769 1859.54 750.463 1861.48 750.463C1863.41 750.463 1865.11 748.769 1865.11 746.833C1865.11 744.896 1863.41 743.202 1861.48 743.202C1859.54 743.444 1857.84 744.896 1857.84 746.833Z"
    fill="#CFC2E7" />
  <path
    d="M1835.58 746.833C1835.58 748.769 1837.27 750.463 1839.21 750.463C1841.14 750.463 1842.84 748.769 1842.84 746.833C1842.84 744.896 1841.14 743.202 1839.21 743.202C1837.27 743.444 1835.58 744.896 1835.58 746.833Z"
    fill="#CFC2E7" />
  <path
    d="M1813.31 746.833C1813.31 748.769 1815 750.463 1816.94 750.463C1818.88 750.463 1820.57 748.769 1820.57 746.833C1820.57 744.896 1818.88 743.202 1816.94 743.202C1815 743.444 1813.31 744.896 1813.31 746.833Z"
    fill="#CFC2E7" />
  <path
    d="M1791.04 746.833C1791.04 748.769 1792.73 750.463 1794.67 750.463C1796.61 750.463 1798.3 748.769 1798.3 746.833C1798.3 744.896 1796.61 743.202 1794.67 743.202C1792.73 743.444 1791.04 744.896 1791.04 746.833Z"
    fill="#CFC2E7" />
  <path
    d="M1880.11 769.101C1880.11 771.037 1881.81 772.732 1883.74 772.732C1885.68 772.732 1887.37 771.037 1887.37 769.101C1887.37 767.165 1885.68 765.47 1883.74 765.47C1881.81 765.712 1880.11 767.165 1880.11 769.101Z"
    fill="#CFC2E7" />
  <path
    d="M1857.84 769.101C1857.84 771.037 1859.54 772.732 1861.48 772.732C1863.41 772.732 1865.11 771.037 1865.11 769.101C1865.11 767.165 1863.41 765.47 1861.48 765.47C1859.54 765.712 1857.84 767.165 1857.84 769.101Z"
    fill="#CFC2E7" />
  <path
    d="M1835.58 769.101C1835.58 771.037 1837.27 772.732 1839.21 772.732C1841.14 772.732 1842.84 771.037 1842.84 769.101C1842.84 767.165 1841.14 765.47 1839.21 765.47C1837.27 765.712 1835.58 767.165 1835.58 769.101Z"
    fill="#CFC2E7" />
  <path
    d="M1813.31 769.101C1813.31 771.037 1815 772.732 1816.94 772.732C1818.88 772.732 1820.57 771.037 1820.57 769.101C1820.57 767.165 1818.88 765.47 1816.94 765.47C1815 765.712 1813.31 767.165 1813.31 769.101Z"
    fill="#CFC2E7" />
  <path
    d="M1791.04 769.101C1791.04 771.037 1792.73 772.732 1794.67 772.732C1796.61 772.732 1798.3 771.037 1798.3 769.101C1798.3 767.165 1796.61 765.47 1794.67 765.47C1792.73 765.712 1791.04 767.165 1791.04 769.101Z"
    fill="#CFC2E7" />
  <path
    d="M1880.11 791.369C1880.11 793.306 1881.81 795 1883.74 795C1885.68 795 1887.37 793.306 1887.37 791.369C1887.37 789.433 1885.68 787.739 1883.74 787.739C1881.81 787.981 1880.11 789.433 1880.11 791.369Z"
    fill="#CFC2E7" />
  <path
    d="M1857.84 791.369C1857.84 793.306 1859.54 795 1861.48 795C1863.41 795 1865.11 793.306 1865.11 791.369C1865.11 789.433 1863.41 787.739 1861.48 787.739C1859.54 787.981 1857.84 789.433 1857.84 791.369Z"
    fill="#CFC2E7" />
  <path
    d="M1835.58 791.369C1835.58 793.306 1837.27 795 1839.21 795C1841.14 795 1842.84 793.306 1842.84 791.369C1842.84 789.433 1841.14 787.739 1839.21 787.739C1837.27 787.981 1835.58 789.433 1835.58 791.369Z"
    fill="#CFC2E7" />
  <path
    d="M1813.31 791.369C1813.31 793.306 1815 795 1816.94 795C1818.88 795 1820.57 793.306 1820.57 791.369C1820.57 789.433 1818.88 787.739 1816.94 787.739C1815 787.981 1813.31 789.433 1813.31 791.369Z"
    fill="#CFC2E7" />
  <path
    d="M1791.04 791.369C1791.04 793.306 1792.73 795 1794.67 795C1796.61 795 1798.3 793.306 1798.3 791.369C1798.3 789.433 1796.61 787.739 1794.67 787.739C1792.73 787.981 1791.04 789.433 1791.04 791.369Z"
    fill="#CFC2E7" />
  <path
    d="M1886.81 380.286C1886.81 385.127 1890.68 389 1895.52 389C1900.36 389 1904.23 385.127 1904.23 380.286C1904.23 375.445 1900.36 371.573 1895.52 371.573C1890.68 371.573 1886.81 375.445 1886.81 380.286Z"
    stroke="#CFC2E7" stroke-width="2" stroke-miterlimit="10" stroke-linecap="round" />
  <path fill-rule="evenodd" clip-rule="evenodd"
    d="M243.234 741V734H241.234V741H234.234V743H241.234V750H243.234V743H250.234V741H243.234Z" fill="#CFC2E7" />
  <path
    d="M524.645 752.794C524.645 754.284 525.949 755.588 527.44 755.588C528.93 755.588 530.234 754.284 530.234 752.794C530.234 751.304 528.93 750 527.44 750C525.949 750.186 524.645 751.304 524.645 752.794Z"
    fill="#CFC2E7" />
  <path
    d="M507.508 752.794C507.508 754.284 508.812 755.588 510.303 755.588C511.793 755.588 513.097 754.284 513.097 752.794C513.097 751.304 511.793 750 510.303 750C508.812 750.186 507.508 751.304 507.508 752.794Z"
    fill="#CFC2E7" />
  <path
    d="M490.371 752.794C490.371 754.284 491.675 755.588 493.166 755.588C494.656 755.588 495.96 754.284 495.96 752.794C495.96 751.304 494.656 750 493.166 750C491.675 750.186 490.371 751.304 490.371 752.794Z"
    fill="#CFC2E7" />
  <path
    d="M473.234 752.794C473.234 754.284 474.537 755.588 476.028 755.588C477.518 755.588 478.822 754.284 478.822 752.794C478.822 751.304 477.518 750 476.028 750C474.537 750.186 473.234 751.304 473.234 752.794Z"
    fill="#CFC2E7" />
  <path
    d="M456.097 752.794C456.097 754.284 457.401 755.588 458.891 755.588C460.381 755.588 461.685 754.284 461.685 752.794C461.685 751.304 460.381 750 458.891 750C457.401 750.186 456.097 751.304 456.097 752.794Z"
    fill="#CFC2E7" />
  <path
    d="M524.646 769.931C524.646 771.422 525.95 772.726 527.44 772.726C528.93 772.726 530.234 771.422 530.234 769.931C530.234 768.441 528.93 767.137 527.44 767.137C525.95 767.324 524.646 768.441 524.646 769.931Z"
    fill="#CFC2E7" />
  <path
    d="M507.508 769.931C507.508 771.422 508.812 772.726 510.303 772.726C511.793 772.726 513.097 771.422 513.097 769.931C513.097 768.441 511.793 767.137 510.303 767.137C508.812 767.324 507.508 768.441 507.508 769.931Z"
    fill="#CFC2E7" />
  <path
    d="M490.371 769.931C490.371 771.422 491.675 772.726 493.166 772.726C494.656 772.726 495.96 771.422 495.96 769.931C495.96 768.441 494.656 767.137 493.166 767.137C491.675 767.324 490.371 768.441 490.371 769.931Z"
    fill="#CFC2E7" />
  <path
    d="M473.234 769.931C473.234 771.422 474.537 772.726 476.028 772.726C477.518 772.726 478.822 771.422 478.822 769.931C478.822 768.441 477.518 767.137 476.028 767.137C474.537 767.324 473.234 768.441 473.234 769.931Z"
    fill="#CFC2E7" />
  <path
    d="M456.097 769.931C456.097 771.422 457.401 772.726 458.891 772.726C460.381 772.726 461.685 771.422 461.685 769.931C461.685 768.441 460.381 767.137 458.891 767.137C457.401 767.324 456.097 768.441 456.097 769.931Z"
    fill="#CFC2E7" />
  <path
    d="M524.646 787.069C524.646 788.559 525.95 789.863 527.44 789.863C528.93 789.863 530.234 788.559 530.234 787.069C530.234 785.578 528.93 784.274 527.44 784.274C525.95 784.461 524.646 785.578 524.646 787.069Z"
    fill="#CFC2E7" />
  <path
    d="M507.508 787.069C507.508 788.559 508.812 789.863 510.303 789.863C511.793 789.863 513.097 788.559 513.097 787.069C513.097 785.578 511.793 784.274 510.303 784.274C508.812 784.461 507.508 785.578 507.508 787.069Z"
    fill="#CFC2E7" />
  <path
    d="M490.371 787.069C490.371 788.559 491.675 789.863 493.166 789.863C494.656 789.863 495.96 788.559 495.96 787.069C495.96 785.578 494.656 784.274 493.166 784.274C491.675 784.461 490.371 785.578 490.371 787.069Z"
    fill="#CFC2E7" />
  <path
    d="M473.234 787.069C473.234 788.559 474.537 789.863 476.028 789.863C477.518 789.863 478.822 788.559 478.822 787.069C478.822 785.578 477.518 784.274 476.028 784.274C474.537 784.461 473.234 785.578 473.234 787.069Z"
    fill="#CFC2E7" />
  <path
    d="M456.097 787.069C456.097 788.559 457.401 789.863 458.891 789.863C460.381 789.863 461.685 788.559 461.685 787.069C461.685 785.578 460.381 784.274 458.891 784.274C457.401 784.461 456.097 785.578 456.097 787.069Z"
    fill="#CFC2E7" />
  <path
    d="M524.646 804.206C524.646 805.696 525.95 807 527.44 807C528.93 807 530.234 805.696 530.234 804.206C530.234 802.716 528.93 801.412 527.44 801.412C525.95 801.598 524.646 802.716 524.646 804.206Z"
    fill="#CFC2E7" />
  <path
    d="M507.508 804.206C507.508 805.696 508.812 807 510.303 807C511.793 807 513.097 805.696 513.097 804.206C513.097 802.716 511.793 801.412 510.303 801.412C508.812 801.598 507.508 802.716 507.508 804.206Z"
    fill="#CFC2E7" />
  <path
    d="M490.371 804.206C490.371 805.696 491.675 807 493.166 807C494.656 807 495.96 805.696 495.96 804.206C495.96 802.716 494.656 801.412 493.166 801.412C491.675 801.598 490.371 802.716 490.371 804.206Z"
    fill="#CFC2E7" />
  <path
    d="M473.234 804.206C473.234 805.696 474.537 807 476.028 807C477.518 807 478.822 805.696 478.822 804.206C478.822 802.716 477.518 801.412 476.028 801.412C474.537 801.598 473.234 802.716 473.234 804.206Z"
    fill="#CFC2E7" />
  <path
    d="M456.097 804.206C456.097 805.696 457.401 807 458.891 807C460.381 807 461.685 805.696 461.685 804.206C461.685 802.716 460.381 801.412 458.891 801.412C457.401 801.598 456.097 802.716 456.097 804.206Z"
    fill="#CFC2E7" />
  <path
    d="M138.909 589.662C138.909 592.682 141.552 595.324 144.572 595.324C147.591 595.324 150.234 592.682 150.234 589.662C150.234 586.642 147.591 584 144.572 584C141.174 584.378 138.909 586.642 138.909 589.662Z"
    fill="#CFC2E7" />
  <path
    d="M104.183 589.662C104.183 592.682 106.825 595.324 109.845 595.324C112.865 595.324 115.507 592.682 115.507 589.662C115.507 586.643 112.865 584 109.845 584C106.448 584.378 104.183 586.643 104.183 589.662Z"
    fill="#CFC2E7" />
  <path
    d="M69.4556 589.662C69.4556 592.682 72.0979 595.324 75.1177 595.324C78.1375 595.324 80.7798 592.682 80.7798 589.662C80.7798 586.643 78.1375 584 75.1177 584C72.0979 584 69.4556 586.643 69.4556 589.662Z"
    fill="#CFC2E7" />
  <path
    d="M34.7271 589.662C34.7271 592.682 37.3694 595.324 40.3892 595.324C43.409 595.324 46.0513 592.682 46.0513 589.662C46.0513 586.643 43.409 584 40.3892 584C37.3694 584 34.7271 586.643 34.7271 589.662Z"
    fill="#CFC2E7" />
  <path
    d="M-5.62668e-05 589.662C-5.62668e-05 592.682 2.64225 595.324 5.66202 595.324C8.68179 595.324 11.3241 592.682 11.3241 589.662C11.3241 586.643 8.68179 584 5.66202 584C2.26477 584.378 -5.62668e-05 586.643 -5.62668e-05 589.662Z"
    fill="#CFC2E7" />
  <path
    d="M138.91 624.39C138.91 627.41 141.552 630.052 144.572 630.052C147.592 630.052 150.234 627.41 150.234 624.39C150.234 621.37 147.592 618.728 144.572 618.728C141.175 619.105 138.91 621.37 138.91 624.39Z"
    fill="#CFC2E7" />
  <path
    d="M104.183 624.39C104.183 627.41 106.825 630.052 109.845 630.052C112.865 630.052 115.507 627.41 115.507 624.39C115.507 621.37 112.865 618.728 109.845 618.728C106.448 619.105 104.183 621.37 104.183 624.39Z"
    fill="#CFC2E7" />
  <path
    d="M69.4556 624.39C69.4556 627.41 72.0979 630.052 75.1177 630.052C78.1375 630.052 80.7798 627.41 80.7798 624.39C80.7798 621.37 78.1375 618.728 75.1177 618.728C72.0979 618.728 69.4556 621.37 69.4556 624.39Z"
    fill="#CFC2E7" />
  <path
    d="M34.7271 624.39C34.7271 627.41 37.3694 630.052 40.3892 630.052C43.409 630.052 46.0513 627.41 46.0513 624.39C46.0513 621.37 43.409 618.728 40.3892 618.728C37.3694 618.728 34.7271 621.37 34.7271 624.39Z"
    fill="#CFC2E7" />
  <path
    d="M-5.62668e-05 624.39C-5.62668e-05 627.41 2.64225 630.052 5.66202 630.052C8.68179 630.052 11.3241 627.41 11.3241 624.39C11.3241 621.37 8.68179 618.728 5.66202 618.728C2.26477 619.105 -5.62668e-05 621.37 -5.62668e-05 624.39Z"
    fill="#CFC2E7" />
  <path
    d="M138.91 659.117C138.91 662.137 141.552 664.779 144.572 664.779C147.592 664.779 150.234 662.137 150.234 659.117C150.234 656.097 147.592 653.455 144.572 653.455C141.175 653.833 138.91 656.097 138.91 659.117Z"
    fill="#CFC2E7" />
  <path
    d="M104.183 659.117C104.183 662.137 106.825 664.779 109.845 664.779C112.865 664.779 115.507 662.137 115.507 659.117C115.507 656.097 112.865 653.455 109.845 653.455C106.448 653.833 104.183 656.097 104.183 659.117Z"
    fill="#CFC2E7" />
  <path
    d="M69.4556 659.117C69.4556 662.137 72.0979 664.779 75.1177 664.779C78.1375 664.779 80.7798 662.137 80.7798 659.117C80.7798 656.097 78.1375 653.455 75.1177 653.455C72.0979 653.455 69.4556 656.097 69.4556 659.117Z"
    fill="#CFC2E7" />
  <path
    d="M34.7271 659.117C34.7271 662.137 37.3694 664.779 40.3892 664.779C43.409 664.779 46.0513 662.137 46.0513 659.117C46.0513 656.097 43.409 653.455 40.3892 653.455C37.3694 653.455 34.7271 656.097 34.7271 659.117Z"
    fill="#CFC2E7" />
  <path
    d="M-5.62668e-05 659.117C-5.62668e-05 662.137 2.64225 664.779 5.66202 664.779C8.68179 664.779 11.3241 662.137 11.3241 659.117C11.3241 656.097 8.68179 653.455 5.66202 653.455C2.26477 653.833 -5.62668e-05 656.097 -5.62668e-05 659.117Z"
    fill="#CFC2E7" />
  <path
    d="M138.91 693.845C138.91 696.864 141.552 699.507 144.572 699.507C147.592 699.507 150.234 696.864 150.234 693.845C150.234 690.825 147.592 688.182 144.572 688.182C141.175 688.56 138.91 690.825 138.91 693.845Z"
    fill="#CFC2E7" />
  <path
    d="M104.183 693.845C104.183 696.864 106.825 699.507 109.845 699.507C112.865 699.507 115.507 696.864 115.507 693.845C115.507 690.825 112.865 688.182 109.845 688.182C106.448 688.56 104.183 690.825 104.183 693.845Z"
    fill="#CFC2E7" />
  <path
    d="M69.4556 693.845C69.4556 696.864 72.0979 699.507 75.1177 699.507C78.1375 699.507 80.7798 696.864 80.7798 693.845C80.7798 690.825 78.1375 688.182 75.1177 688.182C72.0979 688.182 69.4556 690.825 69.4556 693.845Z"
    fill="#CFC2E7" />
  <path
    d="M34.7271 693.845C34.7271 696.864 37.3694 699.507 40.3892 699.507C43.409 699.507 46.0513 696.864 46.0513 693.845C46.0513 690.825 43.409 688.182 40.3892 688.182C37.3694 688.182 34.7271 690.825 34.7271 693.845Z"
    fill="#CFC2E7" />
  <path
    d="M-5.62668e-05 693.845C-5.62668e-05 696.864 2.64225 699.507 5.66202 699.507C8.68179 699.507 11.3241 696.864 11.3241 693.845C11.3241 690.825 8.68179 688.182 5.66202 688.182C2.26477 688.56 -5.62668e-05 690.825 -5.62668e-05 693.845Z"
    fill="#CFC2E7" />
  <path
    d="M287.432 602.403L303.101 618.072C304.338 619.309 306.4 619.309 307.637 618.072L323.306 602.403C324.543 601.166 324.543 599.104 323.306 597.867L307.637 582.198C306.4 580.961 304.338 580.961 303.101 582.198L287.432 597.867C286.195 599.104 286.195 601.166 287.432 602.403Z"
    stroke="#CFC2E7" stroke-width="2" stroke-miterlimit="10" stroke-linecap="round" />
  <circle cx="161.734" cy="450.5" r="10.5" transform="rotate(-180 161.734 450.5)" stroke="#CFC2E7" stroke-width="2" />
</svg>