<svg width="211" height="425" viewBox="0 0 211 425" fill="none" xmlns="http://www.w3.org/2000/svg">
  <path
    d="M103.088 231.618C77.4717 206.002 77.4717 164.47 103.088 138.854C128.704 113.238 170.236 113.238 195.852 138.854C221.468 164.47 221.468 206.002 195.852 231.618C170.236 257.234 128.704 257.234 103.088 231.618Z"
    stroke="#CFC2E7" stroke-miterlimit="10" />
  <path
    d="M110.105 224.601C88.3646 202.86 88.3646 167.612 110.105 145.871C131.846 124.13 167.094 124.13 188.835 145.871C210.575 167.612 210.575 202.86 188.835 224.601C167.094 246.341 131.846 246.341 110.105 224.601Z"
    stroke="#CFC2E7" stroke-miterlimit="10" />
  <path
    d="M117.815 218.588C99.3936 201.104 98.6338 171.996 116.118 153.574C133.603 135.152 162.711 134.392 181.133 151.877C199.555 169.361 200.315 198.469 182.83 216.891C165.345 235.313 136.237 236.073 117.815 218.588Z"
    stroke="#CFC2E7" stroke-miterlimit="10" />
  <path
    d="M125.171 211.877C110.456 198.454 109.408 175.644 122.83 160.928C136.253 146.213 159.064 145.165 173.779 158.587C188.495 172.01 189.543 194.821 176.12 209.536C162.697 224.252 139.887 225.3 125.171 211.877Z"
    stroke="#CFC2E7" stroke-miterlimit="10" />
  <path
    d="M132.251 204.888C121.395 195.371 120.31 178.856 129.827 168.001C139.345 157.145 155.86 156.06 166.715 165.577C177.571 175.095 178.655 191.61 169.138 202.465C159.621 213.321 143.106 214.405 132.251 204.888Z"
    stroke="#CFC2E7" stroke-miterlimit="10" />
  <path
    d="M133.349 185.218C133.349 194.174 140.611 201.435 149.567 201.435C158.522 201.435 165.784 194.174 165.784 185.218C165.784 176.263 158.522 169.001 149.567 169.001C140.611 169.001 133.349 176.021 133.349 185.218Z"
    stroke="#CFC2E7" stroke-miterlimit="10" />
  <path
    d="M143.03 185.218C143.03 188.849 145.935 191.512 149.323 191.512C152.954 191.512 155.617 188.607 155.617 185.218C155.617 181.588 152.712 178.925 149.323 178.925C145.935 178.683 143.03 181.588 143.03 185.218Z"
    stroke="#CFC2E7" stroke-miterlimit="10" />
  <path fill-rule="evenodd" clip-rule="evenodd"
    d="M9.23389 296V289H7.23389V296H0.233887V298H7.23389V305H9.23389V298H16.2339V296H9.23389Z" fill="#CFC2E7" />
  <path
    d="M171.113 354.564C171.113 356.501 172.807 358.195 174.744 358.195C176.68 358.195 178.375 356.501 178.375 354.564C178.375 352.628 176.68 350.934 174.744 350.934C172.807 351.176 171.113 352.628 171.113 354.564Z"
    fill="#CFC2E7" />
  <path
    d="M148.845 354.564C148.845 356.501 150.539 358.195 152.475 358.195C154.412 358.195 156.106 356.501 156.106 354.564C156.106 352.628 154.412 350.934 152.475 350.934C150.539 351.176 148.845 352.628 148.845 354.564Z"
    fill="#CFC2E7" />
  <path
    d="M126.576 354.564C126.576 356.501 128.271 358.195 130.207 358.195C132.144 358.195 133.838 356.501 133.838 354.564C133.838 352.628 132.144 350.934 130.207 350.934C128.271 351.176 126.576 352.628 126.576 354.564Z"
    fill="#CFC2E7" />
  <path
    d="M104.308 354.564C104.308 356.501 106.002 358.195 107.939 358.195C109.875 358.195 111.569 356.501 111.569 354.564C111.569 352.628 109.875 350.934 107.939 350.934C106.002 351.176 104.308 352.628 104.308 354.564Z"
    fill="#CFC2E7" />
  <path
    d="M82.0401 354.564C82.0401 356.501 83.7344 358.195 85.6708 358.195C87.6072 358.195 89.3015 356.501 89.3015 354.564C89.3015 352.628 87.6072 350.934 85.6708 350.934C83.7344 351.176 82.0401 352.628 82.0401 354.564Z"
    fill="#CFC2E7" />
  <path
    d="M171.113 376.833C171.113 378.769 172.807 380.463 174.744 380.463C176.68 380.463 178.375 378.769 178.375 376.833C178.375 374.896 176.68 373.202 174.744 373.202C172.807 373.444 171.113 374.896 171.113 376.833Z"
    fill="#CFC2E7" />
  <path
    d="M148.845 376.833C148.845 378.769 150.539 380.463 152.475 380.463C154.412 380.463 156.106 378.769 156.106 376.833C156.106 374.896 154.412 373.202 152.475 373.202C150.539 373.444 148.845 374.896 148.845 376.833Z"
    fill="#CFC2E7" />
  <path
    d="M126.577 376.833C126.577 378.769 128.271 380.463 130.208 380.463C132.144 380.463 133.838 378.769 133.838 376.833C133.838 374.896 132.144 373.202 130.208 373.202C128.271 373.444 126.577 374.896 126.577 376.833Z"
    fill="#CFC2E7" />
  <path
    d="M104.308 376.833C104.308 378.769 106.003 380.463 107.939 380.463C109.875 380.463 111.57 378.769 111.57 376.833C111.57 374.896 109.875 373.202 107.939 373.202C106.003 373.444 104.308 374.896 104.308 376.833Z"
    fill="#CFC2E7" />
  <path
    d="M82.0399 376.833C82.0399 378.769 83.7342 380.463 85.6706 380.463C87.6069 380.463 89.3013 378.769 89.3013 376.833C89.3013 374.896 87.6069 373.202 85.6706 373.202C83.7342 373.444 82.0399 374.896 82.0399 376.833Z"
    fill="#CFC2E7" />
  <path
    d="M171.113 399.101C171.113 401.037 172.807 402.732 174.744 402.732C176.68 402.732 178.375 401.037 178.375 399.101C178.375 397.165 176.68 395.47 174.744 395.47C172.807 395.712 171.113 397.165 171.113 399.101Z"
    fill="#CFC2E7" />
  <path
    d="M148.845 399.101C148.845 401.037 150.539 402.732 152.475 402.732C154.412 402.732 156.106 401.037 156.106 399.101C156.106 397.165 154.412 395.47 152.475 395.47C150.539 395.712 148.845 397.165 148.845 399.101Z"
    fill="#CFC2E7" />
  <path
    d="M126.577 399.101C126.577 401.037 128.271 402.732 130.208 402.732C132.144 402.732 133.838 401.037 133.838 399.101C133.838 397.165 132.144 395.47 130.208 395.47C128.271 395.712 126.577 397.165 126.577 399.101Z"
    fill="#CFC2E7" />
  <path
    d="M104.308 399.101C104.308 401.037 106.003 402.732 107.939 402.732C109.875 402.732 111.57 401.037 111.57 399.101C111.57 397.165 109.875 395.47 107.939 395.47C106.003 395.712 104.308 397.165 104.308 399.101Z"
    fill="#CFC2E7" />
  <path
    d="M82.0399 399.101C82.0399 401.037 83.7342 402.732 85.6706 402.732C87.6069 402.732 89.3013 401.037 89.3013 399.101C89.3013 397.165 87.6069 395.47 85.6706 395.47C83.7342 395.712 82.0399 397.165 82.0399 399.101Z"
    fill="#CFC2E7" />
  <path
    d="M171.113 421.369C171.113 423.306 172.807 425 174.744 425C176.68 425 178.375 423.306 178.375 421.369C178.375 419.433 176.68 417.739 174.744 417.739C172.807 417.981 171.113 419.433 171.113 421.369Z"
    fill="#CFC2E7" />
  <path
    d="M148.845 421.369C148.845 423.306 150.539 425 152.475 425C154.412 425 156.106 423.306 156.106 421.369C156.106 419.433 154.412 417.739 152.475 417.739C150.539 417.981 148.845 419.433 148.845 421.369Z"
    fill="#CFC2E7" />
  <path
    d="M126.577 421.369C126.577 423.306 128.271 425 130.208 425C132.144 425 133.838 423.306 133.838 421.369C133.838 419.433 132.144 417.739 130.208 417.739C128.271 417.981 126.577 419.433 126.577 421.369Z"
    fill="#CFC2E7" />
  <path
    d="M104.308 421.369C104.308 423.306 106.003 425 107.939 425C109.875 425 111.57 423.306 111.57 421.369C111.57 419.433 109.875 417.739 107.939 417.739C106.003 417.981 104.308 419.433 104.308 421.369Z"
    fill="#CFC2E7" />
  <path
    d="M82.0399 421.369C82.0399 423.306 83.7342 425 85.6706 425C87.6069 425 89.3013 423.306 89.3013 421.369C89.3013 419.433 87.6069 417.739 85.6706 417.739C83.7342 417.981 82.0399 419.433 82.0399 421.369Z"
    fill="#CFC2E7" />
  <path
    d="M177.807 10.2863C177.807 15.1272 181.679 19 186.52 19C191.361 19 195.234 15.1272 195.234 10.2863C195.234 5.44534 191.361 1.57257 186.52 1.57257C181.679 1.57257 177.807 5.44534 177.807 10.2863Z"
    stroke="#CFC2E7" stroke-width="2" stroke-miterlimit="10" stroke-linecap="round" />
</svg>