{
  "project_info": {
    "project_number": "693080334163",
    "firebase_url": "https://keyloggersovetsk-5424f.firebaseio.com",
    "project_id": "keyloggersovetsk-5424f",
    "storage_bucket": "keyloggersovetsk-5424f.appspot.com"
  },
  "client": [
    {
      "client_info": {
        "mobilesdk_app_id": "1:693080334163:android:3904818538d0fb0db14ba6",
        "android_client_info": {
          "package_name": "com.as.asd"
        }
      },
      "oauth_client": [
        {
          "client_id": "693080334163-o8e1sa793rkg5hlel19s9oe058994lec.apps.googleusercontent.com",
          "client_type": 3
        }
      ],
      "api_key": [
        {
          "current_key": "AIzaSyD1QK0kmle5VdKb-GZz8ZRRJ72p25X7LG8"
        }
      ],
      "services": {
        "appinvite_service": {
          "other_platform_oauth_client": [
            {
              "client_id": "693080334163-o8e1sa793rkg5hlel19s9oe058994lec.apps.googleusercontent.com",
              "client_type": 3
            }
          ]
        }
      }
    },
    {
      "client_info": {
        "mobilesdk_app_id": "1:693080334163:android:e217655720ab5f78b14ba6",
        "android_client_info": {
          "package_name": "de.giuliomvr.log"
        }
      },
      "oauth_client": [
        {
          "client_id": "693080334163-nlm3il23rk2qghu8ajc6kip2qvufieef.apps.googleusercontent.com",
          "client_type": 1,
          "android_info": {
            "package_name": "de.giuliomvr.log",
            "certificate_hash": "22a655bc61d44cbdcdf7f279a4654cc1ad0c6ce7"
          }
        },
        {
          "client_id": "693080334163-o8e1sa793rkg5hlel19s9oe058994lec.apps.googleusercontent.com",
          "client_type": 3
        }
      ],
      "api_key": [
        {
          "current_key": "AIzaSyD1QK0kmle5VdKb-GZz8ZRRJ72p25X7LG8"
        }
      ],
      "services": {
        "appinvite_service": {
          "other_platform_oauth_client": [
            {
              "client_id": "693080334163-o8e1sa793rkg5hlel19s9oe058994lec.apps.googleusercontent.com",
              "client_type": 3
            }
          ]
        }
      }
    }
  ],
  "configuration_version": "1"
}