{
	"name" : "inek",
	"ses" : "inek",
	"answer" : "../assets/images/inek.jpg",
	"options": [
		"../assets/images/maymun.jpg",
		"../assets/images/fil.jpg",
		"../assets/images/kaplan.jpg",
    "../assets/images/kuzu.jpg",
		"../assets/images/balik.jpg",
		"../assets/images/esek.jpg",
		"../assets/images/horoz.jpg",
		"../assets/images/arı.jpg",
		"../assets/images/inek.jpg"
	],
	"voice" : "../assets/audios/dog.mp4",
	"noise" : "../assets/audios/noice.mp4"
}
