{
	"name" : "horoz",
	"ses" : "horoz",
	"answer" : "../assets/images/horoz.jpg",
	"options": [
		"../assets/images/kaplan.jpg",
		"../assets/images/domuz.jpg",
		"../assets/images/aslan.jpg",
    "../assets/images/ari.jpg",
		"../assets/images/horoz.jpg",
		"../assets/images/kuzu.jpg",
		"../assets/images/ayi.jpg",
		"../assets/images/inek.jpg",
		"../assets/images/tilki.jpg"
	],
	"voice" : "../assets/audios/dog.mp4",
	"noise" : "../assets/audios/noice.mp4"
}
