{
	"name" : "kuzu",
	"ses" : "kuzu",
	"answer" : "../assets/images/kuzu.jpg",
	"options": [
		"../assets/images/balık.jpg",
		"../assets/images/kaplan.jpg",
		"../assets/images/aslan.jpg",
    "../assets/images/ari.jpg",
		"../assets/images/tavuk.jpg",
		"../assets/images/kuzu.jpg",
		"../assets/images/maymun.jpg",
		"../assets/images/inek.jpg",
		"../assets/images/zurafa.jpg"
	],
	"voice" : "../assets/audios/dog.mp4",
	"noise" : "../assets/audios/noice.mp4"
}
