{
	"name" : "köpek",
	"ses" : "köpek",
	"answer" : "../assets/images/kopek.jpg",
	"options": [
		"../assets/images/aslan.jpg",
		"../assets/images/at.jpg",
		"../assets/images/esek.jpg",
		"../assets/images/fil.jpg",
		"../assets/images/kaplan.jpg",
		"../assets/images/kedi.jpg",
		"../assets/images/kopek.jpg",
		"../assets/images/timsah.jpg",
		"../assets/images/zurafa.jpg"
	],
	"voice" : "../assets/audios/dog.mp4",
	"noise" : "../assets/audios/noice.mp4"
}
