{
	"name" : "balık",
	"ses" : "balık",
	"answer" : "../assets/images/balik.jpg",
	"options": [
		"../assets/images/kedi.jpg",
		"../assets/images/fil.jpg",
		"../assets/images/kaplan.jpg",
    "../assets/images/aslan.jpg",
		"../assets/images/balik.jpg",
		"../assets/images/esek.jpg",
		"../assets/images/kopek.jpg",
		"../assets/images/ari.jpg",
		"../assets/images/yilan.jpg"
	],
	"voice" : "../assets/audios/dog.mp4",
	"noise" : "../assets/audios/noice.mp4"
}
