{
	"name" : "yılan",
	"ses" : "yılan",
	"answer" : "../assets/images/yilan.jpg",
	"options": [
		"../assets/images/maymun.jpg",
		"../assets/images/kaplan.jpg",
		"../assets/images/kopek.jpg",
    "../assets/images/timsah.jpg",
		"../assets/images/balik.jpg",
		"../assets/images/ordek.jpg",
		"../assets/images/yilan.jpg",
		"../assets/images/tavuk.jpg",
		"../assets/images/aslan.jpg"
	],
	"voice" : "../assets/audios/dog.mp4",
	"noise" : "../assets/audios/noice.mp4"
}
