1.468644362333996470e-18,3.018413211947758635e-18,4.487025862037070493e-18,5.663579689235156035e-18,3.677421999820006365e-19
5.899964178251714889e-19,9.491152926470836462e-19,1.670740874968375627e-18,-8.281686460767980472e-20,-1.468289422393572629e-19
3.646664214508386112e-18,6.320703603169395882e-19,-3.495367724344109674e-19,3.820895449964720516e-19,5.056085607195197414e-19
