5.970011710223444392e-18,4.427455268223595585e-18,2.241429897967850236e-18,1.660532543411941282e-18,8.571602762382041567e-19
1.308637838689058007e-17,3.290685095923930452e-18,1.691274083702789301e-18,6.331297574392097890e-18,2.467190149236843489e-19
2.622965417764207045e-18,8.107796689812319341e-19,9.565279930319774490e-19,3.026976195076340337e-19,-3.276868320409927299e-20
