2.005253788774200566e-17,3.258077607438096537e-18,3.466110995282575208e-18,1.211264759093513706e-18,2.245507058548264689e-18
4.971378387327672220e-19,5.816747517372579070e-18,3.556475206281713198e-19,3.288263779118218838e-18,-7.013845837369543118e-20
1.454807291457224472e-18,9.145355745052397209e-19,6.010225505535919292e-19,4.186237096412881896e-19,3.821892111465964165e-19
