6.841545364240909609e-18,2.174586501694285650e-18,8.060779981375043553e-19,3.751900299242496635e-19,4.386566415982799935e-19
8.259373869493515515e-18,5.077538659242591410e-18,5.474381447137113891e-19,1.776979829008450366e-18,5.784866531599187419e-19
6.442745204047467014e-19,1.410021552258906595e-18,3.679398892512018005e-19,3.352543405740101303e-19,1.447403954368467346e-19
