-0.8000 -0.0449 -0.8557
-0.7705 0.2053 -0.8711
-0.6808 0.4059 -0.8871
-0.5699 0.5748 -0.8835
-0.4644 0.6804 -0.8138
-0.3113 0.7649 -0.6631
-0.1899 0.8494 -0.4768
-0.1001 0.8810 -0.2967
0.0371 0.8916 -0.2114
0.1480 0.8494 -0.3033
0.2536 0.7596 -0.4839
0.3599 0.6755 -0.6684
0.4546 0.5754 -0.8159
0.5419 0.4667 -0.8807
0.6338 0.3483 -0.8824
0.7257 0.2114 -0.8666
0.8000 0.0449 -0.8501
-0.5383 -0.5971 -0.0738
-0.4538 -0.6076 0.0527
-0.3641 -0.6235 0.1346
-0.2743 -0.6287 0.1808
-0.1846 -0.6340 0.1918
0.1586 -0.6604 0.1986
0.2282 -0.6894 0.1886
0.3486 -0.6921 0.1452
0.4595 -0.6763 0.0664
0.5650 -0.6710 -0.0619
-0.0272 -0.1102 0.1415
-0.0323 0.0279 0.2018
-0.0379 0.1651 0.2893
-0.0425 0.3049 0.2894
-0.2849 0.2476 0.0735
-0.2374 0.3531 0.1024
-0.0473 0.4059 0.1173
0.1322 0.3690 0.1016
0.1955 0.3109 0.0713
-0.6386 -0.1536 -0.0058
-0.4580 -0.2652 0.0834
-0.2904 -0.2572 0.0888
-0.1371 -0.0956 0.0487
-0.2902 -0.0058 0.0764
-0.4855 -0.0006 0.0570
0.1573 -0.1457 0.0574
0.3011 -0.3067 0.0997
0.4700 -0.3120 0.0966
0.6495 -0.2223 0.0058
0.5017 -0.0375 0.0661
0.2641 -0.0481 0.0849
-0.2849 0.6488 -0.1399
-0.2004 0.6086 0.0106
-0.1001 0.5891 0.1013
-0.0315 0.5833 0.1112
0.0583 0.5770 0.1024
0.1797 0.5939 0.0080
0.2219 0.6224 -0.1486
0.1533 0.6648 -0.0193
0.0635 0.7056 0.0498
-0.0262 0.7208 0.0609
-0.1212 0.7199 0.0515
-0.2215 0.6929 -0.0166
-0.2374 0.6488 -0.1429
-0.1233 0.6488 0.0396
-0.0336 0.6382 0.0642
0.0678 0.6303 0.0391
0.1797 0.6276 -0.1528
0.0640 0.6791 0.0391
-0.0349 0.6910 0.0642
-0.1246 0.6936 0.0396
