Correct,Variation,Error Type
γάτα,γάγα,Μερικός αναδιπλασιασμός
αγγούρι,γούρι,Πτώση προτονικής συλλαβής
αγγούρι,αγγού,Πτώση μετατονικής συλλαβής
αγγούρι,γουγούρι,Ολικός αναδίπλασιαμός
αγγούρι,αγγούγι,Μερικός αναδιπλασιασμός
αναπτήρας,απτήρας,Πτώση προτονικής συλλαβής
αναπτήρας,αναπτή,Πτώση μετατονικής συλλαβής
αναπτήρας,απτηπτήρας,Ολικός αναδίπλασιαμός
αναπτήρας,αναπτήπτα,Μερικός αναδιπλασιασμός
αναπτήρας,αναπτήρα,Πτώση τελικού συμφώνου
αδιάβροχο,αδιάβοχο,Απλοποίηση συμπλεγμάτων: Εξακολουθητικό και υγρό
αδιάβροχο,αδιάροχο,Απλοποίηση συμπλεγμάτων: Εξακολουθητικό και υγρό
αδιάβροχο,διάβροχο,Πτώση προτονικής συλλαβής
αδιάβροχο,αδιάχο,Πτώση μετατονικής συλλαβής
αδιάβροχο,διαδιάβροχο,Ολικός αναδίπλασιαμός
αδιάβροχο,αδιάδοχο,Μερικός αναδιπλασιασμός
λύκος,λύλο,Μερικός αναδιπλασιασμός
λύκος,λύκο,Πτώση τελικού συμφώνου
αγκινάρες,ανάρες,Πτώση προτονικής συλλαβής
αγκινάρες,αγκινά,Πτώση μετατονικής συλλαβής
αγκινάρες,ανανάρες,Ολικός αναδίπλασιαμός
αγκινάρες,αγκινάνε,Μερικός αναδιπλασιασμός
αγκινάρες,αγκινάρε,Πτώση τελικού συμφώνου
απλώστρα,απλώσρα,Απλοποίηση συμπλεγμάτων: s και στιγμιαίο
απλώστρα,απλώτρα,Απλοποίηση συμπλεγμάτων: s και στιγμιαίο
απλώστρα,πλώστρα,Πτώση προτονικής συλλαβής
απλώστρα,απλώ,Πτώση μετατονικής συλλαβής
απλώστρα,πλωπλώστρα,Ολικός αναδίπλασιαμός
απλώστρα,απλώπλα,Μερικός αναδιπλασιασμός
κότα,κόκα,Μερικός αναδιπλασιασμός
αλεύρι,λεύρι,Πτώση προτονικής συλλαβής
αλεύρι,αλεύ,Πτώση μετατονικής συλλαβής
αλεύρι,λευλεύρι,Ολικός αναδίπλασιαμός
αλεύρι,αλεύλι,Μερικός αναδιπλασιασμός
ασανσέρ,ασέρ,Πτώση προτονικής συλλαβής
ασανσέρ,ασερσέρ,Ολικός αναδίπλασιαμός
βαλίτσα,λίτσα,Πτώση προτονικής συλλαβής
βαλίτσα,βαλί,Πτώση μετατονικής συλλαβής
βαλίτσα,λιλίτσα,Ολικός αναδίπλασιαμός
βαλίτσα,βαλίλα,Μερικός αναδιπλασιασμός
μύγα,μύμα,Μερικός αναδιπλασιασμός
ανανάς,ανάς,Πτώση προτονικής συλλαβής
ανανάς,ανανάς,Ολικός αναδίπλασιαμός
ανανάς,ανανά,Πτώση τελικού συμφώνου
βιβλιοθήκη,βιβιοθήκη,Απλοποίηση συμπλεγμάτων: Εξακολουθητικό και υγρό
βιβλιοθήκη,βιλιοθήκη,Απλοποίηση συμπλεγμάτων: Εξακολουθητικό και υγρό
βιβλιοθήκη,βιθήκη,Πτώση προτονικής συλλαβής
βιβλιοθήκη,βιβλιοθή,Πτώση μετατονικής συλλαβής
βιβλιοθήκη,βιθηθήκη,Ολικός αναδίπλασιαμός
βιβλιοθήκη,βιβλιοθήθη,Μερικός αναδιπλασιασμός
βίδα,βίβα,Μερικός αναδιπλασιασμός
φίδι,φίφι,Μερικός αναδιπλασιασμός
αρακάς,ακάς,Πτώση προτονικής συλλαβής
αρακάς,ακακάς,Ολικός αναδίπλασιαμός
αρακάς,αρακά,Πτώση τελικού συμφώνου
γλάστρες,γάστρες,Απλοποίηση συμπλεγμάτων: Εξακολουθητικό και υγρό
γλάστρες,λάστρες,Απλοποίηση συμπλεγμάτων: Εξακολουθητικό και υγρό
γλάστρες,γλάσρες,Απλοποίηση συμπλεγμάτων: s και στιγμιαίο
γλάστρες,γλάτρες,Απλοποίηση συμπλεγμάτων: s και στιγμιαίο
γλάστρες,γλάγλε,Μερικός αναδιπλασιασμός
γλάστρες,γλάστρε,Πτώση τελικού συμφώνου
γαλότσες,λότσες,Πτώση προτονικής συλλαβής
γαλότσες,γαλό,Πτώση μετατονικής συλλαβής
γαλότσες,λολότσες,Ολικός αναδίπλασιαμός
γαλότσες,γαλόλε,Μερικός αναδιπλασιασμός
γαλότσες,γαλότσε,Πτώση τελικού συμφώνου
σαύρα,σαύσα,Μερικός αναδιπλασιασμός
αχλάδι,χλάδι,Πτώση προτονικής συλλαβής
αχλάδι,αχλά,Πτώση μετατονικής συλλαβής
αχλάδι,χλαχλάδι,Ολικός αναδίπλασιαμός
αχλάδι,αχλάχλι,Μερικός αναδιπλασιασμός
γραφείο,γαφείο,Απλοποίηση συμπλεγμάτων: Εξακολουθητικό και υγρό
γραφείο,ραφείο,Απλοποίηση συμπλεγμάτων: Εξακολουθητικό και υγρό
γραφείο,φείο,Πτώση προτονικής συλλαβής
γραφείο,γραφεί,Πτώση μετατονικής συλλαβής
γραφείο,φειφείο,Ολικός αναδίπλασιαμός
γραφείο,γραφείφο,Μερικός αναδιπλασιασμός
γάντια,γάγια,Μερικός αναδιπλασιασμός
ψάρι,ψάψι,Μερικός αναδιπλασιασμός
γάλα,γάγα,Μερικός αναδιπλασιασμός
διακόπτης,κόπτης,Πτώση προτονικής συλλαβής
διακόπτης,διακό,Πτώση μετατονικής συλλαβής
διακόπτης,κοκόπτης,Ολικός αναδίπλασιαμός
διακόπτης,διακόκη,Μερικός αναδιπλασιασμός
διακόπτης,διακόπτη,Πτώση τελικού συμφώνου
δαχτυλίδι,δαχυλίδι,Απλοποίηση συμπλεγμάτων: Εξακολουθητικό και στιγμιαίο
δαχτυλίδι,δατυλίδι,Απλοποίηση συμπλεγμάτων: Εξακολουθητικό και στιγμιαίο
δαχτυλίδι,δαλίδι,Πτώση προτονικής συλλαβής
δαχτυλίδι,δαχτυλί,Πτώση μετατονικής συλλαβής
δαχτυλίδι,δαλιλίδι,Ολικός αναδίπλασιαμός
δαχτυλίδι,δαχτυλίλι,Μερικός αναδιπλασιασμός
σκύλος,σύλος,Απλοποίηση συμπλεγμάτων: s και στιγμιαίο
σκύλος,κύλος,Απλοποίηση συμπλεγμάτων: s και στιγμιαίο
σκύλος,σκύσκο,Μερικός αναδιπλασιασμός
σκύλος,σκύλο,Πτώση τελικού συμφώνου
ελιά,λιαλιά,Ολικός αναδίπλασιαμός
κάγκελα,κάλα,Πτώση μετατονικής συλλαβής
κάγκελα,κάκελα,Μερικός αναδιπλασιασμός
ζώνη,ζώζη,Μερικός αναδιπλασιασμός
πάπια,πάπια,Μερικός αναδιπλασιασμός
καρότο,ρότο,Πτώση προτονικής συλλαβής
καρότο,καρό,Πτώση μετατονικής συλλαβής
καρότο,ρορότο,Ολικός αναδίπλασιαμός
καρότο,καρόρο,Μερικός αναδιπλασιασμός
καθρέφτης,καθέφτης,Απλοποίηση συμπλεγμάτων: Εξακολουθητικό και υγρό
καθρέφτης,καρέφτης,Απλοποίηση συμπλεγμάτων: Εξακολουθητικό και υγρό
καθρέφτης,θρέφτης,Πτώση προτονικής συλλαβής
καθρέφτης,καθρέ,Πτώση μετατονικής συλλαβής
καθρέφτης,θρεθρέφτης,Ολικός αναδίπλασιαμός
καθρέφτης,καθρέθρη,Μερικός αναδιπλασιασμός
καθρέφτης,καθρέφτη,Πτώση τελικού συμφώνου
καλάθι,λάθι,Πτώση προτονικής συλλαβής
καλάθι,καλά,Πτώση μετατονικής συλλαβής
καλάθι,λαλάθι,Ολικός αναδίπλασιαμός
καλάθι,καλάλι,Μερικός αναδιπλασιασμός
χέλι,χέχι,Μερικός αναδιπλασιασμός
καρπούζι,πούζι,Πτώση προτονικής συλλαβής
καρπούζι,καρπού,Πτώση μετατονικής συλλαβής
καρπούζι,πουπούζι,Ολικός αναδίπλασιαμός
καρπούζι,καρπούπι,Μερικός αναδιπλασιασμός
καλαμάκι,καμάκι,Πτώση προτονικής συλλαβής
καλαμάκι,καλαμά,Πτώση μετατονικής συλλαβής
καλαμάκι,καμαμάκι,Ολικός αναδίπλασιαμός
καλαμάκι,καλαμάμι,Μερικός αναδιπλασιασμός
βόδι,βόβι,Μερικός αναδιπλασιασμός
καρύδα,ρύδα,Πτώση προτονικής συλλαβής
καρύδα,καρύ,Πτώση μετατονικής συλλαβής
καρύδα,ρυρύδα,Ολικός αναδίπλασιαμός
καρύδα,καρύρα,Μερικός αναδιπλασιασμός
καλοριφέρ,καλοφέρ,Πτώση προτονικής συλλαβής
καλοριφέρ,καλοφερφέρ,Ολικός αναδίπλασιαμός
κάλτσες,κάλκελ,Μερικός αναδιπλασιασμός
κάλτσες,κάλτσε,Πτώση τελικού συμφώνου
καβούρι,βούρι,Πτώση προτονικής συλλαβής
καβούρι,καβού,Πτώση μετατονικής συλλαβής
καβούρι,βουβούρι,Ολικός αναδίπλασιαμός
καβούρι,καβούβι,Μερικός αναδιπλασιασμός
κεράκια,ράκια,Πτώση προτονικής συλλαβής
κεράκια,κερά,Πτώση μετατονικής συλλαβής
κεράκια,ραράκια,Ολικός αναδίπλασιαμός
κεράκια,κεράρια,Μερικός αναδιπλασιασμός
καναπές,καπές,Πτώση προτονικής συλλαβής
καναπές,καπεπές,Ολικός αναδίπλασιαμός
καναπές,καναπέ,Πτώση τελικού συμφώνου
κασκόλ,κασόλ,Απλοποίηση συμπλεγμάτων: s και στιγμιαίο
κασκόλ,κακόλ,Απλοποίηση συμπλεγμάτων: s και στιγμιαίο
κασκόλ,σκολσκόλ,Ολικός αναδίπλασιαμός
χελώνα,λώνα,Πτώση προτονικής συλλαβής
χελώνα,χελώ,Πτώση μετατονικής συλλαβής
χελώνα,λωλώνα,Ολικός αναδίπλασιαμός
χελώνα,χελώλα,Μερικός αναδιπλασιασμός
κεράσι,ράσι,Πτώση προτονικής συλλαβής
κεράσι,κερά,Πτώση μετατονικής συλλαβής
κεράσι,ραράσι,Ολικός αναδίπλασιαμός
κεράσι,κεράρι,Μερικός αναδιπλασιασμός
καρέκλα,ρέκλα,Πτώση προτονικής συλλαβής
καρέκλα,καρέ,Πτώση μετατονικής συλλαβής
καρέκλα,ρερέκλα,Ολικός αναδίπλασιαμός
καρέκλα,καρέρα,Μερικός αναδιπλασιασμός
κατσαβίδι,καβίδι,Πτώση προτονικής συλλαβής
κατσαβίδι,κατσαβί,Πτώση μετατονικής συλλαβής
κατσαβίδι,καβιβίδι,Ολικός αναδίπλασιαμός
κατσαβίδι,κατσαβίβι,Μερικός αναδιπλασιασμός
γουρούνι,ρούνι,Πτώση προτονικής συλλαβής
γουρούνι,γουρού,Πτώση μετατονικής συλλαβής
γουρούνι,ρουρούνι,Ολικός αναδίπλασιαμός
γουρούνι,γουρούρι,Μερικός αναδιπλασιασμός
κολοκύθι,κοκύθι,Πτώση προτονικής συλλαβής
κολοκύθι,κολοκύ,Πτώση μετατονικής συλλαβής
κολοκύθι,κοκυκύθι,Ολικός αναδίπλασιαμός
κολοκύθι,κολοκύκι,Μερικός αναδιπλασιασμός
κομοδίνο,κοδίνο,Πτώση προτονικής συλλαβής
κομοδίνο,κομοδί,Πτώση μετατονικής συλλαβής
κομοδίνο,κοδιδίνο,Ολικός αναδίπλασιαμός
κομοδίνο,κομοδίδο,Μερικός αναδιπλασιασμός
κατσαρόλα,καρόλα,Πτώση προτονικής συλλαβής
κατσαρόλα,κατσαρό,Πτώση μετατονικής συλλαβής
κατσαρόλα,καρορόλα,Ολικός αναδίπλασιαμός
κατσαρόλα,κατσαρόρα,Μερικός αναδιπλασιασμός
καμήλα,μήλα,Πτώση προτονικής συλλαβής
καμήλα,καμή,Πτώση μετατονικής συλλαβής
καμήλα,μημήλα,Ολικός αναδίπλασιαμός
καμήλα,καμήμα,Μερικός αναδιπλασιασμός
κρασί,σισί,Ολικός αναδίπλασιαμός
κορνίζα,νίζα,Πτώση προτονικής συλλαβής
κορνίζα,κορνί,Πτώση μετατονικής συλλαβής
κορνίζα,νινίζα,Ολικός αναδίπλασιαμός
κορνίζα,κορνίνα,Μερικός αναδιπλασιασμός
κεράκι,ράκι,Πτώση προτονικής συλλαβής
κεράκι,κερά,Πτώση μετατονικής συλλαβής
κεράκι,ραράκι,Ολικός αναδίπλασιαμός
κεράκι,κεράρι,Μερικός αναδιπλασιασμός
πρόβατο,πρότο,Πτώση μετατονικής συλλαβής
πρόβατο,πρόπρατο,Μερικός αναδιπλασιασμός
κρέμα,κρέκρα,Μερικός αναδιπλασιασμός
κουβέρτα,βέρτα,Πτώση προτονικής συλλαβής
κουβέρτα,κουβέρ,Πτώση μετατονικής συλλαβής
κουβέρτα,βερβέρτα,Ολικός αναδίπλασιαμός
κουβέρτα,κουβέρβαρ,Μερικός αναδιπλασιασμός
κουβάρι,βάρι,Πτώση προτονικής συλλαβής
κουβάρι,κουβά,Πτώση μετατονικής συλλαβής
κουβάρι,βαβάρι,Ολικός αναδίπλασιαμός
κουβάρι,κουβάβι,Μερικός αναδιπλασιασμός
λιοντάρι,ντάρι,Πτώση προτονικής συλλαβής
λιοντάρι,λιοντά,Πτώση μετατονικής συλλαβής
λιοντάρι,νταντάρι,Ολικός αναδίπλασιαμός
λιοντάρι,λιοντάντι,Μερικός αναδιπλασιασμός
κρεμμύδι,μύδι,Πτώση προτονικής συλλαβής
κρεμμύδι,κρεμμύ,Πτώση μετατονικής συλλαβής
κρεμμύδι,μυμύδι,Ολικός αναδίπλασιαμός
κρεμμύδι,κρεμμύμι,Μερικός αναδιπλασιασμός
κουζίνα,ζίνα,Πτώση προτονικής συλλαβής
κουζίνα,κουζί,Πτώση μετατονικής συλλαβής
κουζίνα,ζιζίνα,Ολικός αναδίπλασιαμός
κουζίνα,κουζίζα,Μερικός αναδιπλασιασμός
κουβάς,βαβάς,Ολικός αναδίπλασιαμός
κουβάς,κουβά,Πτώση τελικού συμφώνου
παγώνι,γώνι,Πτώση προτονικής συλλαβής
παγώνι,παγώ,Πτώση μετατονικής συλλαβής
παγώνι,γωγώνι,Ολικός αναδίπλασιαμός
παγώνι,παγώγι,Μερικός αναδιπλασιασμός
λάδι,λάλι,Μερικός αναδιπλασιασμός
κουκέτα,κέτα,Πτώση προτονικής συλλαβής
κουκέτα,κουκέ,Πτώση μετατονικής συλλαβής
κουκέτα,κεκέτα,Ολικός αναδίπλασιαμός
κουκέτα,κουκέκα,Μερικός αναδιπλασιασμός
κούπα,κούκα,Μερικός αναδιπλασιασμός
ποντίκι,ντίκι,Πτώση προτονικής συλλαβής
ποντίκι,ποντί,Πτώση μετατονικής συλλαβής
ποντίκι,ντιντίκι,Ολικός αναδίπλασιαμός
ποντίκι,ποντίντι,Μερικός αναδιπλασιασμός
λάχανο,λάνο,Πτώση μετατονικής συλλαβής
λάχανο,λάλανο,Μερικός αναδιπλασιασμός
κούνια,κούκια,Μερικός αναδιπλασιασμός
κούτα,κούκα,Μερικός αναδιπλασιασμός
ελάφι,εφι,Πτώση προτονικής συλλαβής
ελάφι,εφιφι,Ολικός αναδίπλασιαμός
λεμόνι,μόνι,Πτώση προτονικής συλλαβής
λεμόνι,λεμό,Πτώση μετατονικής συλλαβής
λεμόνι,μομόνι,Ολικός αναδίπλασιαμός
λεμόνι,λεμόμι,Μερικός αναδιπλασιασμός
κουρτίνα,τίνα,Πτώση προτονικής συλλαβής
κουρτίνα,κουρτί,Πτώση μετατονικής συλλαβής
κουρτίνα,τιτίνα,Ολικός αναδίπλασιαμός
κουρτίνα,κουρτίτα,Μερικός αναδιπλασιασμός
κουτάλι,τάλι,Πτώση προτονικής συλλαβής
κουτάλι,κουτά,Πτώση μετατονικής συλλαβής
κουτάλι,τατάλι,Ολικός αναδίπλασιαμός
κουτάλι,κουτάτι,Μερικός αναδιπλασιασμός
αρκούδα,κούδα,Πτώση προτονικής συλλαβής
αρκούδα,αρκού,Πτώση μετατονικής συλλαβής
αρκούδα,κουκούδα,Ολικός αναδίπλασιαμός
αρκούδα,αρκούκα,Μερικός αναδιπλασιασμός
μακαρόνια,μαρόνια,Πτώση προτονικής συλλαβής
μακαρόνια,μακαρό,Πτώση μετατονικής συλλαβής
μακαρόνια,μαρορόνια,Ολικός αναδίπλασιαμός
μακαρόνια,μακαρόρια,Μερικός αναδιπλασιασμός
κουτί,τιτί,Ολικός αναδίπλασιαμός
κουνούπι,νούπι,Πτώση προτονικής συλλαβής
κουνούπι,κουνού,Πτώση μετατονικής συλλαβής
κουνούπι,νουνούπι,Ολικός αναδίπλασιαμός
κουνούπι,κουνούνι,Μερικός αναδιπλασιασμός
μαρούλι,ρούλι,Πτώση προτονικής συλλαβής
μαρούλι,μαρού,Πτώση μετατονικής συλλαβής
μαρούλι,ρουρούλι,Ολικός αναδίπλασιαμός
μαρούλι,μαρούρι,Μερικός αναδιπλασιασμός
κρεβάτι,βάτι,Πτώση προτονικής συλλαβής
κρεβάτι,κρεβά,Πτώση μετατονικής συλλαβής
κρεβάτι,βαβάτι,Ολικός αναδίπλασιαμός
κρεβάτι,κρεβάβι,Μερικός αναδιπλασιασμός
λεκάνη,κάνη,Πτώση προτονικής συλλαβής
λεκάνη,λεκά,Πτώση μετατονικής συλλαβής
λεκάνη,κακάνη,Ολικός αναδίπλασιαμός
λεκάνη,λεκάκη,Μερικός αναδιπλασιασμός
ακρίδα,κρίδα,Πτώση προτονικής συλλαβής
ακρίδα,ακρί,Πτώση μετατονικής συλλαβής
ακρίδα,κρικρίδα,Ολικός αναδίπλασιαμός
ακρίδα,ακρίκρα,Μερικός αναδιπλασιασμός
μελιτζάνα,μετζάνα,Πτώση προτονικής συλλαβής
μελιτζάνα,μελιτζά,Πτώση μετατονικής συλλαβής
μελιτζάνα,μετζατζάνα,Ολικός αναδίπλασιαμός
μελιτζάνα,μελιτζάτζα,Μερικός αναδιπλασιασμός
λάμπα,λάλα,Μερικός αναδιπλασιασμός
μαχαίρι,χαίρι,Πτώση προτονικής συλλαβής
μαχαίρι,μαχαί,Πτώση μετατονικής συλλαβής
μαχαίρι,χαιχαίρι,Ολικός αναδίπλασιαμός
μαχαίρι,μαχαίχι,Μερικός αναδιπλασιασμός
μήλο,μήμο,Μερικός αναδιπλασιασμός
μανταλάκια,μαλάκια,Πτώση προτονικής συλλαβής
μανταλάκια,μανταλά,Πτώση μετατονικής συλλαβής
μανταλάκια,μαλαλάκια,Ολικός αναδίπλασιαμός
μανταλάκια,μανταλάλια,Μερικός αναδιπλασιασμός
μπάλα,μπάμπα,Μερικός αναδιπλασιασμός
αβγό,αβό,Απλοποίηση συμπλεγμάτων: Εξακολουθητικό και εξακολουθητικό
αβγό,αγό,Απλοποίηση συμπλεγμάτων: Εξακολουθητικό και εξακολουθητικό
αβγό,βγοβγό,Ολικός αναδίπλασιαμός
μπανάνα,νάνα,Πτώση προτονικής συλλαβής
μπανάνα,μπανά,Πτώση μετατονικής συλλαβής
μπανάνα,νανάνα,Ολικός αναδίπλασιαμός
μπανάνα,μπανάνα,Μερικός αναδιπλασιασμός
μπαλόνι,λόνι,Πτώση προτονικής συλλαβής
μπαλόνι,μπαλό,Πτώση μετατονικής συλλαβής
μπαλόνι,λολόνι,Ολικός αναδίπλασιαμός
μπαλόνι,μπαλόλι,Μερικός αναδιπλασιασμός
μυγοσκοτώστρα,μυγοσοτώστρα,Απλοποίηση συμπλεγμάτων: s και στιγμιαίο
μυγοσκοτώστρα,μυγοκοτώστρα,Απλοποίηση συμπλεγμάτων: s και στιγμιαίο
μυγοσκοτώστρα,μυγοσκοτώσρα,Απλοποίηση συμπλεγμάτων: s και στιγμιαίο
μυγοσκοτώστρα,μυγοσκοτώτρα,Απλοποίηση συμπλεγμάτων: s και στιγμιαίο
μυγοσκοτώστρα,μυγοτώστρα,Πτώση προτονικής συλλαβής
μυγοσκοτώστρα,μυγοσκοτώ,Πτώση μετατονικής συλλαβής
μυγοσκοτώστρα,μυγοτωτώστρα,Ολικός αναδίπλασιαμός
μυγοσκοτώστρα,μυγοσκοτώτα,Μερικός αναδιπλασιασμός
μπισκότα,μπισότα,Απλοποίηση συμπλεγμάτων: s και στιγμιαίο
μπισκότα,μπικότα,Απλοποίηση συμπλεγμάτων: s και στιγμιαίο
μπισκότα,σκότα,Πτώση προτονικής συλλαβής
μπισκότα,μπισκό,Πτώση μετατονικής συλλαβής
μπισκότα,σκοσκότα,Ολικός αναδίπλασιαμός
μπισκότα,μπισκόσκα,Μερικός αναδιπλασιασμός
μπαλκόνι,κόνι,Πτώση προτονικής συλλαβής
μπαλκόνι,μπαλκό,Πτώση μετατονικής συλλαβής
μπαλκόνι,κοκόνι,Ολικός αναδίπλασιαμός
μπαλκόνι,μπαλκόκι,Μερικός αναδιπλασιασμός
δελφίνι,φίνι,Πτώση προτονικής συλλαβής
δελφίνι,δελφί,Πτώση μετατονικής συλλαβής
δελφίνι,φιφίνι,Ολικός αναδίπλασιαμός
δελφίνι,δελφίφι,Μερικός αναδιπλασιασμός
μπιφτέκι,φτέκι,Πτώση προτονικής συλλαβής
μπιφτέκι,μπιφτέ,Πτώση μετατονικής συλλαβής
μπιφτέκι,φτεφτέκι,Ολικός αναδίπλασιαμός
μπιφτέκι,μπιφτέφτι,Μερικός αναδιπλασιασμός
μπανιέρα,νιέρα,Πτώση προτονικής συλλαβής
μπανιέρα,μπανιέ,Πτώση μετατονικής συλλαβής
μπανιέρα,νιενιέρα,Ολικός αναδίπλασιαμός
μπανιέρα,μπανιένα,Μερικός αναδιπλασιασμός
μπουκάλι,κάλι,Πτώση προτονικής συλλαβής
μπουκάλι,μπουκά,Πτώση μετατονικής συλλαβής
μπουκάλι,κακάλι,Ολικός αναδίπλασιαμός
μπουκάλι,μπουκάκι,Μερικός αναδιπλασιασμός
μπύρα,μπύμπα,Μερικός αναδιπλασιασμός
νιπτήρας,πτήρας,Πτώση προτονικής συλλαβής
νιπτήρας,νιπτή,Πτώση μετατονικής συλλαβής
νιπτήρας,πτηπτήρας,Ολικός αναδίπλασιαμός
νιπτήρας,νιπτήπτα,Μερικός αναδιπλασιασμός
νιπτήρας,νιπτήρα,Πτώση τελικού συμφώνου
ξυράφι,ράφι,Πτώση προτονικής συλλαβής
ξυράφι,ξυρά,Πτώση μετατονικής συλλαβής
ξυράφι,ραράφι,Ολικός αναδίπλασιαμός
ξυράφι,ξυράρι,Μερικός αναδιπλασιασμός
γαρίδα,ρίδα,Πτώση προτονικής συλλαβής
γαρίδα,γαρί,Πτώση μετατονικής συλλαβής
γαρίδα,ριρίδα,Ολικός αναδίπλασιαμός
γαρίδα,γαρίρα,Μερικός αναδιπλασιασμός
νερό,ρορό,Ολικός αναδίπλασιαμός
ντουλάπα,λάπα,Πτώση προτονικής συλλαβής
ντουλάπα,ντουλά,Πτώση μετατονικής συλλαβής
ντουλάπα,λαλάπα,Ολικός αναδίπλασιαμός
ντουλάπα,ντουλάλα,Μερικός αναδιπλασιασμός
ομπρέλα,μπρέλα,Πτώση προτονικής συλλαβής
ομπρέλα,ομπρέ,Πτώση μετατονικής συλλαβής
ομπρέλα,μπρεμπρέλα,Ολικός αναδίπλασιαμός
ομπρέλα,ομπρέμπρα,Μερικός αναδιπλασιασμός
λάσπη,λάση,Απλοποίηση συμπλεγμάτων: s και στιγμιαίο
λάσπη,λάπη,Απλοποίηση συμπλεγμάτων: s και στιγμιαίο
λάσπη,λάλη,Μερικός αναδιπλασιασμός
ντομάτα,μάτα,Πτώση προτονικής συλλαβής
ντομάτα,ντομά,Πτώση μετατονικής συλλαβής
ντομάτα,μαμάτα,Ολικός αναδίπλασιαμός
ντομάτα,ντομάμα,Μερικός αναδιπλασιασμός
ξύλο,ξύξο,Μερικός αναδιπλασιασμός
παγάκι,γάκι,Πτώση προτονικής συλλαβής
παγάκι,παγά,Πτώση μετατονικής συλλαβής
παγάκι,γαγάκι,Ολικός αναδίπλασιαμός
παγάκι,παγάγι,Μερικός αναδιπλασιασμός
άλογο,άγο,Πτώση μετατονικής συλλαβής
άλογο,άογο,Μερικός αναδιπλασιασμός
ξύδι,ξύξι,Μερικός αναδιπλασιασμός
παγοθήκη,παθήκη,Πτώση προτονικής συλλαβής
παγοθήκη,παγοθή,Πτώση μετατονικής συλλαβής
παγοθήκη,παθηθήκη,Ολικός αναδίπλασιαμός
παγοθήκη,παγοθήθη,Μερικός αναδιπλασιασμός
παντελόνι,παλόνι,Πτώση προτονικής συλλαβής
παντελόνι,παντελό,Πτώση μετατονικής συλλαβής
παντελόνι,παλολόνι,Ολικός αναδίπλασιαμός
παντελόνι,παντελόλι,Μερικός αναδιπλασιασμός
τίγρη,τίγη,Απλοποίηση συμπλεγμάτων: Εξακολουθητικό και υγρό
τίγρη,τίρη,Απλοποίηση συμπλεγμάτων: Εξακολουθητικό και υγρό
τίγρη,τίτη,Μερικός αναδιπλασιασμός
παγάκια,γάκια,Πτώση προτονικής συλλαβής
παγάκια,παγά,Πτώση μετατονικής συλλαβής
παγάκια,γαγάκια,Ολικός αναδίπλασιαμός
παγάκια,παγάγια,Μερικός αναδιπλασιασμός
πάπλωμα,πάμα,Πτώση μετατονικής συλλαβής
πάπλωμα,πάπωμα,Μερικός αναδιπλασιασμός
παπούτσι,πούτσι,Πτώση προτονικής συλλαβής
παπούτσι,παπού,Πτώση μετατονικής συλλαβής
παπούτσι,πουπούτσι,Ολικός αναδίπλασιαμός
παπούτσι,παπούπι,Μερικός αναδιπλασιασμός
παντζάρι,ντζάρι,Πτώση προτονικής συλλαβής
παντζάρι,παντζά,Πτώση μετατονικής συλλαβής
παντζάρι,ντζαντζάρι,Ολικός αναδίπλασιαμός
παντζάρι,παντζάντζι,Μερικός αναδιπλασιασμός
πλυντήριο,ντήριο,Πτώση προτονικής συλλαβής
πλυντήριο,πλυντή,Πτώση μετατονικής συλλαβής
πλυντήριο,ντηντήριο,Ολικός αναδίπλασιαμός
πλυντήριο,πλυντήντιο,Μερικός αναδιπλασιασμός
πιάτο,πιάπο,Μερικός αναδιπλασιασμός
καρχαρίας,καρρίας,Πτώση προτονικής συλλαβής
καρχαρίας,καρχαρί,Πτώση μετατονικής συλλαβής
καρχαρίας,καρριρίας,Ολικός αναδίπλασιαμός
καρχαρίας,καρχαρίρα,Μερικός αναδιπλασιασμός
καρχαρίας,καρχαρία,Πτώση τελικού συμφώνου
πατάτα,τάτα,Πτώση προτονικής συλλαβής
πατάτα,πατά,Πτώση μετατονικής συλλαβής
πατάτα,τατάτα,Ολικός αναδίπλασιαμός
πατάτα,πατάτα,Μερικός αναδιπλασιασμός
πολυθρόνα,πολυθόνα,Απλοποίηση συμπλεγμάτων: Εξακολουθητικό και υγρό
πολυθρόνα,πολυρόνα,Απλοποίηση συμπλεγμάτων: Εξακολουθητικό και υγρό
πολυθρόνα,ποθρόνα,Πτώση προτονικής συλλαβής
πολυθρόνα,πολυθρό,Πτώση μετατονικής συλλαβής
πολυθρόνα,ποθροθρόνα,Ολικός αναδίπλασιαμός
πολυθρόνα,πολυθρόθρα,Μερικός αναδιπλασιασμός
πιρούνι,ρούνι,Πτώση προτονικής συλλαβής
πιρούνι,πιρού,Πτώση μετατονικής συλλαβής
πιρούνι,ρουρούνι,Ολικός αναδίπλασιαμός
πιρούνι,πιρούρι,Μερικός αναδιπλασιασμός
αλεπού,απού,Πτώση προτονικής συλλαβής
αλεπού,απουπού,Ολικός αναδίπλασιαμός
πεπόνι,πόνι,Πτώση προτονικής συλλαβής
πεπόνι,πεπό,Πτώση μετατονικής συλλαβής
πεπόνι,ποπόνι,Ολικός αναδίπλασιαμός
πεπόνι,πεπόπι,Μερικός αναδιπλασιασμός
πόρτα,πόρπαρ,Μερικός αναδιπλασιασμός
ποτήρι,τήρι,Πτώση προτονικής συλλαβής
ποτήρι,ποτή,Πτώση μετατονικής συλλαβής
ποτήρι,τητήρι,Ολικός αναδίπλασιαμός
ποτήρι,ποτήτι,Μερικός αναδιπλασιασμός
κόκορας,κόρας,Πτώση μετατονικής συλλαβής
κόκορας,κόκορας,Μερικός αναδιπλασιασμός
κόκορας,κόκορα,Πτώση τελικού συμφώνου
πιπεριά,πιριά,Πτώση προτονικής συλλαβής
πιπεριά,πιριαριά,Ολικός αναδίπλασιαμός
ράφι,ράρι,Μερικός αναδιπλασιασμός
πριόνι,πριόπρι,Μερικός αναδιπλασιασμός
αράχνη,αράχη,Απλοποίηση συμπλεγμάτων: Εξακολουθητικό και έρρινο
αράχνη,αράνη,Απλοποίηση συμπλεγμάτων: Εξακολουθητικό και έρρινο
αράχνη,ράχνη,Πτώση προτονικής συλλαβής
αράχνη,αρά,Πτώση μετατονικής συλλαβής
αράχνη,ραράχνη,Ολικός αναδίπλασιαμός
αράχνη,αράρη,Μερικός αναδιπλασιασμός
πορτοκάλι,πορκάλι,Πτώση προτονικής συλλαβής
πορτοκάλι,πορτοκά,Πτώση μετατονικής συλλαβής
πορτοκάλι,πορκακάλι,Ολικός αναδίπλασιαμός
πορτοκάλι,πορτοκάκι,Μερικός αναδιπλασιασμός
σακούλα,κούλα,Πτώση προτονικής συλλαβής
σακούλα,σακού,Πτώση μετατονικής συλλαβής
σακούλα,κουκούλα,Ολικός αναδίπλασιαμός
σακούλα,σακούκα,Μερικός αναδιπλασιασμός
ρολόι,λόι,Πτώση προτονικής συλλαβής
ρολόι,ρολό,Πτώση μετατονικής συλλαβής
ρολόι,λολόι,Ολικός αναδίπλασιαμός
ρολόι,ρολόλι,Μερικός αναδιπλασιασμός
σαλιγκάρι,σαγκάρι,Πτώση προτονικής συλλαβής
σαλιγκάρι,σαλιγκά,Πτώση μετατονικής συλλαβής
σαλιγκάρι,σαγκαγκάρι,Ολικός αναδίπλασιαμός
σαλιγκάρι,σαλιγκάγκι,Μερικός αναδιπλασιασμός
ροδάκινο,δάκινο,Πτώση προτονικής συλλαβής
ροδάκινο,ροδάνο,Πτώση μετατονικής συλλαβής
ροδάκινο,δαδάκινο,Ολικός αναδίπλασιαμός
ροδάκινο,ροδάδινο,Μερικός αναδιπλασιασμός
σκάλα,σάλα,Απλοποίηση συμπλεγμάτων: s και στιγμιαίο
σκάλα,κάλα,Απλοποίηση συμπλεγμάτων: s και στιγμιαίο
σκάλα,σκάσκα,Μερικός αναδιπλασιασμός
σακί,κικί,Ολικός αναδίπλασιαμός
χταπόδι,χαπόδι,Απλοποίηση συμπλεγμάτων: Εξακολουθητικό και στιγμιαίο
χταπόδι,ταπόδι,Απλοποίηση συμπλεγμάτων: Εξακολουθητικό και στιγμιαίο
χταπόδι,πόδι,Πτώση προτονικής συλλαβής
χταπόδι,χταπό,Πτώση μετατονικής συλλαβής
χταπόδι,ποπόδι,Ολικός αναδίπλασιαμός
χταπόδι,χταπόπι,Μερικός αναδιπλασιασμός
ρόδι,ρόρι,Μερικός αναδιπλασιασμός
σκαμπό,σαμπό,Απλοποίηση συμπλεγμάτων: s και στιγμιαίο
σκαμπό,καμπό,Απλοποίηση συμπλεγμάτων: s και στιγμιαίο
σκαμπό,μπομπό,Ολικός αναδίπλασιαμός
κύκνος,κύκος,Απλοποίηση συμπλεγμάτων: Στιγμιαίο και έρρινο
κύκνος,κύνος,Απλοποίηση συμπλεγμάτων: Στιγμιαίο και έρρινο
κύκνος,κύκο,Μερικός αναδιπλασιασμός
κύκνος,κύκνο,Πτώση τελικού συμφώνου
σαλάτα,λάτα,Πτώση προτονικής συλλαβής
σαλάτα,σαλά,Πτώση μετατονικής συλλαβής
σαλάτα,λαλάτα,Ολικός αναδίπλασιαμός
σαλάτα,σαλάλα,Μερικός αναδιπλασιασμός
σκούπα,σούπα,Απλοποίηση συμπλεγμάτων: s και στιγμιαίο
σκούπα,κούπα,Απλοποίηση συμπλεγμάτων: s και στιγμιαίο
σκούπα,σκούσκα,Μερικός αναδιπλασιασμός
σαπούνι,πούνι,Πτώση προτονικής συλλαβής
σαπούνι,σαπού,Πτώση μετατονικής συλλαβής
σαπούνι,πουπούνι,Ολικός αναδίπλασιαμός
σαπούνι,σαπούπι,Μερικός αναδιπλασιασμός
σκόρδο,σόρδο,Απλοποίηση συμπλεγμάτων: s και στιγμιαίο
σκόρδο,κόρδο,Απλοποίηση συμπλεγμάτων: s και στιγμιαίο
σκόρδο,σκόρσκορ,Μερικός αναδιπλασιασμός
σόμπα,σόσα,Μερικός αναδιπλασιασμός
σπίρτο,σίρτο,Απλοποίηση συμπλεγμάτων: s και στιγμιαίο
σπίρτο,πίρτο,Απλοποίηση συμπλεγμάτων: s και στιγμιαίο
σπίρτο,σπίρσπορ,Μερικός αναδιπλασιασμός
αστακός,ασακός,Απλοποίηση συμπλεγμάτων: s και στιγμιαίο
αστακός,ατακός,Απλοποίηση συμπλεγμάτων: s και στιγμιαίο
αστακός,ακός,Πτώση προτονικής συλλαβής
αστακός,ακοκός,Ολικός αναδίπλασιαμός
αστακός,αστακό,Πτώση τελικού συμφώνου
σούπα,σούσα,Μερικός αναδιπλασιασμός
στρώμα,σρώμα,Απλοποίηση συμπλεγμάτων: s και στιγμιαίο
στρώμα,τρώμα,Απλοποίηση συμπλεγμάτων: s και στιγμιαίο
στρώμα,στρώστρα,Μερικός αναδιπλασιασμός
στέκα,σέκα,Απλοποίηση συμπλεγμάτων: s και στιγμιαίο
στέκα,τέκα,Απλοποίηση συμπλεγμάτων: s και στιγμιαίο
στέκα,στέστα,Μερικός αναδιπλασιασμός
καμηλοπάρδαλη,καμηπάρδαλη,Πτώση προτονικής συλλαβής
καμηλοπάρδαλη,καμηλοπάρλη,Πτώση μετατονικής συλλαβής
καμηλοπάρδαλη,καμηπαρπάρδαλη,Ολικός αναδίπλασιαμός
καμηλοπάρδαλη,καμηλοπάρπαρλη,Μερικός αναδιπλασιασμός
σταφύλι,σαφύλι,Απλοποίηση συμπλεγμάτων: s και στιγμιαίο
σταφύλι,ταφύλι,Απλοποίηση συμπλεγμάτων: s και στιγμιαίο
σταφύλι,φύλι,Πτώση προτονικής συλλαβής
σταφύλι,σταφύ,Πτώση μετατονικής συλλαβής
σταφύλι,φυφύλι,Ολικός αναδίπλασιαμός
σταφύλι,σταφύφι,Μερικός αναδιπλασιασμός
συρματόπλεγμα,συρτόπλεγμα,Πτώση προτονικής συλλαβής
συρματόπλεγμα,συρματόμα,Πτώση μετατονικής συλλαβής
συρματόπλεγμα,συρτοτόπλεγμα,Ολικός αναδίπλασιαμός
συρματόπλεγμα,συρματότεμα,Μερικός αναδιπλασιασμός
σφουγγαρίστρα,σουγγαρίστρα,Απλοποίηση συμπλεγμάτων: Εξακολουθητικό και εξακολουθητικό
σφουγγαρίστρα,φουγγαρίστρα,Απλοποίηση συμπλεγμάτων: Εξακολουθητικό και εξακολουθητικό
σφουγγαρίστρα,σφουγγαρίσρα,Απλοποίηση συμπλεγμάτων: s και στιγμιαίο
σφουγγαρίστρα,σφουγγαρίτρα,Απλοποίηση συμπλεγμάτων: s και στιγμιαίο
σφουγγαρίστρα,σφουγρίστρα,Πτώση προτονικής συλλαβής
σφουγγαρίστρα,σφουγγαρί,Πτώση μετατονικής συλλαβής
σφουγγαρίστρα,σφουγριρίστρα,Ολικός αναδίπλασιαμός
σφουγγαρίστρα,σφουγγαρίρα,Μερικός αναδιπλασιασμός
βοσκός,βοσός,Απλοποίηση συμπλεγμάτων: s και στιγμιαίο
βοσκός,βοκός,Απλοποίηση συμπλεγμάτων: s και στιγμιαίο
βοσκός,σκοσκός,Ολικός αναδίπλασιαμός
βοσκός,βοσκό,Πτώση τελικού συμφώνου
σύκο,σύσο,Μερικός αναδιπλασιασμός
συρτάρι,τάρι,Πτώση προτονικής συλλαβής
συρτάρι,συρτά,Πτώση μετατονικής συλλαβής
συρτάρι,τατάρι,Ολικός αναδίπλασιαμός
συρτάρι,συρτάτι,Μερικός αναδιπλασιασμός
σφυρί,συρί,Απλοποίηση συμπλεγμάτων: Εξακολουθητικό και εξακολουθητικό
σφυρί,φυρί,Απλοποίηση συμπλεγμάτων: Εξακολουθητικό και εξακολουθητικό
σφυρί,ριρί,Ολικός αναδίπλασιαμός
ζέβρα,ζέβα,Απλοποίηση συμπλεγμάτων: Εξακολουθητικό και υγρό
ζέβρα,ζέρα,Απλοποίηση συμπλεγμάτων: Εξακολουθητικό και υγρό
ζέβρα,ζέζα,Μερικός αναδιπλασιασμός
τάρτα,τάρταρ,Μερικός αναδιπλασιασμός
ταψί,ψιψί,Ολικός αναδίπλασιαμός
τούρτα,τούρταρ,Μερικός αναδιπλασιασμός
τασάκι,σάκι,Πτώση προτονικής συλλαβής
τασάκι,τασά,Πτώση μετατονικής συλλαβής
τασάκι,σασάκι,Ολικός αναδίπλασιαμός
τασάκι,τασάσι,Μερικός αναδιπλασιασμός
τηγάνι,γάνι,Πτώση προτονικής συλλαβής
τηγάνι,τηγά,Πτώση μετατονικής συλλαβής
τηγάνι,γαγάνι,Ολικός αναδίπλασιαμός
τηγάνι,τηγάγι,Μερικός αναδιπλασιασμός
φάκα,φάφα,Μερικός αναδιπλασιασμός
τσουρέκι,ρέκι,Πτώση προτονικής συλλαβής
τσουρέκι,τσουρέ,Πτώση μετατονικής συλλαβής
τσουρέκι,ρερέκι,Ολικός αναδίπλασιαμός
τσουρέκι,τσουρέρι,Μερικός αναδιπλασιασμός
τέντα,τέτα,Μερικός αναδιπλασιασμός
τιράντες,ράντες,Πτώση προτονικής συλλαβής
τιράντες,τιρά,Πτώση μετατονικής συλλαβής
τιράντες,ραράντες,Ολικός αναδίπλασιαμός
τιράντες,τιράρε,Μερικός αναδιπλασιασμός
τιράντες,τιράντε,Πτώση τελικού συμφώνου
φώκια,φώφια,Μερικός αναδιπλασιασμός
τυρί,ριρί,Ολικός αναδίπλασιαμός
τζάκι,τζάτζι,Μερικός αναδιπλασιασμός
φασολάκια,φαλάκια,Πτώση προτονικής συλλαβής
φασολάκια,φασολά,Πτώση μετατονικής συλλαβής
φασολάκια,φαλαλάκια,Ολικός αναδίπλασιαμός
φασολάκια,φασολάλια,Μερικός αναδιπλασιασμός
τοστιέρα,τοσιέρα,Απλοποίηση συμπλεγμάτων: s και στιγμιαίο
τοστιέρα,τοτιέρα,Απλοποίηση συμπλεγμάτων: s και στιγμιαίο
τοστιέρα,στιέρα,Πτώση προτονικής συλλαβής
τοστιέρα,τοστιέ,Πτώση μετατονικής συλλαβής
τοστιέρα,στιεστιέρα,Ολικός αναδίπλασιαμός
τοστιέρα,τοστιέστα,Μερικός αναδιπλασιασμός
τσάντα,τσάτσα,Μερικός αναδιπλασιασμός
μέλι,μέμι,Μερικός αναδιπλασιασμός
φράουλα,φάουλα,Απλοποίηση συμπλεγμάτων: Εξακολουθητικό και υγρό
φράουλα,ράουλα,Απλοποίηση συμπλεγμάτων: Εξακολουθητικό και υγρό
φράουλα,φράλα,Πτώση μετατονικής συλλαβής
φράουλα,φράφρουλα,Μερικός αναδιπλασιασμός
τουαλέτα,τουλέτα,Πτώση προτονικής συλλαβής
τουαλέτα,τουαλέ,Πτώση μετατονικής συλλαβής
τουαλέτα,τουλελέτα,Ολικός αναδίπλασιαμός
τουαλέτα,τουαλέλα,Μερικός αναδιπλασιασμός
χαρταετός,χαρτατός,Πτώση προτονικής συλλαβής
χαρταετός,χαρτατοτός,Ολικός αναδίπλασιαμός
χαρταετός,χαρταετό,Πτώση τελικού συμφώνου
μέλισσα,μέσα,Πτώση μετατονικής συλλαβής
μέλισσα,μέμισα,Μερικός αναδιπλασιασμός
φρυγανιά,φυγανιά,Απλοποίηση συμπλεγμάτων: Εξακολουθητικό και υγρό
φρυγανιά,ρυγανιά,Απλοποίηση συμπλεγμάτων: Εξακολουθητικό και υγρό
φρυγανιά,φρυνιά,Πτώση προτονικής συλλαβής
φρυγανιά,φρυνιανιά,Ολικός αναδίπλασιαμός
τραμπάλα,μπάλα,Πτώση προτονικής συλλαβής
τραμπάλα,τραμπά,Πτώση μετατονικής συλλαβής
τραμπάλα,μπαμπάλα,Ολικός αναδίπλασιαμός
τραμπάλα,τραμπάμπα,Μερικός αναδιπλασιασμός
χτένα,χένα,Απλοποίηση συμπλεγμάτων: Εξακολουθητικό και στιγμιαίο
χτένα,τένα,Απλοποίηση συμπλεγμάτων: Εξακολουθητικό και στιγμιαίο
χτένα,χτέχτα,Μερικός αναδιπλασιασμός
χυμός,μομός,Ολικός αναδίπλασιαμός
χυμός,χυμό,Πτώση τελικού συμφώνου
τραπεζάκι,τραζάκι,Πτώση προτονικής συλλαβής
τραπεζάκι,τραπεζά,Πτώση μετατονικής συλλαβής
τραπεζάκι,τραζαζάκι,Ολικός αναδίπλασιαμός
τραπεζάκι,τραπεζάζι,Μερικός αναδιπλασιασμός
ψαλίδι,λίδι,Πτώση προτονικής συλλαβής
ψαλίδι,ψαλί,Πτώση μετατονικής συλλαβής
ψαλίδι,λιλίδι,Ολικός αναδίπλασιαμός
ψαλίδι,ψαλίλι,Μερικός αναδιπλασιασμός
ψωμί,μιμί,Ολικός αναδίπλασιαμός
τσιγάρο,γάρο,Πτώση προτονικής συλλαβής
τσιγάρο,τσιγά,Πτώση μετατονικής συλλαβής
τσιγάρο,γαγάρο,Ολικός αναδίπλασιαμός
τσιγάρο,τσιγάγο,Μερικός αναδιπλασιασμός
υγραέριο,υγαέριο,Απλοποίηση συμπλεγμάτων: Εξακολουθητικό και υγρό
υγραέριο,υραέριο,Απλοποίηση συμπλεγμάτων: Εξακολουθητικό και υγρό
υγραέριο,υέριο,Πτώση προτονικής συλλαβής
υγραέριο,υγραέ,Πτώση μετατονικής συλλαβής
υγραέριο,υεέριο,Ολικός αναδίπλασιαμός
υγραέριο,υγραέιο,Μερικός αναδιπλασιασμός
φαράσι,ράσι,Πτώση προτονικής συλλαβής
φαράσι,φαρά,Πτώση μετατονικής συλλαβής
φαράσι,ραράσι,Ολικός αναδίπλασιαμός
φαράσι,φαράρι,Μερικός αναδιπλασιασμός
φράχτης,φάχτης,Απλοποίηση συμπλεγμάτων: Εξακολουθητικό και υγρό
φράχτης,ράχτης,Απλοποίηση συμπλεγμάτων: Εξακολουθητικό και υγρό
φράχτης,φράχης,Απλοποίηση συμπλεγμάτων: Εξακολουθητικό και στιγμιαίο
φράχτης,φράτης,Απλοποίηση συμπλεγμάτων: Εξακολουθητικό και στιγμιαίο
φράχτης,φράφρη,Μερικός αναδιπλασιασμός
φράχτης,φράχτη,Πτώση τελικού συμφώνου
φωτιστικό,φωτισικό,Απλοποίηση συμπλεγμάτων: s και στιγμιαίο
φωτιστικό,φωτιτικό,Απλοποίηση συμπλεγμάτων: s και στιγμιαίο
φωτιστικό,φωτικό,Πτώση προτονικής συλλαβής
φωτιστικό,φωτικοκό,Ολικός αναδίπλασιαμός
φωτογραφία,φωτογαφία,Απλοποίηση συμπλεγμάτων: Εξακολουθητικό και υγρό
φωτογραφία,φωτοραφία,Απλοποίηση συμπλεγμάτων: Εξακολουθητικό και υγρό
φωτογραφία,φωτοφία,Πτώση προτονικής συλλαβής
φωτογραφία,φωτογραφί,Πτώση μετατονικής συλλαβής
φωτογραφία,φωτοφιφία,Ολικός αναδίπλασιαμός
φωτογραφία,φωτογραφίφα,Μερικός αναδιπλασιασμός
χαλί,λιλί,Ολικός αναδίπλασιαμός
ψυγείο,γείο,Πτώση προτονικής συλλαβής
ψυγείο,ψυγεί,Πτώση μετατονικής συλλαβής
ψυγείο,γειγείο,Ολικός αναδίπλασιαμός
ψυγείο,ψυγείγο,Μερικός αναδιπλασιασμός
