[
    {
    "name": "Соединенные Штаты Америки",
    "code": "USA",
    "country-code": "840"
    },
    {
    "name": "Япония",
    "code": "JPN",
    "country-code": "392"
    },
    {
    "name": "Южная Корея",
    "code": "KOR",
    "country-code": "410"
    },
    {
    "name": "Китай",
    "code": "CHN",
    "country-code": "156"
    },
    {
    "name": "Российская Федерация",
    "code": "RUS",
    "country-code": "643"
    },
    {
    "name": "Великобритания",
    "code": "GBR",
    "country-code": "826"
    },
    {
    "name": "Афганистан",
    "code": "AFG",
    "country-code": "004"
    },
    {
    "name": "Аландские острова",
    "code": "ALA",
    "country-code": "248"
    },
    {
    "name": "Албания",
    "code": "ALB",
    "country-code": "008"
    },
    {
    "name": "Алжир",
    "code": "DZA",
    "country-code": "012"
    },
    {
    "name": "Американское Самоа",
    "code": "ASM",
    "country-code": "016"
    },
    {
    "name": "Андорра",
    "code": "AND",
    "country-code": "020"
    },
    {
    "name": "Ангола",
    "code": "AGO",
    "country-code": "024"
    },
    {
    "name": "Ангилья",
    "code": "AIA",
    "country-code": "660"
    },
    {
    "name": "Антарктида",
    "code": "ATA",
    "country-code": "010"
    },
    {
    "name": "Антигуа и Барбуда",
    "code": "ATG",
    "country-code": "028"
    },
    {
    "name": "Аргентина",
    "code": "ARG",
    "country-code": "032"
    },
    {
    "name": "Армения",
    "code": "ARM",
    "country-code": "051"
    },
    {
    "name": "Аруба",
    "code": "ABW",
    "country-code": "533"
    },
    {
    "name": "Австралия",
    "code": "AUS",
    "country-code": "036"
    },
    {
    "name": "Австрия",
    "code": "AUT",
    "country-code": "040"
    },
    {
    "name": "Азербайджан",
    "code": "AZE",
    "country-code": "031"
    },
    {
    "name": "Багамские острова",
    "code": "BHS",
    "country-code": "044"
    },
    {
    "name": "Бахрейн",
    "code": "BHR",
    "country-code": "048"
    },
    {
    "name": "Бангладеш",
    "code": "BGD",
    "country-code": "050"
    },
    {
    "name": "Барбадос",
    "code": "BRB",
    "country-code": "052"
    },
    {
    "name": "Беларусь",
    "code": "BLR",
    "country-code": "112"
    },
    {
    "name": "Бельгия",
    "code": "BEL",
    "country-code": "056"
    },
    {
    "name": "Белиз",
    "code": "BLZ",
    "country-code": "084"
    },
    {
    "name": "Бенин",
    "code": "BEN",
    "country-code": "204"
    },
    {
    "name": "Бермудские острова",
    "code": "BMU",
    "country-code": "060"
    },
    {
    "name": "Бутан",
    "code": "BTN",
    "country-code": "064"
    },
    {
    "name": "Боливия",
    "code": "BOL",
    "country-code": "068"
    },
    {
    "name": "Бонэйр, Синт-Эстатиус и Саба",
    "code": "BES",
    "country-code": "535"
    },
    {
    "name": "Босния и Герцеговина",
    "code": "BIH",
    "country-code": "070"
    },
    {
    "name": "Ботсвана",
    "code": "BWA",
    "country-code": "072"
    },
    {
    "name": "Остров Буве",
    "code": "BVT",
    "country-code": "074"
    },
    {
    "name": "Бразилия",
    "code": "BRA",
    "country-code": "076"
    },
    {
    "name": "Британская территория в Индийском океане",
    "code": "IOT",
    "country-code": "086"
    },
    {
    "name": "Бруней",
    "code": "BRN",
    "country-code": "096"
    },
    {
    "name": "Болгария",
    "code": "BGR",
    "country-code": "100"
    },
    {
    "name": "Буркина-Фасо",
    "code": "BFA",
    "country-code": "854"
    },
    {
    "name": "Бурунди",
    "code": "BDI",
    "country-code": "108"
    },
    {
    "name": "Камбоджа",
    "code": "KHM",
    "country-code": "116"
    },
    {
    "name": "Камерун",
    "code": "CMR",
    "country-code": "120"
    },
    {
    "name": "Канада",
    "code": "CAN",
    "country-code": "124"
    },
    {
    "name": "Кабо-Верде",
    "code": "CPV",
    "country-code": "132"
    },
    {
    "name": "Острова Кайман",
    "code": "CYM",
    "country-code": "136"
    },
    {
    "name": "Центральноафриканская республика",
    "code": "CAF",
    "country-code": "140"
    },
    {
    "name": "Чад",
    "code": "TCD",
    "country-code": "148"
    },
    {
    "name": "Чили",
    "code": "CHL",
    "country-code": "152"
    },
    {
    "name": "Остров Рождества",
    "code": "CXR",
    "country-code": "162"
    },
    {
    "name": "Кокосовые острова",
    "code": "CCK",
    "country-code": "166"
    },
    {
    "name": "Колумбия",
    "code": "COL",
    "country-code": "170"
    },
    {
    "name": "Коморы",
    "code": "COM",
    "country-code": "174"
    },
    {
    "name": "Конго",
    "code": "COG",
    "country-code": "178"
    },
    {
    "name": "Демократическая Республика Конго",
    "code": "COD",
    "country-code": "180"
    },
    {
    "name": "Острова Кука",
    "code": "COK",
    "country-code": "184"
    },
    {
    "name": "Коста-Рика",
    "code": "CRI",
    "country-code": "188"
    },
    {
    "name": "Кот-д’Ивуар",
    "code": "CIV",
    "country-code": "384"
    },
    {
    "name": "Хорватия",
    "code": "HRV",
    "country-code": "191"
    },
    {
    "name": "Куба",
    "code": "CUB",
    "country-code": "192"
    },
    {
    "name": "Кюрасао",
    "code": "CUW",
    "country-code": "531"
    },
    {
    "name": "Кипр",
    "code": "CYP",
    "country-code": "196"
    },
    {
    "name": "Чехия",
    "code": "CZE",
    "country-code": "203"
    },
    {
    "name": "Дания",
    "code": "DNK",
    "country-code": "208"
    },
    {
    "name": "Джибути",
    "code": "DJI",
    "country-code": "262"
    },
    {
    "name": "Доминика",
    "code": "DMA",
    "country-code": "212"
    },
    {
    "name": "Доминиканская Республика",
    "code": "DOM",
    "country-code": "214"
    },
    {
    "name": "Эквадор",
    "code": "ECU",
    "country-code": "218"
    },
    {
    "name": "Египет",
    "code": "EGY",
    "country-code": "818"
    },
    {
    "name": "Сальвадор",
    "code": "SLV",
    "country-code": "222"
    },
    {
    "name": "Экваториальная Гвинея",
    "code": "GNQ",
    "country-code": "226"
    },
    {
    "name": "Эритрея",
    "code": "ERI",
    "country-code": "232"
    },
    {
    "name": "Эстония",
    "code": "EST",
    "country-code": "233"
    },
    {
    "name": "Эфиопия",
    "code": "ETH",
    "country-code": "231"
    },
    {
    "name": "Фолклендские острова",
    "code": "FLK",
    "country-code": "238"
    },
    {
    "name": "Фарерские острова",
    "code": "FRO",
    "country-code": "234"
    },
    {
    "name": "Фиджи",
    "code": "FJI",
    "country-code": "242"
    },
    {
    "name": "Финляндия",
    "code": "FIN",
    "country-code": "246"
    },
    {
    "name": "Франция",
    "code": "FRA",
    "country-code": "250"
    },
    {
    "name": "Гвиана",
    "code": "GUF",
    "country-code": "254"
    },
    {
    "name": "Французская Полинезия",
    "code": "PYF",
    "country-code": "258"
    },
    {
    "name": "Французские Южные и Антарктические территории",
    "code": "ATF",
    "country-code": "260"
    },
    {
    "name": "Габон",
    "code": "GAB",
    "country-code": "266"
    },
    {
    "name": "Гамбия",
    "code": "GMB",
    "country-code": "270"
    },
    {
    "name": "Грузия",
    "code": "GEO",
    "country-code": "268"
    },
    {
    "name": "Германия",
    "code": "DEU",
    "country-code": "276"
    },
    {
    "name": "Гана",
    "code": "GHA",
    "country-code": "288"
    },
    {
    "name": "Гибралтар",
    "code": "GIB",
    "country-code": "292"
    },
    {
    "name": "Греция",
    "code": "GRC",
    "country-code": "300"
    },
    {
    "name": "Гренландия",
    "code": "GRL",
    "country-code": "304"
    },
    {
    "name": "Гренада",
    "code": "GRD",
    "country-code": "308"
    },
    {
    "name": "Гваделупа",
    "code": "GLP",
    "country-code": "312"
    },
    {
    "name": "ГУАМ",
    "code": "GUM",
    "country-code": "316"
    },
    {
    "name": "Гватемала",
    "code": "GTM",
    "country-code": "320"
    },
    {
    "name": "Гернси",
    "code": "GGY",
    "country-code": "831"
    },
    {
    "name": "Гвинея",
    "code": "GIN",
    "country-code": "324"
    },
    {
    "name": "Гвинея-Бисау",
    "code": "GNB",
    "country-code": "624"
    },
    {
    "name": "Гайана",
    "code": "GUY",
    "country-code": "328"
    },
    {
    "name": "Республика Гаити",
    "code": "HTI",
    "country-code": "332"
    },
    {
    "name": "Остров Херд и острова Макдональд",
    "code": "HMD",
    "country-code": "334"
    },
    {
    "name": "Святой Престол",
    "code": "VAT",
    "country-code": "336"
    },
    {
    "name": "Гондурас",
    "code": "HND",
    "country-code": "340"
    },
    {
    "name": "Гонконг",
    "code": "HKG",
    "country-code": "344"
    },
    {
    "name": "Венгрия",
    "code": "HUN",
    "country-code": "348"
    },
    {
    "name": "Исландия",
    "code": "ISL",
    "country-code": "352"
    },
    {
    "name": "Индия",
    "code": "IND",
    "country-code": "356"
    },
    {
    "name": "Индонезия",
    "code": "IDN",
    "country-code": "360"
    },
    {
    "name": "Иран",
    "code": "IRN",
    "country-code": "364"
    },
    {
    "name": "Ирак",
    "code": "IRQ",
    "country-code": "368"
    },
    {
    "name": "Ирландия",
    "code": "IRL",
    "country-code": "372"
    },
    {
    "name": "Остров Мэн",
    "code": "IMN",
    "country-code": "833"
    },
    {
    "name": "Израиль",
    "code": "ISR",
    "country-code": "376"
    },
    {
    "name": "Италия",
    "code": "ITA",
    "country-code": "380"
    },
    {
    "name": "Джамайка",
    "code": "JAM",
    "country-code": "388"
    },
    {
    "name": "Джерси",
    "code": "JEY",
    "country-code": "832"
    },
    {
    "name": "Иордания",
    "code": "JOR",
    "country-code": "400"
    },
    {
    "name": "Казахстан",
    "code": "KAZ",
    "country-code": "398"
    },
    {
    "name": "Kения",
    "code": "KEN",
    "country-code": "404"
    },
    {
    "name": "Кирибати",
    "code": "KIR",
    "country-code": "296"
    },
    {
    "name": "Корея",
    "code": "PRK",
    "country-code": "408"
    },
    {
    "name": "Кувейт",
    "code": "KWT",
    "country-code": "414"
    },
    {
    "name": "Киргизия",
    "code": "KGZ",
    "country-code": "417"
    },
    {
    "name": "Лаос",
    "code": "LAO",
    "country-code": "418"
    },
    {
    "name": "Латвия",
    "code": "LVA",
    "country-code": "428"
    },
    {
    "name": "Ливан",
    "code": "LBN",
    "country-code": "422"
    },
    {
    "name": "Лесото",
    "code": "LSO",
    "country-code": "426"
    },
    {
    "name": "Либерия",
    "code": "LBR",
    "country-code": "430"
    },
    {
    "name": "Ливия",
    "code": "LBY",
    "country-code": "434"
    },
    {
    "name": "Лихтенштейн",
    "code": "LIE",
    "country-code": "438"
    },
    {
    "name": "Литва",
    "code": "LTU",
    "country-code": "440"
    },
    {
    "name": "Люксембург",
    "code": "LUX",
    "country-code": "442"
    },
    {
    "name": "Макао",
    "code": "MAC",
    "country-code": "446"
    },
    {
    "name": "Республика Македония",
    "code": "MKD",
    "country-code": "807"
    },
    {
    "name": "Мадагаскар",
    "code": "MDG",
    "country-code": "450"
    },
    {
    "name": "Малави",
    "code": "MWI",
    "country-code": "454"
    },
    {
    "name": "Малайзия",
    "code": "MYS",
    "country-code": "458"
    },
    {
    "name": "Мальдивы",
    "code": "MDV",
    "country-code": "462"
    },
    {
    "name": "Мали",
    "code": "MLI",
    "country-code": "466"
    },
    {
    "name": "Мальта",
    "code": "MLT",
    "country-code": "470"
    },
    {
    "name": "Маршалловы острова",
    "code": "MHL",
    "country-code": "584"
    },
    {
    "name": "Мартиника",
    "code": "MTQ",
    "country-code": "474"
    },
    {
    "name": "Мавритания",
    "code": "MRT",
    "country-code": "478"
    },
    {
    "name": "Маврикий",
    "code": "MUS",
    "country-code": "480"
    },
    {
    "name": "Майотта",
    "code": "MYT",
    "country-code": "175"
    },
    {
    "name": "Мексика",
    "code": "MEX",
    "country-code": "484"
    },
    {
    "name": "Федеративные Штаты Микронезии",
    "code": "FSM",
    "country-code": "583"
    },
    {
    "name": "Молдавия",
    "code": "MDA",
    "country-code": "498"
    },
    {
    "name": "Монако",
    "code": "MCO",
    "country-code": "492"
    },
    {
    "name": "Монголия",
    "code": "MNG",
    "country-code": "496"
    },
    {
    "name": "Черногория",
    "code": "MNE",
    "country-code": "499"
    },
    {
    "name": "Монсеррат",
    "code": "MSR",
    "country-code": "500"
    },
    {
    "name": "Марокко",
    "code": "MAR",
    "country-code": "504"
    },
    {
    "name": "Мозамбик",
    "code": "MOZ",
    "country-code": "508"
    },
    {
    "name": "Мьянма",
    "code": "MMR",
    "country-code": "104"
    },
    {
    "name": "Намибия",
    "code": "NAM",
    "country-code": "516"
    },
    {
    "name": "Науру",
    "code": "NRU",
    "country-code": "520"
    },
    {
    "name": "Непал",
    "code": "NPL",
    "country-code": "524"
    },
    {
    "name": "Нидерланды",
    "code": "NLD",
    "country-code": "528"
    },
    {
    "name": "Новая Каледония",
    "code": "NCL",
    "country-code": "540"
    },
    {
    "name": "Новая Зеландия",
    "code": "NZL",
    "country-code": "554"
    },
    {
    "name": "Никарагуа",
    "code": "NIC",
    "country-code": "558"
    },
    {
    "name": "Нигер",
    "code": "NER",
    "country-code": "562"
    },
    {
    "name": "Нигерия",
    "code": "NGA",
    "country-code": "566"
    },
    {
    "name": "Ниуэ",
    "code": "NIU",
    "country-code": "570"
    },
    {
    "name": "Остров Норфолк",
    "code": "NFK",
    "country-code": "574"
    },
    {
    "name": "Северные Марианские Острова",
    "code": "MNP",
    "country-code": "580"
    },
    {
    "name": "Норвегия",
    "code": "NOR",
    "country-code": "578"
    },
    {
    "name": "Оман",
    "code": "OMN",
    "country-code": "512"
    },
    {
    "name": "Пакистан",
    "code": "PAK",
    "country-code": "586"
    },
    {
    "name": "Палау",
    "code": "PLW",
    "country-code": "585"
    },
    {
    "name": "Государство Палестина",
    "code": "PSE",
    "country-code": "275"
    },
    {
    "name": "Панама",
    "code": "PAN",
    "country-code": "591"
    },
    {
    "name": "Папуа-Новая Гвинея",
    "code": "PNG",
    "country-code": "598"
    },
    {
    "name": "Парагвай",
    "code": "PRY",
    "country-code": "600"
    },
    {
    "name": "Перу",
    "code": "PER",
    "country-code": "604"
    },
    {
    "name": "Филлипины",
    "code": "PHL",
    "country-code": "608"
    },
    {
    "name": "строва Питкэрн",
    "code": "PCN",
    "country-code": "612"
    },
    {
    "name": "Польша",
    "code": "POL",
    "country-code": "616"
    },
    {
    "name": "Португалия",
    "code": "PRT",
    "country-code": "620"
    },
    {
    "name": "Пуэрто Рико",
    "code": "PRI",
    "country-code": "630"
    },
    {
    "name": "Катар",
    "code": "QAT",
    "country-code": "634"
    },
    {
    "name": "Реюньон",
    "code": "REU",
    "country-code": "638"
    },
    {
    "name": "Румыния",
    "code": "ROU",
    "country-code": "642"
    },
    {
    "name": "Руанда",
    "code": "RWA",
    "country-code": "646"
    },
    {
    "name": "Сен-Бартелеми",
    "code": "BLM",
    "country-code": "652"
    },
    {
    "name": "Острова Святой Елены, Вознесения и Тристан-да-Кунья",
    "code": "SHN",
    "country-code": "654"
    },
    {
    "name": "Сент-Китс и Невис",
    "code": "KNA",
    "country-code": "659"
    },
    {
    "name": "Сент-Люсия",
    "code": "LCA",
    "country-code": "662"
    },
    {
    "name": "Святой Мартин (французская часть)",
    "code": "MAF",
    "country-code": "663"
    },
    {
    "name": "Сен-Пьер и Микелон",
    "code": "SPM",
    "country-code": "666"
    },
    {
    "name": "Сент-Винсент и Гренадины",
    "code": "VCT",
    "country-code": "670"
    },
    {
    "name": "Самоа",
    "code": "WSM",
    "country-code": "882"
    },
    {
    "name": "Сан-Марино",
    "code": "SMR",
    "country-code": "674"
    },
    {
    "name": "Сан-Томе и Принсипи",
    "code": "STP",
    "country-code": "678"
    },
    {
    "name": "Саудовская Аравия",
    "code": "SAU",
    "country-code": "682"
    },
    {
    "name": "Сенегал",
    "code": "SEN",
    "country-code": "686"
    },
    {
    "name": "Сербия",
    "code": "SRB",
    "country-code": "688"
    },
    {
    "name": "Сейшельские острова",
    "code": "SYC",
    "country-code": "690"
    },
    {
    "name": "Сьерра-Леоне",
    "code": "SLE",
    "country-code": "694"
    },
    {
    "name": "Сингапур",
    "code": "SGP",
    "country-code": "702"
    },
    {
    "name": "Синт-Мартен",
    "code": "SXM",
    "country-code": "534"
    },
    {
    "name": "Словакия",
    "code": "SVK",
    "country-code": "703"
    },
    {
    "name": "Словения",
    "code": "SVN",
    "country-code": "705"
    },
    {
    "name": "Соломоновы острова",
    "code": "SLB",
    "country-code": "090"
    },
    {
    "name": "Сомали",
    "code": "SOM",
    "country-code": "706"
    },
    {
    "name": "Южная Африка",
    "code": "ZAF",
    "country-code": "710"
    },
    {
    "name": "Южная Георгия и Южные Сандвичевы Острова",
    "code": "SGS",
    "country-code": "239"
    },
    {
    "name": "Южный Судан",
    "code": "SSD",
    "country-code": "728"
    },
    {
    "name": "Испания",
    "code": "ESP",
    "country-code": "724"
    },
    {
    "name": "Шри-Ланка",
    "code": "LKA",
    "country-code": "144"
    },
    {
    "name": "Судан",
    "code": "SDN",
    "country-code": "729"
    },
    {
    "name": "Суринам",
    "code": "SUR",
    "country-code": "740"
    },
    {
    "name": "Шпицберген и Ян-Майен",
    "code": "SJM",
    "country-code": "744"
    },
    {
    "name": "Свазиленд",
    "code": "SWZ",
    "country-code": "748"
    },
    {
    "name": "Швеция",
    "code": "SWE",
    "country-code": "752"
    },
    {
    "name": "Швейцария",
    "code": "CHE",
    "country-code": "756"
    },
    {
    "name": "Сирия",
    "code": "SYR",
    "country-code": "760"
    },
    {
    "name": "Тайвань",
    "code": "TWN",
    "country-code": "158"
    },
    {
    "name": "Таджикистан",
    "code": "TJK",
    "country-code": "762"
    },
    {
    "name": "Танзания",
    "code": "TZA",
    "country-code": "834"
    },
    {
    "name": "Таиланд",
    "code": "THA",
    "country-code": "764"
    },
    {
    "name": "Восточный Тимор",
    "code": "TLS",
    "country-code": "626"
    },
    {
    "name": "Того",
    "code": "TGO",
    "country-code": "768"
    },
    {
    "name": "Токелау",
    "code": "TKL",
    "country-code": "772"
    },
    {
    "name": "Тонга",
    "code": "TON",
    "country-code": "776"
    },
    {
    "name": "Тринидад и Тобаго",
    "code": "TTO",
    "country-code": "780"
    },
    {
    "name": "Тунис",
    "code": "TUN",
    "country-code": "788"
    },
    {
    "name": "Турция",
    "code": "TUR",
    "country-code": "792"
    },
    {
    "name": "Туркмения",
    "code": "TKM",
    "country-code": "795"
    },
    {
    "name": "Теркс и Кайкос",
    "code": "TCA",
    "country-code": "796"
    },
    {
    "name": "Тувалу",
    "code": "TUV",
    "country-code": "798"
    },
    {
    "name": "Уганда",
    "code": "UGA",
    "country-code": "800"
    },
    {
    "name": "Украина",
    "code": "UKR",
    "country-code": "804"
    },
    {
    "name": "Объединённые Арабские Эмираты",
    "code": "ARE",
    "country-code": "784"
    },
    {
    "name": "Внешние малые острова США",
    "code": "UMI",
    "country-code": "581"
    },
    {
    "name": "Уругвай",
    "code": "URY",
    "country-code": "858"
    },
    {
    "name": "Узбекистан",
    "code": "UZB",
    "country-code": "860"
    },
    {
    "name": "Вануату",
    "code": "VUT",
    "country-code": "548"
    },
    {
    "name": "Венесуэла",
    "code": "VEN",
    "country-code": "862"
    },
    {
    "name": "Вьетнам",
    "code": "VNM",
    "country-code": "704"
    },
    {
    "name": "Виргинские острова (ВБ)",
    "code": "VGB",
    "country-code": "092"
    },
    {
    "name": " Виргинские острова (США)",
    "code": "VIR",
    "country-code": "850"
    },
    {
    "name": "Уоллис и Футуна",
    "code": "WLF",
    "country-code": "876"
    },
    {
    "name": "Западная Сахара",
    "code": "ESH",
    "country-code": "732"
    },
    {
    "name": "Йемен",
    "code": "YEM",
    "country-code": "887"
    },
    {
    "name": "Замбия",
    "code": "ZMB",
    "country-code": "894"
    },
    {
    "name": "Зимбабве",
    "code": "ZWE",
    "country-code": "716"
    }
]

