H|ALLYEAR-ECRE|020320211
D|1230000000000|1|000000608055|PAYROLL CREDITS for 2021-02-03
D|1230000000000|2|000000647273|PAYROLL CREDITS for 2021-02-03
D|1230000000000|3|000000926038|PAYROLL CREDITS for 2021-02-03
D|1230000000000|4|000000952914|PAYROLL CREDITS for 2021-02-03
D|1230000000000|5|000000847674|PAYROLL CREDITS for 2021-02-03
D|1230000000000|6|000000647736|PAYROLL CREDITS for 2021-02-03
D|1230000000000|7|000000407863|PAYROLL CREDITS for 2021-02-03
D|1230000000000|8|000000940168|PAYROLL CREDITS for 2021-02-03
D|1230000000000|9|000000582121|PAYROLL CREDITS for 2021-02-03
D|1230000000000|10|000000544254|PAYROLL CREDITS for 2021-02-03
D|1230000000000|11|000000958512|PAYROLL CREDITS for 2021-02-03
D|1230000000000|12|000000890690|PAYROLL CREDITS for 2021-02-03
D|1230000000000|13|000000916366|PAYROLL CREDITS for 2021-02-03
D|1230000000000|14|000000925710|PAYROLL CREDITS for 2021-02-03
D|1230000000000|15|000000821793|PAYROLL CREDITS for 2021-02-03
D|1230000000000|16|000001198733|PAYROLL CREDITS for 2021-02-03
D|1230000000000|17|000000447296|PAYROLL CREDITS for 2021-02-03
D|1230000000000|18|000001082000|PAYROLL CREDITS for 2021-02-03
D|1230000000000|19|000000741737|PAYROLL CREDITS for 2021-02-03
D|1230000000000|20|000000842735|PAYROLL CREDITS for 2021-02-03
D|1230000000000|21|000000862626|PAYROLL CREDITS for 2021-02-03
D|1230000000000|22|000000956463|PAYROLL CREDITS for 2021-02-03
D|1230000000000|23|000000666716|PAYROLL CREDITS for 2021-02-03
D|1230000000000|24|000000663453|PAYROLL CREDITS for 2021-02-03
D|000009999999|25|000000686474|PAYROLL CREDITS for 2021-02-03
D|000009999999|26|000001619071|PAYROLL CREDITS for 2021-02-03
D|000009999999|27|000001162246|PAYROLL CREDITS for 2021-02-03
D|000009999999|28|000001090738|PAYROLL CREDITS for 2021-02-03
D|000009999999|29|000000897584|PAYROLL CREDITS for 2021-02-03
D|000009999999|30|000001626083|PAYROLL CREDITS for 2021-02-03
D|000009999999|31|000000844883|PAYROLL CREDITS for 2021-02-03
D|000009999999|32|000000999174|PAYROLL CREDITS for 2021-02-03
D|000009999999|33|000000730000|PAYROLL CREDITS for 2021-02-03
D|000009999999|34|000000888805|PAYROLL CREDITS for 2021-02-03
D|000009999999|35|000001740000|PAYROLL CREDITS for 2021-02-03