<svg width="26" height="26" viewBox="0 0 26 26" fill="none" xmlns="http://www.w3.org/2000/svg">
<g clip-path="url(#clip0)">
<path d="M18.4067 6.55527L11.5953 24.342L7.47489 17.4871L0.619965 13.3667L18.4067 6.55527ZM3.18046 13.5904L7.82292 16.3809L15.2185 8.98526L3.18046 13.5904ZM8.60599 17.1888L11.3716 21.7815L15.9395 9.85533L8.60599 17.1888Z" fill="#119AD0"/>
</g>
<defs>
<clipPath id="clip0">
<rect width="18" height="18" fill="white" transform="translate(0.029541 13) rotate(-45)"/>
</clipPath>
</defs>
</svg>
