<svg width="33" height="10" viewBox="0 0 33 10" fill="none" xmlns="http://www.w3.org/2000/svg">
<path d="M8.425 0.899999V10H6.696L2.159 4.475V10H0.0790001V0.899999H1.821L6.345 6.425V0.899999H8.425ZM17.624 8.31V10H10.578V0.899999H17.455V2.59H12.671V4.566H16.896V6.204H12.671V8.31H17.624ZM32.9268 0.899999L29.9498 10H27.6878L25.6858 3.838L23.6188 10H21.3698L18.3798 0.899999H20.5638L22.6178 7.296L24.7628 0.899999H26.7128L28.7928 7.348L30.9118 0.899999H32.9268Z" fill="#EB5757"/>
</svg>
