<svg width="22" height="22" viewBox="0 0 22 22" fill="none" xmlns="http://www.w3.org/2000/svg">
<path d="M20.5859 4.35156C20.3281 3.6875 19.9844 3.125 19.4219 2.5625C18.8594 2 18.2969 1.65625 17.6328 1.39844C16.9922 1.14844 16.25 0.976562 15.1797 0.929687C14.1016 0.882812 13.7578 0.867188 11.0078 0.867188C8.25781 0.867188 7.91406 0.874999 6.83594 0.929687C5.75781 0.976562 5.02344 1.14844 4.38281 1.39844C3.71875 1.65625 3.15625 2 2.59375 2.5625C2.03125 3.125 1.6875 3.6875 1.42969 4.35156C1.17969 4.99219 1.00781 5.73438 0.960938 6.80469C0.914063 7.88281 0.898438 8.22656 0.898438 10.9766C0.898438 13.7266 0.90625 14.0703 0.960938 15.1484C1.00781 16.2266 1.17969 16.9609 1.42969 17.6016C1.6875 18.2656 2.03125 18.8281 2.59375 19.3906C3.15625 19.9531 3.71875 20.2969 4.38281 20.5547C5.02344 20.8047 5.76562 20.9766 6.83594 21.0234C7.91406 21.0703 8.25781 21.0859 11.0078 21.0859C13.7578 21.0859 14.1016 21.0781 15.1797 21.0234C16.2578 20.9766 16.9922 20.8047 17.6328 20.5547C18.2969 20.2969 18.8594 19.9531 19.4219 19.3906C19.9844 18.8281 20.3281 18.2656 20.5859 17.6016C20.8359 16.9609 21.0078 16.2187 21.0547 15.1484C21.1016 14.0703 21.1172 13.7266 21.1172 10.9766C21.1172 8.22656 21.1094 7.88281 21.0547 6.80469C21.0078 5.72656 20.8359 4.99219 20.5859 4.35156ZM19.2344 15.0625C19.1875 16.0469 19.0234 16.5859 18.8828 16.9375C18.7031 17.4062 18.4766 17.75 18.125 18.1016C17.7734 18.4531 17.4375 18.6719 16.9609 18.8594C16.6016 19 16.0703 19.1641 15.0859 19.2109C14.0156 19.2578 13.7031 19.2734 11 19.2734C8.29688 19.2734 7.97656 19.2656 6.91406 19.2109C5.92969 19.1641 5.39062 19 5.03906 18.8594C4.57031 18.6797 4.22656 18.4531 3.875 18.1016C3.52344 17.75 3.30469 17.4141 3.11719 16.9375C2.97656 16.5781 2.8125 16.0469 2.76563 15.0625C2.71875 13.9922 2.70313 13.6719 2.70313 10.9766C2.70313 8.28125 2.71094 7.95313 2.76563 6.89063C2.8125 5.90625 2.97656 5.36719 3.11719 5.01563C3.29688 4.54688 3.52344 4.20312 3.875 3.85156C4.22656 3.5 4.5625 3.28125 5.03906 3.09375C5.39844 2.95312 5.92969 2.78906 6.91406 2.74219C7.98438 2.69531 8.30469 2.67969 11 2.67969C13.6953 2.67969 14.0234 2.6875 15.0859 2.74219C16.0703 2.78906 16.6094 2.95312 16.9609 3.09375C17.4297 3.27344 17.7734 3.5 18.125 3.85156C18.4766 4.20312 18.6953 4.53906 18.8828 5.01563C19.0234 5.375 19.1875 5.90625 19.2344 6.89063C19.2812 7.96094 19.2969 8.28125 19.2969 10.9766C19.2969 13.6719 19.2812 14 19.2344 15.0625Z" fill="url(#paint0_radial)"/>
<path d="M11 5.78125C8.13281 5.78125 5.80469 8.10938 5.80469 10.9766C5.80469 13.8438 8.13281 16.1719 11 16.1719C13.8672 16.1719 16.1953 13.8438 16.1953 10.9766C16.1953 8.10938 13.8672 5.78125 11 5.78125ZM11 14.3516C9.14062 14.3516 7.625 12.8438 7.625 10.9766C7.625 9.11719 9.13281 7.60156 11 7.60156C12.8672 7.60156 14.375 9.10938 14.375 10.9766C14.375 12.8359 12.8594 14.3516 11 14.3516Z" fill="url(#paint1_radial)"/>
<path d="M16.3984 6.78906C17.0672 6.78906 17.6094 6.24691 17.6094 5.57812C17.6094 4.90934 17.0672 4.36719 16.3984 4.36719C15.7297 4.36719 15.1875 4.90934 15.1875 5.57812C15.1875 6.24691 15.7297 6.78906 16.3984 6.78906Z" fill="url(#paint2_radial)"/>
<defs>
<radialGradient id="paint0_radial" cx="0" cy="0" r="1" gradientUnits="userSpaceOnUse" gradientTransform="translate(6.76357 21.0437) scale(20.3991)">
<stop stop-color="#FFD776"/>
<stop offset="0.2463" stop-color="#F3A554"/>
<stop offset="0.3793" stop-color="#F15C3C"/>
<stop offset="0.5394" stop-color="#D94867"/>
<stop offset="0.6995" stop-color="#C32F87"/>
<stop offset="0.9122" stop-color="#7D63A7"/>
<stop offset="0.9852" stop-color="#5C6CB3"/>
</radialGradient>
<radialGradient id="paint1_radial" cx="0" cy="0" r="1" gradientUnits="userSpaceOnUse" gradientTransform="translate(8.82454 16.146) scale(10.4752)">
<stop stop-color="#FFD776"/>
<stop offset="0.2463" stop-color="#F3A554"/>
<stop offset="0.3793" stop-color="#F15C3C"/>
<stop offset="0.607" stop-color="#D94867"/>
<stop offset="0.8346" stop-color="#C32F87"/>
<stop offset="0.9577" stop-color="#7D63A7"/>
<stop offset="1" stop-color="#5C6CB3"/>
</radialGradient>
<radialGradient id="paint2_radial" cx="0" cy="0" r="1" gradientUnits="userSpaceOnUse" gradientTransform="translate(15.8924 6.78362) scale(2.44789)">
<stop stop-color="#5F6DB3"/>
<stop offset="1" stop-color="#5C6CB3"/>
</radialGradient>
</defs>
</svg>
