<svg width="15" height="15" viewBox="0 0 15 15" fill="none" xmlns="http://www.w3.org/2000/svg">
<path d="M8.56201 7.5L15 13.938L13.938 15L7.5 8.56201L1.06201 15L0 13.938L6.43799 7.5L0 1.06201L1.06201 0L7.5 6.43799L13.938 0L15 1.06201L8.56201 7.5Z" fill="#777777"/>
</svg>
