{
  "compilerOptions": {
    "baseUrl": ".",
    "paths": {
      "@components/*": ["./components/*"],
      "@styles/*": ["./styles/*"],
      "@store/*": ["./store/*"],
      "@services/*": ["./services/*"],
      "@hooks/*": ["./hooks/*"],
      "@hocs/*": ["./hocs/*"],
      "@translations/*": ["./translations/*"],
      "@helpers/*": ["./helpers/*"]
    }
  }
}
