{
    "Payloads": [
        {
            "FwVersion": "2",
            "Guid": "880866e9-84ba-4793-a908-33e0b916f398",
            "HardwareInstance": "0",
            "LowestSupportedVersion": "1",
            "MonotonicCount": "0",
            "Payload": "fip.bin",
            "UpdateImageIndex": "1",
            "OpenSslSignerPrivateCertFile": "CRT.pem",
            "OpenSslTrustedPublicCertFile": "CRT.pub.pem",
            "OpenSslOtherPublicCertFile":   "CRT.pub.pem"
        }
    ]
}
