-------------------------------------------------------------------------------
Test set: TestSuite
-------------------------------------------------------------------------------
Tests run: 1, Failures: 1, Errors: 0, Skipped: 0, Time elapsed: 6.398 s <<< FAILURE! - in TestSuite
homePageExistElementsTest(com.skillup.automation.sliderPresentTest.SliderPresenterTest)  Time elapsed: 3.238 s  <<< FAILURE!
java.lang.AssertionError: null
	at com.skillup.automation.sliderPresentTest.SliderPresenterTest.homePageExistElementsTest(SliderPresenterTest.java:20)

