{
  /*Internal Otoqi information about current state of the car and necessary tasks to be done bofore car could be available for other services and assigned to drivers?
  Its properties are assessed by Python app that defines a rule set to populate the "activeMissionList" 
  */
  "CarMissions": {
    "CarIsReadyWorkshopOrPound": true, // The car is in Workshop or on the pound. 
    "ChargePlanified": "string",// This field is filled in when the load of the car respect a ruleset( fuel is less than parameter which is set by the operation Team) For example, for Paris, if the fuel is less than 15% we will put the flag recharge                                    //if it is low (less than 5%) we will fill it with Recharge very low 
    "ChargePlanifiedManual": "string",//This field is filled manually by the ops team to force a mission that does not respect a rule of charging  For example, the car even if it is above 15%, we want that this car to be loaded
    "ChargingStation": "string", // the name of charging station when we charge the car
    "CleaningRequest": "string",// This field is filled in when the diffrence between the last Cleaning Date and the current is greater than number of days that respect the cleaning criteria( the parameter is defined by the ops team) For example, for Milano, if the diffrence between the last Cleaning Date and the crurent is greater than 21 days, the car should be cleaned. we create a mission Cleaning standard
    "CleaningRequestManual": "string",//This field is filled manually by the ops team to force a cleaning mission that does not respect the cleaning criterin. For example, the customer complained about the bad smell of a car, we create a mission for that
    "CurrentSpecificLocation": "string",//If the car is in a pound or Workshop it must to get it out, this field is updated with the address of the pound or Workshop to recover the car
    "DriverRequest": true,// When the driver start a mission, we reserve this car for the driver.
    "DriverRequestionTheMission": { //this field is filled with the information of the driver who requested the car
      "driverDisplayName": "string",
      "driverLogin": "string"
    },
    "JobOrTaskList": "string",
    "LastMissionCreationDate": "2022-08-09T09:13:14.209Z",
    "MessageForDriver": [ // Send a message to the driver about the mission
      {
        "CreatedAt": "2022-08-09T09:13:14.209Z",
        "From": "string",
        "Message": "string",
        "MessageType": "string"
      }
    ],
    "SmartRepairData": { // 
      "CarCannotBeFound": true, //If the driver can't find the car 
      "CarCannotBeFound_Driver": "string",//the driver didn't find the car but we don't use it anymore
      "Miscelleanous": "string",// all other task beside smart repair. The car doesn't work ==>Created manually by the ops team
      "SmartRepair": "string"// it's filled with all the smart repair missions :deflated tyre ==> Created manually by the ops team
    },
    "TargetLocation": "string",///the address where the car must be taken to a garage or relocation 
    "TargetZone": {// areas where the car must be moved . It will depend on the areas where cars are most needed
      "color": "string",
      "coordinates": {
        "coordinateSet": [
          {
            "lat": 0,
            "lng": 0,
            "numZoneCoordinate": 0
          }
        ]
      },
      "driverDescription": "string",
      "name": "string",
      "zoneId": "string"
    },
    "WorkshopCarPoundRelocation": "string"
  },
  "CarProperties": {
  /*current address of a car*/
    "Adress": "string",
    "CarIsCharging": true,///When we receive the charging paperform from the driver, we update the car by putting car is charging ==>true or false when we receive the remove car from charger paperform
    "CarSharingZoneList": [//when we scrape the cars, we update this list to define the area where the car is located 
      {
        "CarSharingZoneID": "string",
        "CarSharingZoneName": "string",
        "Priority": 0
      }
    ],
    "ChargeLocation": { /// it is filled with information from the charging station where the car is charged 
      "chargePointId": "string",
      "chargePointName": "string",
      "evseName": "string",
      "evseNetworkId": "string",
      "evseType": "string",
      "locationId": "string",
      "locationName": "string",
      "sessionId": "string",
      "startDate": "2022-08-09T09:13:14.209Z",
      "userEmail": "string",
      "userId": "string"
    },
    "CleaningCriteriaRespected": true,// If car is cleaned and all the clean criteria are respected based on the paperform
    "Connected": true,
    "EngineStatus": true,
    "ExteriorCleanliness": "string",/// If the interior and the exterior of the car are clean ==> it's not really used
/*proposed to be enum BATTERY	CLIENT DEFLEETED MAINTENANCE POUND WORKSHOP*/
    "Group": "string",// The status is changed by the scrapper and also by teh mission . For example, if the car is loading ==> the car group changes from client to maintenance, etc. 
    "GroupAndStatus": "string", // The group or status is changed by python. For exemple, if the car is charging ==> the group&Status is En charge, if the fuel is under 20%==> group1status less than 20
    "InMaintenance": true,// Is the car is in group Maintenance. we don't really use it 
    "InteriorCleanliness": "string",// we updated base on the response of the paperform ==> the value is propre
    "LastChargeDate": "2022-08-09T09:13:14.209Z",/// the last date that the car was in charge base. we fill by the submission date of the paperform
    "LastCleaningDate": "2022-08-09T09:13:14.209Z",// the last date that the car was cleaned.we fill by the submission date of the paperform
    "LastContactCleaningDate": "2022-08-09T09:13:14.209Z",
    "LastTimeCarHasMoved": "2022-08-09T09:13:14.209Z",//the last date that the car was moved. It fill by Java side
        "Mileage": 0,// fill by the scrapper
/*proposed to be enum BOOKED	BOOKED_PARKED	FREE*/
    "Status": "string",//// fill by the scrapper
    "ZipCode": "string",//// fill by the scrapper
    "door": true,/// fill by the scrapper
    "fuel_level": 0,//// fill by the scrapper
/*exact location of a car*/
    "gps_position": [//// fill by the scrapper
      0,0
    ]
  },
/*Contains cars basic information and its operation scopes*/
  "ConstantProperties": {// fill by the scrapper
    "Account": "string",
    "BatteryCapacity": 0,
    "Brand": "string",// the brand id is related to the client. like Zity_Paris_Carsharing
    "Brand_Id": "string",
    "City": "string",
    "Model": "string",///model of the car
    "PlateNumber": "string"
  },
  "EnjoyProperties": {
    "EnabledForRefueling": true,
    "HistoricPlates": "string",
    "LastStatusChange": "2022-08-09T09:13:14.209Z",
    "OldLicensePlate": "string",
    "Refueling": "string",
    "enjoyJobDetails": [
      {
        "data": {
          "call_center_notes": "string",
          "close_date": "2022-08-09T09:13:14.209Z",
          "closure_reason": "string",
          "control_room_notes": "string",
          "created_by": {
            "datetime": "2022-08-09T09:13:14.209Z",
            "user": {
              "url": "string",
              "userId": "string",
              "value": "string"
            }
          },
          "driver_response_about_job": {
            "commenttask": "string",
            "destinationadress": "string",
            "destinationpostalcode": "string",
            "fuelcart": "string",
            "genericservicecomments": "string",
            "inspectioncomment": "string",
            "inspectionreason": "string",
            "marchingcar": "string",
            "recoverydate": "string",
            "recoveryphotos": "string",
            "refuelamount": "string",
            "refuelcomments": "string",
            "refuelphotos": "string",
            "relocationcomments": "string",
            "repairshopneeded": "string",
            "specificactivity": "string",
            "taskdone": "string",
            "whytasknotdone": "string"
          },
          "fleet_team_notes": "string",
          "job": {
            "jobId": "string",
            "name": "string",
            "url": "string"
          },
          "open_date": "2022-08-09T09:13:14.209Z",
          "owner": {
            "ownerId": "string",
            "url": "string",
            "value": "string"
          },
          "peripheral_status": "string",
          "plate_number": {
            "plateId": "string",
            "url": "string",
            "value": "string"
          },
          "related_homes": "string",
          "status": "string",
          "take_over_date": "2022-08-09T09:13:14.209Z",
          "type": "string",
          "type_of_service": "string",
          "vehicle_position": "string"
        }
      }
    ]
  },
  "LastSignificantChange": "2022-08-09T09:13:14.209Z",
  "LastUpdate": "2022-08-09T09:13:14.209Z",
  "ShareNowProperties": {
    "AssignedToCompetitor": true,
    "CarID": "string",
    "KeyPresent": true,
    "ParkingCardPresent": true,
    "Reference": "string",
    "Task": [
      {
        "Comment": "string",
        "TaskCategory": "string",
        "TaskID": "string",
        "TaskTypeID": "string",
        "TaskTypeName": "string"
      }
    ],
    "dirtynessPredictionScore": 0,
    "fuelCardPresent": true,
    "vin": "string"
  },
  "ZityProperties": {//// fill by the scrapper
    "CarToken": "string",//Token with use it to change the status of the car in the app of the client 
    "DeviceToken": "string",
    "ZityMission": "string"
  },
/*List of missions that could be assigned on driver?*/  
  "activeMissionList": [
    {
      "bookingCodeId": "string",//the BookingCodeId we use it to define the price of each mission. A booking code can have a multiple mission. For exemple : Cleaning Standard, cleaning bad smell had the same booking CodeId.
      "creationDate": "2022-08-09T09:13:14.209Z",
      "driverOnMission": {
        "dateTillDriverRequestIsOver": "2022-08-09T09:13:14.209Z",// it take into account the parameter time of each type of mission (define but the ops, for exemple: if the driver request a mission recharge, he has one hour to do it) so : dateTillDriverRequestIsOver = CurrentDate+1hour
        "login": "string"
      },
      "enjoyJobAdditionalDetails": {
        "enjoyJobList": [
          {
            "fleetTeamLink": "string",
            "jobId": "string",
            "jobName": "string",
            "jobOpenDate": "2022-08-09T09:13:14.209Z",
            "jobType": "string"
          }
        ],
        "trentaSecondi": "string"
      },
/*proposed to be enum approved by Arthur: CHARGING_REFUELING	CLEANING	MOVING	SMART_REPAIR	OTHER*/      
      "missionCategory": "string",
/*proposed to be enum approved by Arthur needs udhustment in: https://docs.google.com/spreadsheets/d/1ObJdIi5TE6rWBWnJ-D_iFpJidpNtaaf8XyIgrfChdjE/edit#gid=0*/
      "missionModel": {
        "animation": "string",
        "car": "string",
        "color": "string",
        "delaysInMinuteCarIsReservedForDriver": 0,
        "missionName": "string"
      },
      "otoqiReference": "string",// it created by an endpoint reserverd mission. Unique id that define the mission
      "penaltyListId": [//these are the penalties that will be imposed on the driver if he has not cleaned the mission very well. It doesn't work at the moment
        "string"
      ],
      "pfrLink": "string",//it's the pfr link that we build for each mission and it allows to fill in fields automatically in the paperform. For exemple : https://{if Car.ConstantProperties.City = Paris or Lyon ; carshareops ; if Car.ConstantProperties.City = Milano ; ita-zity-ops}.paperform.co/?driverlogin=TAG&plate={Car.ConstantProperties.PlateNumber}&secretkey={Car.ConstantProperties.PlateNumber}&prenom=FIRSTNAME&carwillmove={missionCategory.CarWillMove}&contactcleaning={missionCategory.ContactCleaning}&missiontype={missionCategory.MissionName}&carcharged={missionCategory.CarCharged}&carExtractionFromCharger={missionCategory.CarExtractionFromCharger}&smart_repair={missionCategory.SmartRepair}&testmode={(if prod; 1; 0)}&pfrid={activeMission.otoqi_reference}&creationdate={activeMission.creationDate}&brand=Zity&carPlace=https://maps.google.com/?q={gpsString}&carPlaceClear={Car.CarProperties.Adress}&city={Car.CarProperties.City}&creationboolean={missionCategory.CreationBoolean}&cleaningMission={missionCategory.CleaningMission}&bookingCodeId={activeMission.bookingCodeId}&brandId={Car.ConstantProperties.Brand_Id}
      "requiredBadgeList": [// badge list to this this mission. For exemple: For charging for Zity we need Carsharing charging. 
        "string"
      ]
    }
  ],
/*
shows car status depending on several criteria
enum values IN_USE, AVAIALABLE, UNAVAILABLE
AVAILABLE: if in csCar group=Client AND status=Free
UNAVAILABLE: if in csCar group!=Client AND group!=Defleeted AND status=Free
IN_USE: if in csCar status=Booked OR status=Booked_Parked
*/
  "availabilityStatus": "IN_USE", 
/*autogenerated value by Java framework upon the first time object is created, not possible to set or update*/
                               
  "creationDate": "2022-08-09T09:13:14.209Z",
  "id": "string",
/*autogenerated value by Java framework on each API call, not possible to set*/
  "modificationDate": "2022-08-09T09:13:14.209Z",
/*
for easier search in Client app
concatanation of:
ConstantProperties.Account
ConstantProperties.Model
ConstantProperties.City
CarProperties.Adress
CarMissions.CurrentSpecificLocation
separated by space " "
*/
  "textForSearch": "string"
} 
