{"log":
 [{"message":
   ".> LEAN_PATH=././.lake/packages/batteries/.lake/build/lib:././.lake/packages/Qq/.lake/build/lib:././.lake/packages/aesop/.lake/build/lib:././.lake/packages/proofwidgets/.lake/build/lib:././.lake/packages/Cli/.lake/build/lib:././.lake/packages/importGraph/.lake/build/lib:././.lake/packages/LeanSearchClient/.lake/build/lib:././.lake/packages/mathlib/.lake/build/lib:././.lake/build/lib LD_LIBRARY_PATH=././.lake/packages/batteries/.lake/build/lib:././.lake/packages/Qq/.lake/build/lib:././.lake/packages/aesop/.lake/build/lib:././.lake/packages/proofwidgets/.lake/build/lib:././.lake/packages/Cli/.lake/build/lib:././.lake/packages/importGraph/.lake/build/lib:././.lake/packages/LeanSearchClient/.lake/build/lib:././.lake/packages/mathlib/.lake/build/lib:././.lake/build/lib:/home/horatiu/.elan/toolchains/leanprover--lean4---v4.12.0-rc1/lib/lean:/home/horatiu/.elan/toolchains/leanprover--lean4---v4.12.0-rc1/lib /home/horatiu/.elan/toolchains/leanprover--lean4---v4.12.0-rc1/bin/lean ././././MatchingLogic/AppContext.lean -R ./././. -o ././.lake/build/lib/MatchingLogic/AppContext.olean -i ././.lake/build/lib/MatchingLogic/AppContext.ilean -c ././.lake/build/ir/MatchingLogic/AppContext.c --json",
   "level": "trace"}],
 "depHash": "15799356870348300441"}