{"log":
 [{"message":
   ".> LEAN_PATH=././.lake/packages/batteries/.lake/build/lib:././.lake/packages/Qq/.lake/build/lib:././.lake/packages/aesop/.lake/build/lib:././.lake/packages/proofwidgets/.lake/build/lib:././.lake/packages/Cli/.lake/build/lib:././.lake/packages/importGraph/.lake/build/lib:././.lake/packages/LeanSearchClient/.lake/build/lib:././.lake/packages/mathlib/.lake/build/lib:././.lake/build/lib LD_LIBRARY_PATH=././.lake/packages/batteries/.lake/build/lib:././.lake/packages/Qq/.lake/build/lib:././.lake/packages/aesop/.lake/build/lib:././.lake/packages/proofwidgets/.lake/build/lib:././.lake/packages/Cli/.lake/build/lib:././.lake/packages/importGraph/.lake/build/lib:././.lake/packages/LeanSearchClient/.lake/build/lib:././.lake/packages/mathlib/.lake/build/lib:././.lake/build/lib:/home/horatiu/.elan/toolchains/leanprover--lean4---v4.12.0-rc1/lib/lean:/home/horatiu/.elan/toolchains/leanprover--lean4---v4.12.0-rc1/lib /home/horatiu/.elan/toolchains/leanprover--lean4---v4.12.0-rc1/bin/lean ././././MatchingLogic/Substitution.lean -R ./././. -o ././.lake/build/lib/MatchingLogic/Substitution.olean -i ././.lake/build/lib/MatchingLogic/Substitution.ilean -c ././.lake/build/ir/MatchingLogic/Substitution.c --json",
   "level": "trace"},
  {"message":
   "././././MatchingLogic/Substitution.lean:94:23: unused variable `ih`\nnote: this linter can be disabled with `set_option linter.unusedVariables false`",
   "level": "warning"},
  {"message":
   "././././MatchingLogic/Substitution.lean:110:15: unused variable `h`\nnote: this linter can be disabled with `set_option linter.unusedVariables false`",
   "level": "warning"},
  {"message":
   "././././MatchingLogic/Substitution.lean:305:16: unused variable `ih`\nnote: this linter can be disabled with `set_option linter.unusedVariables false`",
   "level": "warning"},
  {"message":
   "././././MatchingLogic/Substitution.lean:311:25: unused variable `ih`\nnote: this linter can be disabled with `set_option linter.unusedVariables false`",
   "level": "warning"},
  {"message":
   "././././MatchingLogic/Substitution.lean:345:8: Try this: simp only [ne_eq, isFreeSvar, ↓reduceIte, Bool.not_eq_true, substitutableForSvarIn, Bool.decide_and,\n  Bool.decide_eq_false, Bool.decide_eq_true, Bool.if_true_right, Bool.or_eq_true, Bool.not_eq_true', Bool.and_eq_true,\n  Bool.decide_or, not_or, Bool.not_or, h] at *",
   "level": "info"},
  {"message":
   "././././MatchingLogic/Substitution.lean:345:8: Try this: simp only [ne_eq, isFreeSvar, ↓reduceIte, Bool.not_eq_true, substitutableForSvarIn, Bool.decide_and,\n  Bool.decide_eq_false, Bool.decide_eq_true, Bool.if_true_right, Bool.or_eq_true, Bool.not_eq_true', Bool.and_eq_true,\n  Bool.decide_or, not_or, Bool.not_or, h] at *",
   "level": "info"},
  {"message":
   "././././MatchingLogic/Substitution.lean:348:17: unused variable `hfv`\nnote: this linter can be disabled with `set_option linter.unusedVariables false`",
   "level": "warning"},
  {"message":
   "././././MatchingLogic/Substitution.lean:355:17: unused variable `hfv`\nnote: this linter can be disabled with `set_option linter.unusedVariables false`",
   "level": "warning"}],
 "depHash": "3756689343611177468"}