\relax 
\providecommand\hyper@newdestlabel[2]{}
\providecommand\HyperFirstAtBeginDocument{\AtBeginDocument}
\HyperFirstAtBeginDocument{\ifx\hyper@anchor\@undefined
\global\let\oldnewlabel\newlabel
\gdef\newlabel#1#2{\newlabelxx{#1}#2}
\gdef\newlabelxx#1#2#3#4#5#6{\oldnewlabel{#1}{{#2}{#3}}}
\AtEndDocument{\ifx\hyper@anchor\@undefined
\let\newlabel\oldnewlabel
\fi}
\fi}
\global\let\hyper@last\relax 
\gdef\HyperFirstAtBeginDocument#1{#1}
\providecommand\HyField@AuxAddToFields[1]{}
\providecommand\HyField@AuxAddToCoFields[2]{}
\citation{CheLucRos21}
\citation{CheMac22}
\citation{BerCheHorPenTus22}
\@writefile{toc}{\contentsline {chapter}{\numberline {1}Introduction}{1}{chapter.1}\protected@file@percent }
\@writefile{lof}{\addvspace {10\p@ }}
\@writefile{lot}{\addvspace {10\p@ }}
\@writefile{toc}{\contentsline {chapter}{\numberline {2}Emitting Metamath}{2}{chapter.2}\protected@file@percent }
\@writefile{lof}{\addvspace {10\p@ }}
\@writefile{lot}{\addvspace {10\p@ }}
\newlabel{chap:emitting-metamath}{{2}{2}{Emitting Metamath}{chapter.2}{}}
\@writefile{toc}{\contentsline {section}{\numberline {2.1}MMBuilder.lean}{2}{section.2.1}\protected@file@percent }
\@writefile{toc}{\contentsline {chapter}{\numberline {3}Translating concrete proofs}{4}{chapter.3}\protected@file@percent }
\@writefile{lof}{\addvspace {10\p@ }}
\@writefile{lot}{\addvspace {10\p@ }}
\newlabel{chap:concrete-extraction}{{3}{4}{Translating concrete proofs}{chapter.3}{}}
\@writefile{toc}{\contentsline {section}{\numberline {3.1}ToMMClaim, ToMMProof.lean and ToMMProofProof.lean}{4}{section.3.1}\protected@file@percent }
\@writefile{toc}{\contentsline {section}{\numberline {3.2}MLITP.lean}{5}{section.3.2}\protected@file@percent }
\citation{Lin20}
\@writefile{toc}{\contentsline {section}{\numberline {3.3}Shape.lean}{6}{section.3.3}\protected@file@percent }
\@writefile{toc}{\contentsline {chapter}{\numberline {4}Translating generic proofs through metaprogramming}{8}{chapter.4}\protected@file@percent }
\@writefile{lof}{\addvspace {10\p@ }}
\@writefile{lot}{\addvspace {10\p@ }}
\newlabel{chap:generic-extraction}{{4}{8}{Translating generic proofs through metaprogramming}{chapter.4}{}}
\@writefile{toc}{\contentsline {section}{\numberline {4.1}MLParser.lean}{8}{section.4.1}\protected@file@percent }
\@writefile{toc}{\contentsline {section}{\numberline {4.2}IRPatt.lean}{9}{section.4.2}\protected@file@percent }
\@writefile{toc}{\contentsline {section}{\numberline {4.3}IRProofStructured.lean}{10}{section.4.3}\protected@file@percent }
\@writefile{toc}{\contentsline {section}{\numberline {4.4}Other files}{11}{section.4.4}\protected@file@percent }
\bibcite{CheLucRos21}{1}
\bibcite{CheMac22}{2}
\bibcite{BerCheHorPenTus22}{3}
\bibcite{Lin20}{4}
\gdef \@abspage@last{13}
