<svg width="130" height="130" viewBox="0 0 130 130" fill="none" xmlns="http://www.w3.org/2000/svg">
<circle cx="65" cy="65" r="64.5" stroke="#FF793F" stroke-dasharray="5 5"/>
<path fill-rule="evenodd" clip-rule="evenodd" d="M49.988 78.2729H76.8585C78.5073 78.2729 79.8465 76.9337 79.8465 75.2849V63.5848C79.8465 63.1888 79.5225 62.8648 79.1265 62.8648C78.7305 62.8648 78.4065 63.1888 78.4065 63.5848V75.2921C78.4065 76.1489 77.7153 76.8401 76.8585 76.8401H49.988C49.1312 76.8329 48.44 76.1417 48.44 75.2921V59.0704C48.44 58.2136 49.1312 57.5224 49.988 57.5224H56.036C57.3464 57.5224 58.4984 56.68 58.8872 55.4272L59.168 54.5272C59.3696 53.8792 59.9672 53.44 60.644 53.44H66.2097C66.8865 53.44 67.4841 53.8792 67.6857 54.5272L67.9665 55.4272C68.3553 56.68 69.5073 57.5224 70.8177 57.5224H72.3513C72.7473 57.5224 73.0713 57.1984 73.0713 56.8024C73.0713 56.4064 72.7473 56.0824 72.3513 56.0824H70.8177C70.1409 56.0824 69.5433 55.6432 69.3417 54.9952L69.0609 54.0952C68.6721 52.8424 67.5201 52 66.2097 52H60.644C59.3336 52 58.1816 52.8424 57.7928 54.0952L57.512 54.9952C57.3104 55.6432 56.7128 56.0824 56.036 56.0824H49.988C48.3392 56.0824 47 57.4288 47 59.0704V75.2921C47 76.9337 48.3392 78.2729 49.988 78.2729ZM56.0997 67.1776C56.0997 63.1384 59.3829 59.8552 63.4221 59.8552C67.4614 59.8552 70.7446 63.1384 70.7446 67.1776C70.7446 71.2169 67.4614 74.5001 63.4221 74.5001C59.3829 74.5001 56.0997 71.2169 56.0997 67.1776ZM57.5397 67.1848C57.5397 70.4249 60.1749 73.0673 63.4221 73.0673C66.6694 73.0673 69.3046 70.4249 69.3046 67.1848C69.3046 63.9448 66.6622 61.3024 63.4221 61.3024C60.1821 61.3024 57.5397 63.9448 57.5397 67.1848ZM59.6571 67.1777C59.6571 65.1041 61.3419 63.4121 63.4227 63.4121C65.5036 63.4121 67.1884 65.1041 67.1884 67.1777C67.1884 69.2513 65.4963 70.9433 63.4227 70.9433C61.3491 70.9433 59.6571 69.2513 59.6571 67.1777ZM61.0971 67.1849C61.0971 68.4665 62.1411 69.5105 63.4227 69.5105C64.7043 69.5105 65.7484 68.4665 65.7484 67.1849C65.7484 65.9033 64.7043 64.8593 63.4227 64.8593C62.1411 64.8593 61.0971 65.9033 61.0971 67.1849ZM79.8467 56.0824H82.2803C82.6763 56.0824 83.0003 56.4064 83.0003 56.8024C83.0003 57.1984 82.6763 57.5224 82.2803 57.5224H79.8467V59.956C79.8467 60.352 79.5227 60.676 79.1267 60.676C78.7307 60.676 78.4067 60.352 78.4067 59.956V57.5224H75.9731C75.5771 57.5224 75.2531 57.1984 75.2531 56.8024C75.2531 56.4064 75.5771 56.0824 75.9731 56.0824H78.4067V53.6488C78.4067 53.2528 78.7307 52.9288 79.1267 52.9288C79.5227 52.9288 79.8467 53.2528 79.8467 53.6488V56.0824Z" fill="#FF793F"/>
</svg>