{
  "info": {
    "_postman_id": "a6db2d81-0b41-41f0-8e1e-b20523ea64da",
    "name": "goRest Auth.",
    "schema": "https://schema.getpostman.com/json/collection/v2.0.0/collection.json"
  },
  "item": [
    {
      "name": "get posts",
      "event": [
        {
          "listen": "test",
          "script": {
            "id": "422d9eec-34cd-4609-ac2c-ee8621d6c7c8",
            "exec": [
              "pm.test(\"Validate the status code\", function(){",
              "    pm.response.to.have.status(200);",
              "})",
              "",
              ""
            ],
            "type": "text/javascript"
          }
        }
      ],
      "_postman_id": "98287330-9b4e-45a4-9903-6f3da866540e",
      "protocolProfileBehavior": {
        "disableBodyPruning": true
      },
      "request": {
        "method": "GET",
        "header": [
          {
            "key": "Authorization",
            "value": "Bearer af52f55e082382eb807b4ac58cf064339cf822d07eea1f1974f83da11e407c82",
            "type": "text"
          }
        ],
        "body": {
          "mode": "raw",
          "raw": "",
          "options": {
            "raw": {
              "language": "json"
            }
          }
        },
        "url": "https://gorest.co.in/public/v2/posts"
      },
      "response": []
    },
    {
      "name": "create posts",
      "event": [
        {
          "listen": "test",
          "script": {
            "id": "77e96fe0-122f-4c76-a8aa-39c5c913b7e7",
            "exec": [
              "pm.test(\"Validate the title\", function(){",
              "    const jsondata=pm.response.json();",
              "    pm.expect(jsondata.user_id).eql(2009);",
              "})",
              "",
              "pm.test(\"Validate the userid\", function(){",
              "    const jsondata=pm.response.json();",
              "    pm.expect(jsondata.title).eql(\"QA Refersher Session\");",
              "})",
              "",
              "pm.test(\"Fetching id value from response body\", function(){",
              "    const jsonData = pm.resonse.json();",
              "    const id = jsonData.id;",
              "    pm.collectionVariables.set(\"idValue\",id);",
              "})"
            ],
            "type": "text/javascript"
          }
        }
      ],
      "_postman_id": "f44efb7c-26dd-48f9-972e-d697f831dad6",
      "protocolProfileBehavior": {
        "disableBodyPruning": true
      },
      "request": {
        "method": "POST",
        "header": [
          {
            "key": "Authorization",
            "value": "Bearer af52f55e082382eb807b4ac58cf064339cf822d07eea1f1974f83da11e407c82",
            "type": "text"
          }
        ],
        "body": {
          "mode": "raw",
          "raw": "{\n        \"user_id\": 2009,\n        \"title\": \"QA Refersher Session\",\n        \"body\": \"Cado approbo canonicus. Una sequi damnatio. Vergo annus cruciamentum. Valde supellex vulticulus. Vetus aeternus ut. Defetiscor aeger ars. Somniculosus creptio cariosus. Colligo canto verumtamen. Comis suppellex trucido. Censura et valetudo. Cometes doloremque vallum. Quia tenus cubicularis. Amissio et tersus. Id teres certe. Alius synagoga delectatio. Inflammatio quo bellum. Enim sustineo absens. Coniecto ultra laboriosam. Sordeo denuncio acies.\"\n    }",
          "options": {
            "raw": {
              "language": "json"
            }
          }
        },
        "url": "https://gorest.co.in/public/v2/posts/"
      },
      "response": []
    },
    {
      "name": "update posts",
      "event": [
        {
          "listen": "test",
          "script": {
            "id": "348573c3-3296-4b46-b578-5f293af59ab3",
            "exec": [
              "pm.test(\"Validate title\", function(){",
              "    const jsondata=pm.response.json();",
              "    pm.expect(jsondata.title).eql(\"QA Refersher Session\");",
              "})"
            ],
            "type": "text/javascript"
          }
        }
      ],
      "_postman_id": "9b357073-8a42-413f-9e6b-7019dafcfb5d",
      "protocolProfileBehavior": {
        "disableBodyPruning": true
      },
      "request": {
        "method": "PUT",
        "header": [
          {
            "key": "Authorization",
            "value": "Bearer af52f55e082382eb807b4ac58cf064339cf822d07eea1f1974f83da11e407c82",
            "type": "text"
          }
        ],
        "body": {
          "mode": "raw",
          "raw": "{\n    \"user_id\": 2009,\n    \"title\": \"QA Refersher Session\",\n    \"body\": \"Session is for recalling all the Java,Selenium,Framework & API\"\n}",
          "options": {
            "raw": {
              "language": "json"
            }
          }
        },
        "url": "https://gorest.co.in/public/v2/posts/{{idValue}}"
      },
      "response": []
    },
    {
      "name": "delete posts",
      "event": [
        {
          "listen": "test",
          "script": {
            "id": "49cc8495-0965-41ea-8cc6-86b82abf2236",
            "exec": [
              "pm.test(\"validate the status code\", function(){",
              "    pm.response.to.have.status(204)",
              "})",
              ""
            ],
            "type": "text/javascript"
          }
        }
      ],
      "_postman_id": "766e0e40-2d04-4a2e-aa71-9266c30f9305",
      "protocolProfileBehavior": {
        "disableBodyPruning": true
      },
      "request": {
        "method": "DELETE",
        "header": [
          {
            "key": "Authorization",
            "value": "Bearer af52f55e082382eb807b4ac58cf064339cf822d07eea1f1974f83da11e407c82",
            "type": "text"
          }
        ],
        "url": "https://gorest.co.in/public/v2/posts/14566"
      },
      "response": []
    }
  ],
  "event": [
    {
      "listen": "prerequest",
      "script": {
        "id": "32bccb4b-0b47-40b6-a6df-26d0da060628",
        "type": "text/javascript",
        "exec": [
          ""
        ]
      }
    },
    {
      "listen": "test",
      "script": {
        "id": "709e2224-f79d-49bc-bf80-aa78d09bd683",
        "type": "text/javascript",
        "exec": [
          ""
        ]
      }
    }
  ],
  "variable": [
    {
      "id": "b06d4388-5ec5-4b9d-8c84-86010449eba6",
      "key": "idValue",
      "value": "14566",
      "type": "string"
    }
  ]
}