{
  "info": {
    "_postman_id": "3fe81abf-e0b4-48af-bc7a-f35b972a3e67",
    "name": "QA Refresher",
    "schema": "https://schema.getpostman.com/json/collection/v2.0.0/collection.json"
  },
  "item": [
    {
      "name": "get data",
      "event": [
        {
          "listen": "test",
          "script": {
            "id": "76bd7419-6496-4081-be43-0bd5646dff90",
            "exec": [
              "pm.test(\"validate the status code\", function(){",
              "    pm.response.to.have.status(200)",
              "})",
              "",
              "pm.test(\"valiidate email of first user data\", function(){",
              "    const jsonData=pm.response.json();",
              "    pm.expect(jsonData.data[0].id).eql(7);",
              "})",
              "",
              "pm.test(\"validate the user of 3rd user data\", function(){",
              "    const jsondata=pm.response.json();",
              "    pm.expect(jsondata.data[2].email).eql(\"tobias.funke@reqres.in\");",
              "})"
            ],
            "type": "text/javascript"
          }
        }
      ],
      "_postman_id": "6240aa26-3155-404a-9908-fa6f2a8bd4a0",
      "protocolProfileBehavior": {
        "disableBodyPruning": true
      },
      "request": {
        "method": "GET",
        "header": [],
        "url": {
          "raw": "https://reqres.in/api/users?page=2",
          "protocol": "https",
          "host": [
            "reqres",
            "in"
          ],
          "path": [
            "api",
            "users"
          ],
          "query": [
            {
              "key": "page",
              "value": "2"
            }
          ]
        }
      },
      "response": []
    },
    {
      "name": "post request",
      "event": [
        {
          "listen": "test",
          "script": {
            "id": "5129a867-c792-4b6d-a38b-fbb13f69a42f",
            "exec": [
              "pm.test(\"Fetching id value from response body\", function(){",
              "    const jsonData = pm.resonse.json();",
              "    const id = jsonData.id;",
              "    pm.collectionVariables.set(\"idValue\",id);",
              "})"
            ],
            "type": "text/javascript"
          }
        }
      ],
      "_postman_id": "896bf4d8-5064-440a-8b9c-03e7d81857f6",
      "protocolProfileBehavior": {
        "disableBodyPruning": true
      },
      "request": {
        "method": "POST",
        "header": [],
        "body": {
          "mode": "raw",
          "raw": "{\n    \"name\": \"thasan\",\n    \"job\": \"trainer\"\n}",
          "options": {
            "raw": {
              "language": "json"
            }
          }
        },
        "url": "https://reqres.in/api/users"
      },
      "response": []
    },
    {
      "name": "put update",
      "event": [
        {
          "listen": "test",
          "script": {
            "id": "d8e13ed5-192b-44b0-9df9-72d989bcdf83",
            "exec": [
              ""
            ],
            "type": "text/javascript"
          }
        }
      ],
      "_postman_id": "bc799a64-2484-4dbe-a2b8-ef230ddd38ff",
      "protocolProfileBehavior": {
        "disableBodyPruning": true
      },
      "request": {
        "method": "PUT",
        "header": [],
        "body": {
          "mode": "raw",
          "raw": "{\n    \"name\": \"Thasan\",\n    \"job\": \"trainer\"\n}",
          "options": {
            "raw": {
              "language": "json"
            }
          }
        },
        "url": "https://reqres.in/api/users/{{idValue}}"
      },
      "response": []
    },
    {
      "name": "delete Request",
      "_postman_id": "f99cd813-f5c6-42ce-bb65-c0ad4bd7a921",
      "protocolProfileBehavior": {
        "disableBodyPruning": true
      },
      "request": {
        "method": "DELETE",
        "header": [],
        "url": "https://reqres.in/api/users/604"
      },
      "response": []
    }
  ],
  "event": [
    {
      "listen": "prerequest",
      "script": {
        "id": "d62289c0-a5c2-4029-b3fa-ad0c169a13ba",
        "type": "text/javascript",
        "exec": [
          ""
        ]
      }
    },
    {
      "listen": "test",
      "script": {
        "id": "aae8136c-6646-4842-95b7-9a6293ab6594",
        "type": "text/javascript",
        "exec": [
          ""
        ]
      }
    }
  ],
  "variable": [
    {
      "id": "ecfd0ec7-f2dc-4666-a69e-ca873d7794d5",
      "key": "idValue",
      "value": "654",
      "type": "string"
    }
  ]
}