timeStamp,elapsed,label,responseCode,responseMessage,threadName,dataType,success,failureMessage,bytes,sentBytes,grpThreads,allThreads,URL,Latency,IdleTime,Connect
1674472793543,22104,https://opensource-demo.orangehrmlive.com/,200,OK,Thread Group 1-8,text,true,,4312352,3984,10,10,https://opensource-demo.orangehrmlive.com/web/index.php/auth/login,15700,0,15319
1674472793543,15703,https://opensource-demo.orangehrmlive.com/-0,302,Found,Thread Group 1-8,text,true,,1054,502,10,10,https://opensource-demo.orangehrmlive.com/,15700,0,15319
1674472809247,806,https://opensource-demo.orangehrmlive.com/-1,200,OK,Thread Group 1-8,text,true,,4409,526,10,10,https://opensource-demo.orangehrmlive.com/web/index.php/auth/login,805,0,0
1674472810089,833,https://opensource-demo.orangehrmlive.com/-2,200,OK,Thread Group 1-8,bin,true,,1674,588,10,10,https://opensource-demo.orangehrmlive.com/web/dist/favicon.ico?1672659722816,833,0,0
1674472810089,3937,https://opensource-demo.orangehrmlive.com/-3,200,OK,Thread Group 1-8,text,true,,562823,598,10,10,https://opensource-demo.orangehrmlive.com/web/dist/css/chunk-vendors.css?1672659722816,1919,0,880
1674472810092,3804,https://opensource-demo.orangehrmlive.com/-4,200,OK,Thread Group 1-8,text,true,,666549,588,10,10,https://opensource-demo.orangehrmlive.com/web/dist/css/app.css?1672659722816,1685,0,726
1674472810092,5555,https://opensource-demo.orangehrmlive.com/-5,200,OK,Thread Group 1-8,text,true,,1569995,596,10,10,https://opensource-demo.orangehrmlive.com/web/dist/js/chunk-vendors.js?1672659722816,1687,0,726
1674472810092,5555,https://opensource-demo.orangehrmlive.com/-6,200,OK,Thread Group 1-8,text,true,,1505848,586,10,10,https://opensource-demo.orangehrmlive.com/web/dist/js/app.js?1672659722816,1754,0,781
1674472793744,22037,https://opensource-demo.orangehrmlive.com/,200,OK,Thread Group 1-10,text,true,,4312350,3984,10,10,https://opensource-demo.orangehrmlive.com/web/index.php/auth/login,15499,0,15131
1674472793744,15502,https://opensource-demo.orangehrmlive.com/-0,302,Found,Thread Group 1-10,text,true,,1054,502,10,10,https://opensource-demo.orangehrmlive.com/,15499,0,15131
1674472809247,1422,https://opensource-demo.orangehrmlive.com/-1,200,OK,Thread Group 1-10,text,true,,4407,526,10,10,https://opensource-demo.orangehrmlive.com/web/index.php/auth/login,1421,0,0
1674472810676,1129,https://opensource-demo.orangehrmlive.com/-2,200,OK,Thread Group 1-10,bin,true,,1674,588,10,10,https://opensource-demo.orangehrmlive.com/web/dist/favicon.ico?1672659722816,1129,0,790
1674472810675,3587,https://opensource-demo.orangehrmlive.com/-3,200,OK,Thread Group 1-10,text,true,,562823,598,10,10,https://opensource-demo.orangehrmlive.com/web/dist/css/chunk-vendors.css?1672659722816,1412,0,806
1674472810675,3558,https://opensource-demo.orangehrmlive.com/-4,200,OK,Thread Group 1-10,text,true,,666549,588,10,10,https://opensource-demo.orangehrmlive.com/web/dist/css/app.css?1672659722816,1097,0,0
1674472810676,5105,https://opensource-demo.orangehrmlive.com/-5,200,OK,Thread Group 1-10,text,true,,1569995,596,10,10,https://opensource-demo.orangehrmlive.com/web/dist/js/chunk-vendors.js?1672659722816,1316,0,731
1674472810676,5004,https://opensource-demo.orangehrmlive.com/-6,200,OK,Thread Group 1-10,text,true,,1505848,586,10,10,https://opensource-demo.orangehrmlive.com/web/dist/js/app.js?1672659722816,1320,0,731
1674472792955,22901,https://opensource-demo.orangehrmlive.com/,200,OK,Thread Group 1-2,text,true,,4312354,3984,10,10,https://opensource-demo.orangehrmlive.com/web/index.php/auth/login,16288,0,15902
1674472792955,16291,https://opensource-demo.orangehrmlive.com/-0,302,Found,Thread Group 1-2,text,true,,1054,502,10,10,https://opensource-demo.orangehrmlive.com/,16288,0,15902
1674472809249,956,https://opensource-demo.orangehrmlive.com/-1,200,OK,Thread Group 1-2,text,true,,4411,526,10,10,https://opensource-demo.orangehrmlive.com/web/index.php/auth/login,956,0,0
1674472810206,1399,https://opensource-demo.orangehrmlive.com/-2,200,OK,Thread Group 1-2,bin,true,,1674,588,10,10,https://opensource-demo.orangehrmlive.com/web/dist/favicon.ico?1672659722816,1399,0,717
1674472810206,2437,https://opensource-demo.orangehrmlive.com/-3,200,OK,Thread Group 1-2,text,true,,562823,598,10,10,https://opensource-demo.orangehrmlive.com/web/dist/css/chunk-vendors.css?1672659722816,1186,0,0
1674472810206,3967,https://opensource-demo.orangehrmlive.com/-4,200,OK,Thread Group 1-2,text,true,,666549,588,10,10,https://opensource-demo.orangehrmlive.com/web/dist/css/app.css?1672659722816,1757,0,781
1674472810207,5552,https://opensource-demo.orangehrmlive.com/-5,200,OK,Thread Group 1-2,text,true,,1569995,596,10,10,https://opensource-demo.orangehrmlive.com/web/dist/js/chunk-vendors.js?1672659722816,1746,0,778
1674472810207,5649,https://opensource-demo.orangehrmlive.com/-6,200,OK,Thread Group 1-2,text,true,,1505848,586,10,10,https://opensource-demo.orangehrmlive.com/web/dist/js/app.js?1672659722816,1758,0,783
1674472793052,22840,https://opensource-demo.orangehrmlive.com/,200,OK,Thread Group 1-3,text,true,,4312357,3984,10,10,https://opensource-demo.orangehrmlive.com/web/index.php/auth/login,16191,0,15810
1674472793052,16194,https://opensource-demo.orangehrmlive.com/-0,302,Found,Thread Group 1-3,text,true,,1054,502,10,10,https://opensource-demo.orangehrmlive.com/,16191,0,15810
1674472809248,1418,https://opensource-demo.orangehrmlive.com/-1,200,OK,Thread Group 1-3,text,true,,4414,526,10,10,https://opensource-demo.orangehrmlive.com/web/index.php/auth/login,1418,0,0
1674472810673,829,https://opensource-demo.orangehrmlive.com/-2,200,OK,Thread Group 1-3,bin,true,,1674,588,10,10,https://opensource-demo.orangehrmlive.com/web/dist/favicon.ico?1672659722816,829,0,0
1674472810676,3438,https://opensource-demo.orangehrmlive.com/-3,200,OK,Thread Group 1-3,text,true,,562823,598,10,10,https://opensource-demo.orangehrmlive.com/web/dist/css/chunk-vendors.css?1672659722816,1457,0,814
1674472810677,3508,https://opensource-demo.orangehrmlive.com/-4,200,OK,Thread Group 1-3,text,true,,666549,588,10,10,https://opensource-demo.orangehrmlive.com/web/dist/css/app.css?1672659722816,1346,0,733
1674472810677,5215,https://opensource-demo.orangehrmlive.com/-5,200,OK,Thread Group 1-3,text,true,,1569995,596,10,10,https://opensource-demo.orangehrmlive.com/web/dist/js/chunk-vendors.js?1672659722816,1390,0,787
1674472810678,5192,https://opensource-demo.orangehrmlive.com/-6,200,OK,Thread Group 1-3,text,true,,1505848,586,10,10,https://opensource-demo.orangehrmlive.com/web/dist/js/app.js?1672659722816,1448,0,811
1674472793643,22387,https://opensource-demo.orangehrmlive.com/,200,OK,Thread Group 1-9,text,true,,4312365,3984,10,10,https://opensource-demo.orangehrmlive.com/web/index.php/auth/login,15600,0,15227
1674472793643,15603,https://opensource-demo.orangehrmlive.com/-0,302,Found,Thread Group 1-9,text,true,,1054,502,10,10,https://opensource-demo.orangehrmlive.com/,15600,0,15227
1674472809249,927,https://opensource-demo.orangehrmlive.com/-1,200,OK,Thread Group 1-9,text,true,,4422,526,10,10,https://opensource-demo.orangehrmlive.com/web/index.php/auth/login,927,0,0
1674472810181,782,https://opensource-demo.orangehrmlive.com/-2,200,OK,Thread Group 1-9,bin,true,,1674,588,10,10,https://opensource-demo.orangehrmlive.com/web/dist/favicon.ico?1672659722816,782,0,0
1674472810185,5168,https://opensource-demo.orangehrmlive.com/-3,200,OK,Thread Group 1-9,text,true,,562823,598,10,10,https://opensource-demo.orangehrmlive.com/web/dist/css/chunk-vendors.css?1672659722816,1756,0,777
1674472810185,3954,https://opensource-demo.orangehrmlive.com/-4,200,OK,Thread Group 1-9,text,true,,666549,588,10,10,https://opensource-demo.orangehrmlive.com/web/dist/css/app.css?1672659722816,1755,0,777
1674472810185,5572,https://opensource-demo.orangehrmlive.com/-5,200,OK,Thread Group 1-9,text,true,,1569995,596,10,10,https://opensource-demo.orangehrmlive.com/web/dist/js/chunk-vendors.js?1672659722816,1759,0,782
1674472810186,5844,https://opensource-demo.orangehrmlive.com/-6,200,OK,Thread Group 1-9,text,true,,1505848,586,10,10,https://opensource-demo.orangehrmlive.com/web/dist/js/app.js?1672659722816,1762,0,790
1674472815652,385,https://opensource-demo.orangehrmlive.com/web/index.php/core/i18n/messages,200,OK,Thread Group 1-8,text,true,,96946,468,10,10,https://opensource-demo.orangehrmlive.com/web/index.php/core/i18n/messages,378,0,0
1674472815784,402,https://opensource-demo.orangehrmlive.com/web/index.php/core/i18n/messages,200,OK,Thread Group 1-10,text,true,,96946,468,10,10,https://opensource-demo.orangehrmlive.com/web/index.php/core/i18n/messages,392,0,0
1674472815859,401,https://opensource-demo.orangehrmlive.com/web/index.php/core/i18n/messages,200,OK,Thread Group 1-2,text,true,,96946,468,10,10,https://opensource-demo.orangehrmlive.com/web/index.php/core/i18n/messages,393,0,0
1674472815895,418,https://opensource-demo.orangehrmlive.com/web/index.php/core/i18n/messages,200,OK,Thread Group 1-3,text,true,,96946,468,10,10,https://opensource-demo.orangehrmlive.com/web/index.php/core/i18n/messages,410,0,0
1674472816032,723,https://opensource-demo.orangehrmlive.com/web/index.php/core/i18n/messages,200,OK,Thread Group 1-9,text,true,,96946,468,10,10,https://opensource-demo.orangehrmlive.com/web/index.php/core/i18n/messages,457,0,0
1674472793150,23715,https://opensource-demo.orangehrmlive.com/,200,OK,Thread Group 1-4,text,true,,4312345,3984,10,10,https://opensource-demo.orangehrmlive.com/web/index.php/auth/login,16093,0,15711
1674472793150,16096,https://opensource-demo.orangehrmlive.com/-0,302,Found,Thread Group 1-4,text,true,,1054,502,10,10,https://opensource-demo.orangehrmlive.com/,16093,0,15711
1674472809249,941,https://opensource-demo.orangehrmlive.com/-1,200,OK,Thread Group 1-4,text,true,,4402,526,10,10,https://opensource-demo.orangehrmlive.com/web/index.php/auth/login,941,0,0
1674472810193,1542,https://opensource-demo.orangehrmlive.com/-2,200,OK,Thread Group 1-4,bin,true,,1674,588,10,10,https://opensource-demo.orangehrmlive.com/web/dist/favicon.ico?1672659722816,1542,0,806
1674472810193,2479,https://opensource-demo.orangehrmlive.com/-3,200,OK,Thread Group 1-4,text,true,,562823,598,10,10,https://opensource-demo.orangehrmlive.com/web/dist/css/chunk-vendors.css?1672659722816,1187,0,0
1674472810193,3800,https://opensource-demo.orangehrmlive.com/-4,200,OK,Thread Group 1-4,text,true,,666549,588,10,10,https://opensource-demo.orangehrmlive.com/web/dist/css/app.css?1672659722816,1645,0,726
1674472810193,5493,https://opensource-demo.orangehrmlive.com/-5,200,OK,Thread Group 1-4,text,true,,1569995,596,10,10,https://opensource-demo.orangehrmlive.com/web/dist/js/chunk-vendors.js?1672659722816,1642,0,728
1674472810196,6669,https://opensource-demo.orangehrmlive.com/-6,200,OK,Thread Group 1-4,text,true,,1505848,586,10,10,https://opensource-demo.orangehrmlive.com/web/dist/js/app.js?1672659722816,1655,0,728
1674472792899,24150,https://opensource-demo.orangehrmlive.com/,200,OK,Thread Group 1-1,text,true,,4312348,3984,10,10,https://opensource-demo.orangehrmlive.com/web/index.php/auth/login,16344,0,15959
1674472792899,16347,https://opensource-demo.orangehrmlive.com/-0,302,Found,Thread Group 1-1,text,true,,1054,502,10,10,https://opensource-demo.orangehrmlive.com/,16344,0,15959
1674472809247,808,https://opensource-demo.orangehrmlive.com/-1,200,OK,Thread Group 1-1,text,true,,4405,526,10,10,https://opensource-demo.orangehrmlive.com/web/index.php/auth/login,808,0,0
1674472810089,1514,https://opensource-demo.orangehrmlive.com/-2,200,OK,Thread Group 1-1,bin,true,,1674,588,10,10,https://opensource-demo.orangehrmlive.com/web/dist/favicon.ico?1672659722816,1514,0,805
1674472810089,2318,https://opensource-demo.orangehrmlive.com/-3,200,OK,Thread Group 1-1,text,true,,562823,598,10,10,https://opensource-demo.orangehrmlive.com/web/dist/css/chunk-vendors.css?1672659722816,1051,0,0
1674472810092,3971,https://opensource-demo.orangehrmlive.com/-4,200,OK,Thread Group 1-1,text,true,,666549,588,10,10,https://opensource-demo.orangehrmlive.com/web/dist/css/app.css?1672659722816,1759,0,778
1674472810092,6436,https://opensource-demo.orangehrmlive.com/-5,200,OK,Thread Group 1-1,text,true,,1569995,596,10,10,https://opensource-demo.orangehrmlive.com/web/dist/js/chunk-vendors.js?1672659722816,1878,0,857
1674472810092,6957,https://opensource-demo.orangehrmlive.com/-6,200,OK,Thread Group 1-1,text,true,,1505848,586,10,10,https://opensource-demo.orangehrmlive.com/web/dist/js/app.js?1672659722816,1710,0,728
1674472816867,636,https://opensource-demo.orangehrmlive.com/web/index.php/core/i18n/messages,200,OK,Thread Group 1-4,text,true,,96946,468,10,10,https://opensource-demo.orangehrmlive.com/web/index.php/core/i18n/messages,389,0,0
1674472817051,625,https://opensource-demo.orangehrmlive.com/web/index.php/core/i18n/messages,200,OK,Thread Group 1-1,text,true,,96946,468,10,10,https://opensource-demo.orangehrmlive.com/web/index.php/core/i18n/messages,380,0,0
1674472816909,1091,https://opensource-demo.orangehrmlive.com/web/index.php/auth/validate,200,OK,Thread Group 1-10,text,true,,11066,5076,10,10,https://opensource-demo.orangehrmlive.com/web/index.php/auth/login,399,0,0
1674472816909,399,https://opensource-demo.orangehrmlive.com/web/index.php/auth/validate-0,302,Found,Thread Group 1-10,text,true,,1659,808,10,10,https://opensource-demo.orangehrmlive.com/web/index.php/auth/validate,399,0,0
1674472817308,413,https://opensource-demo.orangehrmlive.com/web/index.php/auth/validate-1,200,OK,Thread Group 1-10,text,true,,4442,627,10,10,https://opensource-demo.orangehrmlive.com/web/index.php/auth/login,413,0,0
1674472817725,268,https://opensource-demo.orangehrmlive.com/web/index.php/auth/validate-2,304,Not Modified,Thread Group 1-10,,true,,991,723,10,10,https://opensource-demo.orangehrmlive.com/web/dist/favicon.ico?1672659722816,0,0,0
1674472817725,246,https://opensource-demo.orangehrmlive.com/web/index.php/auth/validate-3,304,Not Modified,Thread Group 1-10,,true,,993,735,10,10,https://opensource-demo.orangehrmlive.com/web/dist/css/chunk-vendors.css?1672659722816,0,0,0
1674472817725,275,https://opensource-demo.orangehrmlive.com/web/index.php/auth/validate-4,304,Not Modified,Thread Group 1-10,,true,,993,725,10,10,https://opensource-demo.orangehrmlive.com/web/dist/css/app.css?1672659722816,0,0,0
1674472817724,240,https://opensource-demo.orangehrmlive.com/web/index.php/auth/validate-5,304,Not Modified,Thread Group 1-10,,true,,994,734,10,10,https://opensource-demo.orangehrmlive.com/web/dist/js/chunk-vendors.js?1672659722816,0,0,0
1674472817725,268,https://opensource-demo.orangehrmlive.com/web/index.php/auth/validate-6,304,Not Modified,Thread Group 1-10,,true,,994,724,10,10,https://opensource-demo.orangehrmlive.com/web/dist/js/app.js?1672659722816,0,0,0
1674472793443,24558,https://opensource-demo.orangehrmlive.com/,200,OK,Thread Group 1-7,text,true,,4312373,3984,10,10,https://opensource-demo.orangehrmlive.com/web/index.php/auth/login,15800,0,15437
1674472793443,15803,https://opensource-demo.orangehrmlive.com/-0,302,Found,Thread Group 1-7,text,true,,1054,502,10,10,https://opensource-demo.orangehrmlive.com/,15800,0,15437
1674472809247,1268,https://opensource-demo.orangehrmlive.com/-1,200,OK,Thread Group 1-7,text,true,,4430,526,10,10,https://opensource-demo.orangehrmlive.com/web/index.php/auth/login,1268,0,0
1674472810520,922,https://opensource-demo.orangehrmlive.com/-2,200,OK,Thread Group 1-7,bin,true,,1674,588,10,10,https://opensource-demo.orangehrmlive.com/web/dist/favicon.ico?1672659722816,922,0,0
1674472810520,7481,https://opensource-demo.orangehrmlive.com/-3,200,OK,Thread Group 1-7,text,true,,562823,598,10,10,https://opensource-demo.orangehrmlive.com/web/dist/css/chunk-vendors.css?1672659722816,2195,0,1438
1674472810520,5938,https://opensource-demo.orangehrmlive.com/-4,200,OK,Thread Group 1-7,text,true,,666549,588,10,10,https://opensource-demo.orangehrmlive.com/web/dist/css/app.css?1672659722816,1479,0,790
1674472810520,5217,https://opensource-demo.orangehrmlive.com/-5,200,OK,Thread Group 1-7,text,true,,1569995,596,10,10,https://opensource-demo.orangehrmlive.com/web/dist/js/chunk-vendors.js?1672659722816,1433,0,723
1674472810521,5501,https://opensource-demo.orangehrmlive.com/-6,200,OK,Thread Group 1-7,text,true,,1505848,586,10,10,https://opensource-demo.orangehrmlive.com/web/dist/js/app.js?1672659722816,1490,0,799
1674472818002,394,https://opensource-demo.orangehrmlive.com/web/index.php/core/i18n/messages,304,Not Modified,Thread Group 1-10,,true,,1052,531,10,10,https://opensource-demo.orangehrmlive.com/web/index.php/core/i18n/messages,0,0,0
1674472818398,450,https://opensource-demo.orangehrmlive.com/web/index.php/api/v2/dashboard/employees/time-at-work?timezoneOffset=5.5&currentDate=2023-01-23&currentTime=11:51,401,Unauthorized,Thread Group 1-10,text,false,,328,599,10,10,https://opensource-demo.orangehrmlive.com/web/index.php/api/v2/dashboard/employees/time-at-work?currentTime=11%3A51&timezoneOffset=5.5&currentDate=2023-01-23,450,0,0
1674472818005,850,https://opensource-demo.orangehrmlive.com/web/index.php/core/i18n/messages,200,OK,Thread Group 1-7,text,true,,96946,468,10,10,https://opensource-demo.orangehrmlive.com/web/index.php/core/i18n/messages,372,0,0
1674472818850,441,https://opensource-demo.orangehrmlive.com/web/index.php/api/v2/dashboard/employees/action-summary,401,Unauthorized,Thread Group 1-10,text,false,,328,539,10,10,https://opensource-demo.orangehrmlive.com/web/index.php/api/v2/dashboard/employees/action-summary,441,0,0
1674472819292,420,https://opensource-demo.orangehrmlive.com/web/index.php/api/v2/dashboard/shortcuts,401,Unauthorized,Thread Group 1-10,text,false,,328,524,10,10,https://opensource-demo.orangehrmlive.com/web/index.php/api/v2/dashboard/shortcuts,419,0,0
1674472793245,26749,https://opensource-demo.orangehrmlive.com/,200,OK,Thread Group 1-5,text,true,,4312344,3984,10,10,https://opensource-demo.orangehrmlive.com/web/index.php/auth/login,15998,0,15630
1674472793245,16001,https://opensource-demo.orangehrmlive.com/-0,302,Found,Thread Group 1-5,text,true,,1054,502,10,10,https://opensource-demo.orangehrmlive.com/,15998,0,15630
1674472809247,887,https://opensource-demo.orangehrmlive.com/-1,200,OK,Thread Group 1-5,text,true,,4401,526,10,10,https://opensource-demo.orangehrmlive.com/web/index.php/auth/login,887,0,0
1674472810141,1518,https://opensource-demo.orangehrmlive.com/-2,200,OK,Thread Group 1-5,bin,true,,1674,588,10,10,https://opensource-demo.orangehrmlive.com/web/dist/favicon.ico?1672659722816,1518,0,799
1674472810141,2232,https://opensource-demo.orangehrmlive.com/-3,200,OK,Thread Group 1-5,text,true,,562823,598,10,10,https://opensource-demo.orangehrmlive.com/web/dist/css/chunk-vendors.css?1672659722816,1070,0,0
1674472810141,3972,https://opensource-demo.orangehrmlive.com/-4,200,OK,Thread Group 1-5,text,true,,666549,588,10,10,https://opensource-demo.orangehrmlive.com/web/dist/css/app.css?1672659722816,1765,0,795
1674472810141,9853,https://opensource-demo.orangehrmlive.com/-5,200,OK,Thread Group 1-5,text,true,,1569995,596,10,10,https://opensource-demo.orangehrmlive.com/web/dist/js/chunk-vendors.js?1672659722816,1765,0,801
1674472810144,5674,https://opensource-demo.orangehrmlive.com/-6,200,OK,Thread Group 1-5,text,true,,1505848,586,10,10,https://opensource-demo.orangehrmlive.com/web/dist/js/app.js?1672659722816,1661,0,726
1674472819712,410,https://opensource-demo.orangehrmlive.com/web/index.php/api/v2/buzz/feed?limit=5&offset=0&sortOrder=DESC&sortField=share.createdAtUtc,401,Unauthorized,Thread Group 1-10,text,false,,328,513,10,10,https://opensource-demo.orangehrmlive.com/web/index.php/api/v2/buzz/feed?offset=0&sortOrder=DESC&limit=5&sortField=share.createdAtUtc,410,0,0
1674472820123,405,https://opensource-demo.orangehrmlive.com/web/index.php/api/v2/dashboard/employees/leaves?date=2023-01-23,401,Unauthorized,Thread Group 1-10,text,false,,328,547,10,10,https://opensource-demo.orangehrmlive.com/web/index.php/api/v2/dashboard/employees/leaves?date=2023-01-23,405,0,0
1674472819996,677,https://opensource-demo.orangehrmlive.com/web/index.php/core/i18n/messages,200,OK,Thread Group 1-5,text,true,,96946,468,10,10,https://opensource-demo.orangehrmlive.com/web/index.php/core/i18n/messages,401,0,0
1674472820529,423,https://opensource-demo.orangehrmlive.com/web/index.php/api/v2/dashboard/employees/subunit,401,Unauthorized,Thread Group 1-10,text,false,,328,532,10,10,https://opensource-demo.orangehrmlive.com/web/index.php/api/v2/dashboard/employees/subunit,423,0,0
1674472820953,398,https://opensource-demo.orangehrmlive.com/web/index.php/api/v2/dashboard/employees/locations,401,Unauthorized,Thread Group 1-10,text,false,,328,534,10,10,https://opensource-demo.orangehrmlive.com/web/index.php/api/v2/dashboard/employees/locations,398,0,0
1674472820481,1071,https://opensource-demo.orangehrmlive.com/web/index.php/auth/validate,200,OK,Thread Group 1-4,text,true,,11061,5076,10,10,https://opensource-demo.orangehrmlive.com/web/index.php/auth/login,385,0,0
1674472820481,385,https://opensource-demo.orangehrmlive.com/web/index.php/auth/validate-0,302,Found,Thread Group 1-4,text,true,,1659,808,10,10,https://opensource-demo.orangehrmlive.com/web/index.php/auth/validate,385,0,0
1674472820866,409,https://opensource-demo.orangehrmlive.com/web/index.php/auth/validate-1,200,OK,Thread Group 1-4,text,true,,4437,627,10,10,https://opensource-demo.orangehrmlive.com/web/index.php/auth/login,409,0,0
1674472821279,247,https://opensource-demo.orangehrmlive.com/web/index.php/auth/validate-2,304,Not Modified,Thread Group 1-4,,true,,991,723,10,10,https://opensource-demo.orangehrmlive.com/web/dist/favicon.ico?1672659722816,0,0,0
1674472821279,247,https://opensource-demo.orangehrmlive.com/web/index.php/auth/validate-3,304,Not Modified,Thread Group 1-4,,true,,993,735,10,10,https://opensource-demo.orangehrmlive.com/web/dist/css/chunk-vendors.css?1672659722816,0,0,0
1674472821279,247,https://opensource-demo.orangehrmlive.com/web/index.php/auth/validate-4,304,Not Modified,Thread Group 1-4,,true,,993,725,10,10,https://opensource-demo.orangehrmlive.com/web/dist/css/app.css?1672659722816,0,0,0
1674472821279,247,https://opensource-demo.orangehrmlive.com/web/index.php/auth/validate-5,304,Not Modified,Thread Group 1-4,,true,,994,734,10,10,https://opensource-demo.orangehrmlive.com/web/dist/js/chunk-vendors.js?1672659722816,0,0,0
1674472821279,273,https://opensource-demo.orangehrmlive.com/web/index.php/auth/validate-6,304,Not Modified,Thread Group 1-4,,true,,994,724,10,10,https://opensource-demo.orangehrmlive.com/web/dist/js/app.js?1672659722816,0,0,0
1674472821554,410,https://opensource-demo.orangehrmlive.com/web/index.php/core/i18n/messages,304,Not Modified,Thread Group 1-4,,true,,1052,531,10,10,https://opensource-demo.orangehrmlive.com/web/index.php/core/i18n/messages,0,0,0
1674472821965,403,https://opensource-demo.orangehrmlive.com/web/index.php/api/v2/dashboard/employees/time-at-work?timezoneOffset=5.5&currentDate=2023-01-23&currentTime=11:51,401,Unauthorized,Thread Group 1-4,text,false,,328,599,10,10,https://opensource-demo.orangehrmlive.com/web/index.php/api/v2/dashboard/employees/time-at-work?currentTime=11%3A51&timezoneOffset=5.5&currentDate=2023-01-23,403,0,0
1674472821352,1127,https://opensource-demo.orangehrmlive.com/web/index.php/events/push,200,OK,Thread Group 1-10,text,true,,10923,3594,10,10,https://opensource-demo.orangehrmlive.com/web/index.php/auth/login,407,0,0
1674472821352,407,https://opensource-demo.orangehrmlive.com/web/index.php/events/push-0,302,Found,Thread Group 1-10,text,true,,1659,514,10,10,https://opensource-demo.orangehrmlive.com/web/index.php/events/push,407,0,0
1674472821760,439,https://opensource-demo.orangehrmlive.com/web/index.php/events/push-1,200,OK,Thread Group 1-10,text,true,,4299,429,10,10,https://opensource-demo.orangehrmlive.com/web/index.php/auth/login,439,0,0
1674472822203,242,https://opensource-demo.orangehrmlive.com/web/index.php/events/push-2,304,Not Modified,Thread Group 1-10,,true,,991,525,10,10,https://opensource-demo.orangehrmlive.com/web/dist/favicon.ico?1672659722816,0,0,0
1674472822203,242,https://opensource-demo.orangehrmlive.com/web/index.php/events/push-3,304,Not Modified,Thread Group 1-10,,true,,993,537,10,10,https://opensource-demo.orangehrmlive.com/web/dist/css/chunk-vendors.css?1672659722816,0,0,0
1674472822203,265,https://opensource-demo.orangehrmlive.com/web/index.php/events/push-4,304,Not Modified,Thread Group 1-10,,true,,993,527,10,10,https://opensource-demo.orangehrmlive.com/web/dist/css/app.css?1672659722816,0,0,0
1674472822202,277,https://opensource-demo.orangehrmlive.com/web/index.php/events/push-5,304,Not Modified,Thread Group 1-10,,true,,994,536,10,10,https://opensource-demo.orangehrmlive.com/web/dist/js/chunk-vendors.js?1672659722816,0,0,0
1674472822203,265,https://opensource-demo.orangehrmlive.com/web/index.php/events/push-6,304,Not Modified,Thread Group 1-10,,true,,994,526,10,10,https://opensource-demo.orangehrmlive.com/web/dist/js/app.js?1672659722816,0,0,0
1674472822369,401,https://opensource-demo.orangehrmlive.com/web/index.php/api/v2/dashboard/employees/action-summary,401,Unauthorized,Thread Group 1-4,text,false,,328,539,10,10,https://opensource-demo.orangehrmlive.com/web/index.php/api/v2/dashboard/employees/action-summary,401,0,0
1674472822771,405,https://opensource-demo.orangehrmlive.com/web/index.php/api/v2/dashboard/shortcuts,401,Unauthorized,Thread Group 1-4,text,false,,328,524,10,10,https://opensource-demo.orangehrmlive.com/web/index.php/api/v2/dashboard/shortcuts,405,0,0
1674472793344,29945,https://opensource-demo.orangehrmlive.com/,200,OK,Thread Group 1-6,text,true,,4312351,3984,10,10,https://opensource-demo.orangehrmlive.com/web/index.php/auth/login,15899,0,15517
1674472793344,15902,https://opensource-demo.orangehrmlive.com/-0,302,Found,Thread Group 1-6,text,true,,1054,502,10,10,https://opensource-demo.orangehrmlive.com/,15899,0,15517
1674472809247,929,https://opensource-demo.orangehrmlive.com/-1,200,OK,Thread Group 1-6,text,true,,4408,526,10,10,https://opensource-demo.orangehrmlive.com/web/index.php/auth/login,928,0,0
1674472810180,773,https://opensource-demo.orangehrmlive.com/-2,200,OK,Thread Group 1-6,bin,true,,1674,588,10,10,https://opensource-demo.orangehrmlive.com/web/dist/favicon.ico?1672659722816,773,0,0
1674472810181,3675,https://opensource-demo.orangehrmlive.com/-3,200,OK,Thread Group 1-6,text,true,,562823,598,10,10,https://opensource-demo.orangehrmlive.com/web/dist/css/chunk-vendors.css?1672659722816,1751,0,786
1674472810181,4012,https://opensource-demo.orangehrmlive.com/-4,200,OK,Thread Group 1-6,text,true,,666549,588,10,10,https://opensource-demo.orangehrmlive.com/web/dist/css/app.css?1672659722816,1801,0,809
1674472810181,9351,https://opensource-demo.orangehrmlive.com/-5,200,OK,Thread Group 1-6,text,true,,1569995,596,10,10,https://opensource-demo.orangehrmlive.com/web/dist/js/chunk-vendors.js?1672659722816,1660,0,738
1674472810185,13104,https://opensource-demo.orangehrmlive.com/-6,200,OK,Thread Group 1-6,text,true,,1505848,586,10,10,https://opensource-demo.orangehrmlive.com/web/dist/js/app.js?1672659722816,3075,0,2484
1674472822422,1117,https://opensource-demo.orangehrmlive.com/web/index.php/auth/validate,200,OK,Thread Group 1-2,text,true,,11069,5076,10,10,https://opensource-demo.orangehrmlive.com/web/index.php/auth/login,408,0,0
1674472822422,408,https://opensource-demo.orangehrmlive.com/web/index.php/auth/validate-0,302,Found,Thread Group 1-2,text,true,,1659,808,10,10,https://opensource-demo.orangehrmlive.com/web/index.php/auth/validate,408,0,0
1674472822831,437,https://opensource-demo.orangehrmlive.com/web/index.php/auth/validate-1,200,OK,Thread Group 1-2,text,true,,4445,627,10,10,https://opensource-demo.orangehrmlive.com/web/index.php/auth/login,437,0,0
1674472823271,268,https://opensource-demo.orangehrmlive.com/web/index.php/auth/validate-2,304,Not Modified,Thread Group 1-2,,true,,991,723,10,10,https://opensource-demo.orangehrmlive.com/web/dist/favicon.ico?1672659722816,0,0,0
1674472823271,247,https://opensource-demo.orangehrmlive.com/web/index.php/auth/validate-3,304,Not Modified,Thread Group 1-2,,true,,993,735,10,10,https://opensource-demo.orangehrmlive.com/web/dist/css/chunk-vendors.css?1672659722816,0,0,0
1674472823271,247,https://opensource-demo.orangehrmlive.com/web/index.php/auth/validate-4,304,Not Modified,Thread Group 1-2,,true,,993,725,10,10,https://opensource-demo.orangehrmlive.com/web/dist/css/app.css?1672659722816,0,0,0
1674472823271,268,https://opensource-demo.orangehrmlive.com/web/index.php/auth/validate-5,304,Not Modified,Thread Group 1-2,,true,,994,734,10,10,https://opensource-demo.orangehrmlive.com/web/dist/js/chunk-vendors.js?1672659722816,0,0,0
1674472823271,268,https://opensource-demo.orangehrmlive.com/web/index.php/auth/validate-6,304,Not Modified,Thread Group 1-2,,true,,994,724,10,10,https://opensource-demo.orangehrmlive.com/web/dist/js/app.js?1672659722816,0,0,0
1674472823177,410,https://opensource-demo.orangehrmlive.com/web/index.php/api/v2/buzz/feed?limit=5&offset=0&sortOrder=DESC&sortField=share.createdAtUtc,401,Unauthorized,Thread Group 1-4,text,false,,328,513,10,10,https://opensource-demo.orangehrmlive.com/web/index.php/api/v2/buzz/feed?offset=0&sortOrder=DESC&limit=5&sortField=share.createdAtUtc,409,0,0
1674472823540,398,https://opensource-demo.orangehrmlive.com/web/index.php/core/i18n/messages,304,Not Modified,Thread Group 1-2,,true,,1052,531,10,10,https://opensource-demo.orangehrmlive.com/web/index.php/core/i18n/messages,0,0,0
1674472823290,678,https://opensource-demo.orangehrmlive.com/web/index.php/core/i18n/messages,200,OK,Thread Group 1-6,text,true,,96946,468,10,10,https://opensource-demo.orangehrmlive.com/web/index.php/core/i18n/messages,403,0,0
1674472823587,401,https://opensource-demo.orangehrmlive.com/web/index.php/api/v2/dashboard/employees/leaves?date=2023-01-23,401,Unauthorized,Thread Group 1-4,text,false,,328,547,10,10,https://opensource-demo.orangehrmlive.com/web/index.php/api/v2/dashboard/employees/leaves?date=2023-01-23,401,0,0
1674472823939,401,https://opensource-demo.orangehrmlive.com/web/index.php/api/v2/dashboard/employees/time-at-work?timezoneOffset=5.5&currentDate=2023-01-23&currentTime=11:51,401,Unauthorized,Thread Group 1-2,text,false,,328,599,10,10,https://opensource-demo.orangehrmlive.com/web/index.php/api/v2/dashboard/employees/time-at-work?currentTime=11%3A51&timezoneOffset=5.5&currentDate=2023-01-23,401,0,0
1674472823989,414,https://opensource-demo.orangehrmlive.com/web/index.php/api/v2/dashboard/employees/subunit,401,Unauthorized,Thread Group 1-4,text,false,,328,532,10,10,https://opensource-demo.orangehrmlive.com/web/index.php/api/v2/dashboard/employees/subunit,414,0,0
1674472824341,405,https://opensource-demo.orangehrmlive.com/web/index.php/api/v2/dashboard/employees/action-summary,401,Unauthorized,Thread Group 1-2,text,false,,328,539,10,10,https://opensource-demo.orangehrmlive.com/web/index.php/api/v2/dashboard/employees/action-summary,405,0,0
1674472824404,419,https://opensource-demo.orangehrmlive.com/web/index.php/api/v2/dashboard/employees/locations,401,Unauthorized,Thread Group 1-4,text,false,,328,534,10,10,https://opensource-demo.orangehrmlive.com/web/index.php/api/v2/dashboard/employees/locations,419,0,0
1674472824747,410,https://opensource-demo.orangehrmlive.com/web/index.php/api/v2/dashboard/shortcuts,401,Unauthorized,Thread Group 1-2,text,false,,328,524,10,10,https://opensource-demo.orangehrmlive.com/web/index.php/api/v2/dashboard/shortcuts,410,0,0
1674472825157,470,https://opensource-demo.orangehrmlive.com/web/index.php/api/v2/buzz/feed?limit=5&offset=0&sortOrder=DESC&sortField=share.createdAtUtc,401,Unauthorized,Thread Group 1-2,text,false,,328,513,10,10,https://opensource-demo.orangehrmlive.com/web/index.php/api/v2/buzz/feed?offset=0&sortOrder=DESC&limit=5&sortField=share.createdAtUtc,470,0,0
1674472824824,1191,https://opensource-demo.orangehrmlive.com/web/index.php/events/push,200,OK,Thread Group 1-4,text,true,,10942,3594,10,10,https://opensource-demo.orangehrmlive.com/web/index.php/auth/login,437,0,0
1674472824824,437,https://opensource-demo.orangehrmlive.com/web/index.php/events/push-0,302,Found,Thread Group 1-4,text,true,,1659,514,10,10,https://opensource-demo.orangehrmlive.com/web/index.php/events/push,437,0,0
1674472825261,464,https://opensource-demo.orangehrmlive.com/web/index.php/events/push-1,200,OK,Thread Group 1-4,text,true,,4318,429,10,10,https://opensource-demo.orangehrmlive.com/web/index.php/auth/login,464,0,0
1674472825727,262,https://opensource-demo.orangehrmlive.com/web/index.php/events/push-2,304,Not Modified,Thread Group 1-4,,true,,991,525,10,10,https://opensource-demo.orangehrmlive.com/web/dist/favicon.ico?1672659722816,0,0,0
1674472825727,262,https://opensource-demo.orangehrmlive.com/web/index.php/events/push-3,304,Not Modified,Thread Group 1-4,,true,,993,537,10,10,https://opensource-demo.orangehrmlive.com/web/dist/css/chunk-vendors.css?1672659722816,0,0,0
1674472825727,288,https://opensource-demo.orangehrmlive.com/web/index.php/events/push-4,304,Not Modified,Thread Group 1-4,,true,,993,527,10,10,https://opensource-demo.orangehrmlive.com/web/dist/css/app.css?1672659722816,0,0,0
1674472825727,262,https://opensource-demo.orangehrmlive.com/web/index.php/events/push-5,304,Not Modified,Thread Group 1-4,,true,,994,536,10,10,https://opensource-demo.orangehrmlive.com/web/dist/js/chunk-vendors.js?1672659722816,0,0,0
1674472825727,262,https://opensource-demo.orangehrmlive.com/web/index.php/events/push-6,304,Not Modified,Thread Group 1-4,,true,,994,526,10,10,https://opensource-demo.orangehrmlive.com/web/dist/js/app.js?1672659722816,0,0,0
1674472825628,433,https://opensource-demo.orangehrmlive.com/web/index.php/api/v2/dashboard/employees/leaves?date=2023-01-23,401,Unauthorized,Thread Group 1-2,text,false,,328,547,10,10,https://opensource-demo.orangehrmlive.com/web/index.php/api/v2/dashboard/employees/leaves?date=2023-01-23,433,0,0
1674472826062,486,https://opensource-demo.orangehrmlive.com/web/index.php/api/v2/dashboard/employees/subunit,401,Unauthorized,Thread Group 1-2,text,false,,328,532,10,10,https://opensource-demo.orangehrmlive.com/web/index.php/api/v2/dashboard/employees/subunit,486,0,0
1674472826549,408,https://opensource-demo.orangehrmlive.com/web/index.php/api/v2/dashboard/employees/locations,401,Unauthorized,Thread Group 1-2,text,false,,328,534,10,10,https://opensource-demo.orangehrmlive.com/web/index.php/api/v2/dashboard/employees/locations,408,0,0
1674472826523,1119,https://opensource-demo.orangehrmlive.com/web/index.php/auth/validate,200,OK,Thread Group 1-8,text,true,,11082,5076,10,10,https://opensource-demo.orangehrmlive.com/web/index.php/auth/login,393,0,0
1674472826523,393,https://opensource-demo.orangehrmlive.com/web/index.php/auth/validate-0,302,Found,Thread Group 1-8,text,true,,1659,808,10,10,https://opensource-demo.orangehrmlive.com/web/index.php/auth/validate,393,0,0
1674472826916,396,https://opensource-demo.orangehrmlive.com/web/index.php/auth/validate-1,200,OK,Thread Group 1-8,text,true,,4458,627,10,10,https://opensource-demo.orangehrmlive.com/web/index.php/auth/login,396,0,0
1674472827315,327,https://opensource-demo.orangehrmlive.com/web/index.php/auth/validate-2,304,Not Modified,Thread Group 1-8,,true,,991,723,10,10,https://opensource-demo.orangehrmlive.com/web/dist/favicon.ico?1672659722816,0,0,0
1674472827315,327,https://opensource-demo.orangehrmlive.com/web/index.php/auth/validate-3,304,Not Modified,Thread Group 1-8,,true,,993,735,10,10,https://opensource-demo.orangehrmlive.com/web/dist/css/chunk-vendors.css?1672659722816,0,0,0
1674472827315,327,https://opensource-demo.orangehrmlive.com/web/index.php/auth/validate-4,304,Not Modified,Thread Group 1-8,,true,,993,725,10,10,https://opensource-demo.orangehrmlive.com/web/dist/css/app.css?1672659722816,0,0,0
1674472827315,327,https://opensource-demo.orangehrmlive.com/web/index.php/auth/validate-5,304,Not Modified,Thread Group 1-8,,true,,994,734,10,10,https://opensource-demo.orangehrmlive.com/web/dist/js/chunk-vendors.js?1672659722816,0,0,0
1674472827315,327,https://opensource-demo.orangehrmlive.com/web/index.php/auth/validate-6,304,Not Modified,Thread Group 1-8,,true,,994,724,10,10,https://opensource-demo.orangehrmlive.com/web/dist/js/app.js?1672659722816,0,0,0
1674472826958,1078,https://opensource-demo.orangehrmlive.com/web/index.php/events/push,200,OK,Thread Group 1-2,text,true,,10926,3594,10,10,https://opensource-demo.orangehrmlive.com/web/index.php/auth/login,401,0,0
1674472826958,402,https://opensource-demo.orangehrmlive.com/web/index.php/events/push-0,302,Found,Thread Group 1-2,text,true,,1659,514,10,10,https://opensource-demo.orangehrmlive.com/web/index.php/events/push,401,0,0
1674472827360,414,https://opensource-demo.orangehrmlive.com/web/index.php/events/push-1,200,OK,Thread Group 1-2,text,true,,4302,429,10,10,https://opensource-demo.orangehrmlive.com/web/index.php/auth/login,414,0,0
1674472827777,253,https://opensource-demo.orangehrmlive.com/web/index.php/events/push-2,304,Not Modified,Thread Group 1-2,,true,,991,525,10,10,https://opensource-demo.orangehrmlive.com/web/dist/favicon.ico?1672659722816,0,0,0
1674472827777,259,https://opensource-demo.orangehrmlive.com/web/index.php/events/push-3,304,Not Modified,Thread Group 1-2,,true,,993,537,10,10,https://opensource-demo.orangehrmlive.com/web/dist/css/chunk-vendors.css?1672659722816,0,0,0
1674472827777,259,https://opensource-demo.orangehrmlive.com/web/index.php/events/push-4,304,Not Modified,Thread Group 1-2,,true,,993,527,10,10,https://opensource-demo.orangehrmlive.com/web/dist/css/app.css?1672659722816,0,0,0
1674472827777,253,https://opensource-demo.orangehrmlive.com/web/index.php/events/push-5,304,Not Modified,Thread Group 1-2,,true,,994,536,10,10,https://opensource-demo.orangehrmlive.com/web/dist/js/chunk-vendors.js?1672659722816,0,0,0
1674472827777,259,https://opensource-demo.orangehrmlive.com/web/index.php/events/push-6,304,Not Modified,Thread Group 1-2,,true,,994,526,10,10,https://opensource-demo.orangehrmlive.com/web/dist/js/app.js?1672659722816,0,0,0
1674472827644,420,https://opensource-demo.orangehrmlive.com/web/index.php/core/i18n/messages,304,Not Modified,Thread Group 1-8,,true,,1052,531,10,10,https://opensource-demo.orangehrmlive.com/web/index.php/core/i18n/messages,0,0,0
1674472827030,1074,https://opensource-demo.orangehrmlive.com/web/index.php/auth/validate,200,OK,Thread Group 1-9,text,true,,11082,5076,10,10,https://opensource-demo.orangehrmlive.com/web/index.php/auth/login,388,0,0
1674472827030,388,https://opensource-demo.orangehrmlive.com/web/index.php/auth/validate-0,302,Found,Thread Group 1-9,text,true,,1659,808,10,10,https://opensource-demo.orangehrmlive.com/web/index.php/auth/validate,388,0,0
1674472827418,422,https://opensource-demo.orangehrmlive.com/web/index.php/auth/validate-1,200,OK,Thread Group 1-9,text,true,,4458,627,10,10,https://opensource-demo.orangehrmlive.com/web/index.php/auth/login,422,0,0
1674472827842,262,https://opensource-demo.orangehrmlive.com/web/index.php/auth/validate-2,304,Not Modified,Thread Group 1-9,,true,,991,723,10,10,https://opensource-demo.orangehrmlive.com/web/dist/favicon.ico?1672659722816,0,0,0
1674472827842,258,https://opensource-demo.orangehrmlive.com/web/index.php/auth/validate-3,304,Not Modified,Thread Group 1-9,,true,,993,735,10,10,https://opensource-demo.orangehrmlive.com/web/dist/css/chunk-vendors.css?1672659722816,0,0,0
1674472827842,258,https://opensource-demo.orangehrmlive.com/web/index.php/auth/validate-4,304,Not Modified,Thread Group 1-9,,true,,993,725,10,10,https://opensource-demo.orangehrmlive.com/web/dist/css/app.css?1672659722816,0,0,0
1674472827842,262,https://opensource-demo.orangehrmlive.com/web/index.php/auth/validate-5,304,Not Modified,Thread Group 1-9,,true,,994,734,10,10,https://opensource-demo.orangehrmlive.com/web/dist/js/chunk-vendors.js?1672659722816,0,0,0
1674472827842,260,https://opensource-demo.orangehrmlive.com/web/index.php/auth/validate-6,304,Not Modified,Thread Group 1-9,,true,,994,724,10,10,https://opensource-demo.orangehrmlive.com/web/dist/js/app.js?1672659722816,0,0,0
1674472828104,406,https://opensource-demo.orangehrmlive.com/web/index.php/core/i18n/messages,304,Not Modified,Thread Group 1-9,,true,,1052,531,10,10,https://opensource-demo.orangehrmlive.com/web/index.php/core/i18n/messages,0,0,0
1674472828064,503,https://opensource-demo.orangehrmlive.com/web/index.php/api/v2/dashboard/employees/time-at-work?timezoneOffset=5.5&currentDate=2023-01-23&currentTime=11:51,401,Unauthorized,Thread Group 1-8,text,false,,328,599,10,10,https://opensource-demo.orangehrmlive.com/web/index.php/api/v2/dashboard/employees/time-at-work?currentTime=11%3A51&timezoneOffset=5.5&currentDate=2023-01-23,503,0,0
1674472827617,1113,https://opensource-demo.orangehrmlive.com/web/index.php/auth/validate,200,OK,Thread Group 1-3,text,true,,11085,5076,10,10,https://opensource-demo.orangehrmlive.com/web/index.php/auth/login,413,0,0
1674472827617,413,https://opensource-demo.orangehrmlive.com/web/index.php/auth/validate-0,302,Found,Thread Group 1-3,text,true,,1659,808,10,10,https://opensource-demo.orangehrmlive.com/web/index.php/auth/validate,413,0,0
1674472828031,418,https://opensource-demo.orangehrmlive.com/web/index.php/auth/validate-1,200,OK,Thread Group 1-3,text,true,,4461,627,10,10,https://opensource-demo.orangehrmlive.com/web/index.php/auth/login,418,0,0
1674472828450,243,https://opensource-demo.orangehrmlive.com/web/index.php/auth/validate-2,304,Not Modified,Thread Group 1-3,,true,,991,723,10,10,https://opensource-demo.orangehrmlive.com/web/dist/favicon.ico?1672659722816,0,0,0
1674472828450,241,https://opensource-demo.orangehrmlive.com/web/index.php/auth/validate-3,304,Not Modified,Thread Group 1-3,,true,,993,735,10,10,https://opensource-demo.orangehrmlive.com/web/dist/css/chunk-vendors.css?1672659722816,0,0,0
1674472828450,280,https://opensource-demo.orangehrmlive.com/web/index.php/auth/validate-4,304,Not Modified,Thread Group 1-3,,true,,993,725,10,10,https://opensource-demo.orangehrmlive.com/web/dist/css/app.css?1672659722816,0,0,0
1674472828450,280,https://opensource-demo.orangehrmlive.com/web/index.php/auth/validate-5,304,Not Modified,Thread Group 1-3,,true,,994,734,10,10,https://opensource-demo.orangehrmlive.com/web/dist/js/chunk-vendors.js?1672659722816,0,0,0
1674472828450,259,https://opensource-demo.orangehrmlive.com/web/index.php/auth/validate-6,304,Not Modified,Thread Group 1-3,,true,,994,724,10,10,https://opensource-demo.orangehrmlive.com/web/dist/js/app.js?1672659722816,0,0,0
1674472827628,1202,https://opensource-demo.orangehrmlive.com/web/index.php/auth/logout,200,OK,Thread Group 1-4,text,true,,10930,4553,10,10,https://opensource-demo.orangehrmlive.com/web/index.php/auth/login,402,0,0
1674472827628,402,https://opensource-demo.orangehrmlive.com/web/index.php/auth/logout-0,302,Found,Thread Group 1-4,text,true,,1659,579,10,10,https://opensource-demo.orangehrmlive.com/web/index.php/auth/logout,402,0,0
1674472828031,531,https://opensource-demo.orangehrmlive.com/web/index.php/auth/logout-1,200,OK,Thread Group 1-4,text,true,,4306,578,10,10,https://opensource-demo.orangehrmlive.com/web/index.php/auth/login,531,0,0
1674472828563,241,https://opensource-demo.orangehrmlive.com/web/index.php/auth/logout-2,304,Not Modified,Thread Group 1-4,,true,,991,674,10,10,https://opensource-demo.orangehrmlive.com/web/dist/favicon.ico?1672659722816,0,0,0
1674472828563,239,https://opensource-demo.orangehrmlive.com/web/index.php/auth/logout-3,304,Not Modified,Thread Group 1-4,,true,,993,686,10,10,https://opensource-demo.orangehrmlive.com/web/dist/css/chunk-vendors.css?1672659722816,0,0,0
1674472828563,267,https://opensource-demo.orangehrmlive.com/web/index.php/auth/logout-4,304,Not Modified,Thread Group 1-4,,true,,993,676,10,10,https://opensource-demo.orangehrmlive.com/web/dist/css/app.css?1672659722816,0,0,0
1674472828563,239,https://opensource-demo.orangehrmlive.com/web/index.php/auth/logout-5,304,Not Modified,Thread Group 1-4,,true,,994,685,10,10,https://opensource-demo.orangehrmlive.com/web/dist/js/chunk-vendors.js?1672659722816,0,0,0
1674472828563,239,https://opensource-demo.orangehrmlive.com/web/index.php/auth/logout-6,304,Not Modified,Thread Group 1-4,,true,,994,675,10,10,https://opensource-demo.orangehrmlive.com/web/dist/js/app.js?1672659722816,0,0,0
1674472827812,1075,https://opensource-demo.orangehrmlive.com/web/index.php/auth/validate,200,OK,Thread Group 1-7,text,true,,11060,5076,10,10,https://opensource-demo.orangehrmlive.com/web/index.php/auth/login,376,0,0
1674472827812,376,https://opensource-demo.orangehrmlive.com/web/index.php/auth/validate-0,302,Found,Thread Group 1-7,text,true,,1659,808,10,10,https://opensource-demo.orangehrmlive.com/web/index.php/auth/validate,376,0,0
1674472828188,431,https://opensource-demo.orangehrmlive.com/web/index.php/auth/validate-1,200,OK,Thread Group 1-7,text,true,,4436,627,10,10,https://opensource-demo.orangehrmlive.com/web/index.php/auth/login,430,0,0
1674472828620,240,https://opensource-demo.orangehrmlive.com/web/index.php/auth/validate-2,304,Not Modified,Thread Group 1-7,,true,,991,723,10,10,https://opensource-demo.orangehrmlive.com/web/dist/favicon.ico?1672659722816,0,0,0
1674472828620,267,https://opensource-demo.orangehrmlive.com/web/index.php/auth/validate-3,304,Not Modified,Thread Group 1-7,,true,,993,735,10,10,https://opensource-demo.orangehrmlive.com/web/dist/css/chunk-vendors.css?1672659722816,0,0,0
1674472828620,267,https://opensource-demo.orangehrmlive.com/web/index.php/auth/validate-4,304,Not Modified,Thread Group 1-7,,true,,993,725,10,10,https://opensource-demo.orangehrmlive.com/web/dist/css/app.css?1672659722816,0,0,0
1674472828620,240,https://opensource-demo.orangehrmlive.com/web/index.php/auth/validate-5,304,Not Modified,Thread Group 1-7,,true,,994,734,10,10,https://opensource-demo.orangehrmlive.com/web/dist/js/chunk-vendors.js?1672659722816,0,0,0
1674472828620,262,https://opensource-demo.orangehrmlive.com/web/index.php/auth/validate-6,304,Not Modified,Thread Group 1-7,,true,,994,724,10,10,https://opensource-demo.orangehrmlive.com/web/dist/js/app.js?1672659722816,0,0,0
1674472828511,386,https://opensource-demo.orangehrmlive.com/web/index.php/api/v2/dashboard/employees/time-at-work?timezoneOffset=5.5&currentDate=2023-01-23&currentTime=11:51,401,Unauthorized,Thread Group 1-9,text,false,,328,599,10,10,https://opensource-demo.orangehrmlive.com/web/index.php/api/v2/dashboard/employees/time-at-work?currentTime=11%3A51&timezoneOffset=5.5&currentDate=2023-01-23,386,0,0
1674472827799,1108,https://opensource-demo.orangehrmlive.com/web/index.php/auth/validate,200,OK,Thread Group 1-6,text,true,,11059,5076,10,10,https://opensource-demo.orangehrmlive.com/web/index.php/auth/login,413,0,0
1674472827799,413,https://opensource-demo.orangehrmlive.com/web/index.php/auth/validate-0,302,Found,Thread Group 1-6,text,true,,1659,808,10,10,https://opensource-demo.orangehrmlive.com/web/index.php/auth/validate,413,0,0
1674472828212,426,https://opensource-demo.orangehrmlive.com/web/index.php/auth/validate-1,200,OK,Thread Group 1-6,text,true,,4435,627,10,10,https://opensource-demo.orangehrmlive.com/web/index.php/auth/login,426,0,0
1674472828639,260,https://opensource-demo.orangehrmlive.com/web/index.php/auth/validate-2,304,Not Modified,Thread Group 1-6,,true,,991,723,10,10,https://opensource-demo.orangehrmlive.com/web/dist/favicon.ico?1672659722816,0,0,0
1674472828639,239,https://opensource-demo.orangehrmlive.com/web/index.php/auth/validate-3,304,Not Modified,Thread Group 1-6,,true,,993,735,10,10,https://opensource-demo.orangehrmlive.com/web/dist/css/chunk-vendors.css?1672659722816,0,0,0
1674472828639,243,https://opensource-demo.orangehrmlive.com/web/index.php/auth/validate-4,304,Not Modified,Thread Group 1-6,,true,,993,725,10,10,https://opensource-demo.orangehrmlive.com/web/dist/css/app.css?1672659722816,0,0,0
1674472828639,268,https://opensource-demo.orangehrmlive.com/web/index.php/auth/validate-5,304,Not Modified,Thread Group 1-6,,true,,994,734,10,10,https://opensource-demo.orangehrmlive.com/web/dist/js/chunk-vendors.js?1672659722816,0,0,0
1674472828639,260,https://opensource-demo.orangehrmlive.com/web/index.php/auth/validate-6,304,Not Modified,Thread Group 1-6,,true,,994,724,10,10,https://opensource-demo.orangehrmlive.com/web/dist/js/app.js?1672659722816,0,0,0
1674472828567,417,https://opensource-demo.orangehrmlive.com/web/index.php/api/v2/dashboard/employees/action-summary,401,Unauthorized,Thread Group 1-8,text,false,,328,539,10,10,https://opensource-demo.orangehrmlive.com/web/index.php/api/v2/dashboard/employees/action-summary,417,0,0
1674472828731,388,https://opensource-demo.orangehrmlive.com/web/index.php/core/i18n/messages,304,Not Modified,Thread Group 1-3,,true,,1052,531,10,10,https://opensource-demo.orangehrmlive.com/web/index.php/core/i18n/messages,0,0,0
1674472828831,398,https://opensource-demo.orangehrmlive.com/web/index.php/core/i18n/messages,304,Not Modified,Thread Group 1-4,,true,,1052,531,10,10,https://opensource-demo.orangehrmlive.com/web/index.php/core/i18n/messages,0,0,0
1674472793148,31476,Test,,"Number of samples in transaction : 14, number of failing samples : 7",Thread Group 1-4,,false,,4446624,22525,10,10,null,20558,4606,15711
1674472828888,398,https://opensource-demo.orangehrmlive.com/web/index.php/core/i18n/messages,304,Not Modified,Thread Group 1-7,,true,,1052,531,9,9,https://opensource-demo.orangehrmlive.com/web/index.php/core/i18n/messages,0,0,0
1674472828897,405,https://opensource-demo.orangehrmlive.com/web/index.php/api/v2/dashboard/employees/action-summary,401,Unauthorized,Thread Group 1-9,text,false,,328,539,9,9,https://opensource-demo.orangehrmlive.com/web/index.php/api/v2/dashboard/employees/action-summary,405,0,0
1674472828908,454,https://opensource-demo.orangehrmlive.com/web/index.php/core/i18n/messages,304,Not Modified,Thread Group 1-6,,true,,1052,531,9,9,https://opensource-demo.orangehrmlive.com/web/index.php/core/i18n/messages,0,0,0
1674472828985,433,https://opensource-demo.orangehrmlive.com/web/index.php/api/v2/dashboard/shortcuts,401,Unauthorized,Thread Group 1-8,text,false,,328,524,9,9,https://opensource-demo.orangehrmlive.com/web/index.php/api/v2/dashboard/shortcuts,433,0,0
1674472829120,400,https://opensource-demo.orangehrmlive.com/web/index.php/api/v2/dashboard/employees/time-at-work?timezoneOffset=5.5&currentDate=2023-01-23&currentTime=11:51,401,Unauthorized,Thread Group 1-3,text,false,,328,599,9,9,https://opensource-demo.orangehrmlive.com/web/index.php/api/v2/dashboard/employees/time-at-work?currentTime=11%3A51&timezoneOffset=5.5&currentDate=2023-01-23,400,0,0
1674472828482,1095,https://opensource-demo.orangehrmlive.com/web/index.php/auth/logout,200,OK,Thread Group 1-10,text,true,,10944,4553,9,9,https://opensource-demo.orangehrmlive.com/web/index.php/auth/login,393,0,0
1674472828482,393,https://opensource-demo.orangehrmlive.com/web/index.php/auth/logout-0,302,Found,Thread Group 1-10,text,true,,1659,579,9,9,https://opensource-demo.orangehrmlive.com/web/index.php/auth/logout,393,0,0
1674472828875,434,https://opensource-demo.orangehrmlive.com/web/index.php/auth/logout-1,200,OK,Thread Group 1-10,text,true,,4320,578,9,9,https://opensource-demo.orangehrmlive.com/web/index.php/auth/login,434,0,0
1674472829312,265,https://opensource-demo.orangehrmlive.com/web/index.php/auth/logout-2,304,Not Modified,Thread Group 1-10,,true,,991,674,9,9,https://opensource-demo.orangehrmlive.com/web/dist/favicon.ico?1672659722816,0,0,0
1674472829312,251,https://opensource-demo.orangehrmlive.com/web/index.php/auth/logout-3,304,Not Modified,Thread Group 1-10,,true,,993,686,9,9,https://opensource-demo.orangehrmlive.com/web/dist/css/chunk-vendors.css?1672659722816,0,0,0
1674472829312,251,https://opensource-demo.orangehrmlive.com/web/index.php/auth/logout-4,304,Not Modified,Thread Group 1-10,,true,,993,676,9,9,https://opensource-demo.orangehrmlive.com/web/dist/css/app.css?1672659722816,0,0,0
1674472829311,266,https://opensource-demo.orangehrmlive.com/web/index.php/auth/logout-5,304,Not Modified,Thread Group 1-10,,true,,994,685,9,9,https://opensource-demo.orangehrmlive.com/web/dist/js/chunk-vendors.js?1672659722816,0,0,0
1674472829312,260,https://opensource-demo.orangehrmlive.com/web/index.php/auth/logout-6,304,Not Modified,Thread Group 1-10,,true,,994,675,9,9,https://opensource-demo.orangehrmlive.com/web/dist/js/app.js?1672659722816,0,0,0
1674472829287,395,https://opensource-demo.orangehrmlive.com/web/index.php/api/v2/dashboard/employees/time-at-work?timezoneOffset=5.5&currentDate=2023-01-23&currentTime=11:51,401,Unauthorized,Thread Group 1-7,text,false,,328,599,9,9,https://opensource-demo.orangehrmlive.com/web/index.php/api/v2/dashboard/employees/time-at-work?currentTime=11%3A51&timezoneOffset=5.5&currentDate=2023-01-23,395,0,0
1674472829303,391,https://opensource-demo.orangehrmlive.com/web/index.php/api/v2/dashboard/shortcuts,401,Unauthorized,Thread Group 1-9,text,false,,328,524,9,9,https://opensource-demo.orangehrmlive.com/web/index.php/api/v2/dashboard/shortcuts,391,0,0
1674472829363,402,https://opensource-demo.orangehrmlive.com/web/index.php/api/v2/dashboard/employees/time-at-work?timezoneOffset=5.5&currentDate=2023-01-23&currentTime=11:51,401,Unauthorized,Thread Group 1-6,text,false,,328,599,9,9,https://opensource-demo.orangehrmlive.com/web/index.php/api/v2/dashboard/employees/time-at-work?currentTime=11%3A51&timezoneOffset=5.5&currentDate=2023-01-23,402,0,0
1674472829418,429,https://opensource-demo.orangehrmlive.com/web/index.php/api/v2/buzz/feed?limit=5&offset=0&sortOrder=DESC&sortField=share.createdAtUtc,401,Unauthorized,Thread Group 1-8,text,false,,328,513,9,9,https://opensource-demo.orangehrmlive.com/web/index.php/api/v2/buzz/feed?offset=0&sortOrder=DESC&limit=5&sortField=share.createdAtUtc,429,0,0
1674472829521,409,https://opensource-demo.orangehrmlive.com/web/index.php/api/v2/dashboard/employees/action-summary,401,Unauthorized,Thread Group 1-3,text,false,,328,539,9,9,https://opensource-demo.orangehrmlive.com/web/index.php/api/v2/dashboard/employees/action-summary,409,0,0
1674472829578,408,https://opensource-demo.orangehrmlive.com/web/index.php/core/i18n/messages,304,Not Modified,Thread Group 1-10,,true,,1052,531,9,9,https://opensource-demo.orangehrmlive.com/web/index.php/core/i18n/messages,0,0,0
1674472793742,29501,Test,,"Number of samples in transaction : 14, number of failing samples : 7",Thread Group 1-10,,false,,4446629,22525,9,9,null,20036,6744,15131
1674472829683,409,https://opensource-demo.orangehrmlive.com/web/index.php/api/v2/dashboard/employees/action-summary,401,Unauthorized,Thread Group 1-7,text,false,,328,539,8,8,https://opensource-demo.orangehrmlive.com/web/index.php/api/v2/dashboard/employees/action-summary,409,0,0
1674472829695,404,https://opensource-demo.orangehrmlive.com/web/index.php/api/v2/buzz/feed?limit=5&offset=0&sortOrder=DESC&sortField=share.createdAtUtc,401,Unauthorized,Thread Group 1-9,text,false,,328,513,8,8,https://opensource-demo.orangehrmlive.com/web/index.php/api/v2/buzz/feed?offset=0&sortOrder=DESC&limit=5&sortField=share.createdAtUtc,404,0,0
1674472829765,418,https://opensource-demo.orangehrmlive.com/web/index.php/api/v2/dashboard/employees/action-summary,401,Unauthorized,Thread Group 1-6,text,false,,328,539,8,8,https://opensource-demo.orangehrmlive.com/web/index.php/api/v2/dashboard/employees/action-summary,418,0,0
1674472829848,426,https://opensource-demo.orangehrmlive.com/web/index.php/api/v2/dashboard/employees/leaves?date=2023-01-23,401,Unauthorized,Thread Group 1-8,text,false,,328,547,8,8,https://opensource-demo.orangehrmlive.com/web/index.php/api/v2/dashboard/employees/leaves?date=2023-01-23,426,0,0
1674472829930,402,https://opensource-demo.orangehrmlive.com/web/index.php/api/v2/dashboard/shortcuts,401,Unauthorized,Thread Group 1-3,text,false,,328,524,8,8,https://opensource-demo.orangehrmlive.com/web/index.php/api/v2/dashboard/shortcuts,402,0,0
1674472830100,387,https://opensource-demo.orangehrmlive.com/web/index.php/api/v2/dashboard/employees/leaves?date=2023-01-23,401,Unauthorized,Thread Group 1-9,text,false,,328,547,8,8,https://opensource-demo.orangehrmlive.com/web/index.php/api/v2/dashboard/employees/leaves?date=2023-01-23,387,0,0
1674472830095,395,https://opensource-demo.orangehrmlive.com/web/index.php/api/v2/dashboard/shortcuts,401,Unauthorized,Thread Group 1-7,text,false,,328,524,8,8,https://opensource-demo.orangehrmlive.com/web/index.php/api/v2/dashboard/shortcuts,395,0,0
1674472830183,397,https://opensource-demo.orangehrmlive.com/web/index.php/api/v2/dashboard/shortcuts,401,Unauthorized,Thread Group 1-6,text,false,,328,524,8,8,https://opensource-demo.orangehrmlive.com/web/index.php/api/v2/dashboard/shortcuts,397,0,0
1674472830275,417,https://opensource-demo.orangehrmlive.com/web/index.php/api/v2/dashboard/employees/subunit,401,Unauthorized,Thread Group 1-8,text,false,,328,532,8,8,https://opensource-demo.orangehrmlive.com/web/index.php/api/v2/dashboard/employees/subunit,417,0,0
1674472830333,409,https://opensource-demo.orangehrmlive.com/web/index.php/api/v2/buzz/feed?limit=5&offset=0&sortOrder=DESC&sortField=share.createdAtUtc,401,Unauthorized,Thread Group 1-3,text,false,,328,513,8,8,https://opensource-demo.orangehrmlive.com/web/index.php/api/v2/buzz/feed?offset=0&sortOrder=DESC&limit=5&sortField=share.createdAtUtc,408,0,0
1674472830487,393,https://opensource-demo.orangehrmlive.com/web/index.php/api/v2/dashboard/employees/subunit,401,Unauthorized,Thread Group 1-9,text,false,,328,532,8,8,https://opensource-demo.orangehrmlive.com/web/index.php/api/v2/dashboard/employees/subunit,393,0,0
1674472830490,404,https://opensource-demo.orangehrmlive.com/web/index.php/api/v2/buzz/feed?limit=5&offset=0&sortOrder=DESC&sortField=share.createdAtUtc,401,Unauthorized,Thread Group 1-7,text,false,,328,513,8,8,https://opensource-demo.orangehrmlive.com/web/index.php/api/v2/buzz/feed?offset=0&sortOrder=DESC&limit=5&sortField=share.createdAtUtc,404,0,0
1674472830581,481,https://opensource-demo.orangehrmlive.com/web/index.php/api/v2/buzz/feed?limit=5&offset=0&sortOrder=DESC&sortField=share.createdAtUtc,401,Unauthorized,Thread Group 1-6,text,false,,328,513,8,8,https://opensource-demo.orangehrmlive.com/web/index.php/api/v2/buzz/feed?offset=0&sortOrder=DESC&limit=5&sortField=share.createdAtUtc,481,0,0
1674472830743,405,https://opensource-demo.orangehrmlive.com/web/index.php/api/v2/dashboard/employees/leaves?date=2023-01-23,401,Unauthorized,Thread Group 1-3,text,false,,328,547,8,8,https://opensource-demo.orangehrmlive.com/web/index.php/api/v2/dashboard/employees/leaves?date=2023-01-23,405,0,0
1674472830692,482,https://opensource-demo.orangehrmlive.com/web/index.php/api/v2/dashboard/employees/locations,401,Unauthorized,Thread Group 1-8,text,false,,328,534,8,8,https://opensource-demo.orangehrmlive.com/web/index.php/api/v2/dashboard/employees/locations,482,0,0
1674472830881,395,https://opensource-demo.orangehrmlive.com/web/index.php/api/v2/dashboard/employees/locations,401,Unauthorized,Thread Group 1-9,text,false,,328,534,8,8,https://opensource-demo.orangehrmlive.com/web/index.php/api/v2/dashboard/employees/locations,394,0,0
1674472830895,401,https://opensource-demo.orangehrmlive.com/web/index.php/api/v2/dashboard/employees/leaves?date=2023-01-23,401,Unauthorized,Thread Group 1-7,text,false,,328,547,8,8,https://opensource-demo.orangehrmlive.com/web/index.php/api/v2/dashboard/employees/leaves?date=2023-01-23,401,0,0
1674472831063,396,https://opensource-demo.orangehrmlive.com/web/index.php/api/v2/dashboard/employees/leaves?date=2023-01-23,401,Unauthorized,Thread Group 1-6,text,false,,328,547,8,8,https://opensource-demo.orangehrmlive.com/web/index.php/api/v2/dashboard/employees/leaves?date=2023-01-23,396,0,0
1674472831149,413,https://opensource-demo.orangehrmlive.com/web/index.php/api/v2/dashboard/employees/subunit,401,Unauthorized,Thread Group 1-3,text,false,,328,532,8,8,https://opensource-demo.orangehrmlive.com/web/index.php/api/v2/dashboard/employees/subunit,413,0,0
1674472831297,396,https://opensource-demo.orangehrmlive.com/web/index.php/api/v2/dashboard/employees/subunit,401,Unauthorized,Thread Group 1-7,text,false,,328,532,8,8,https://opensource-demo.orangehrmlive.com/web/index.php/api/v2/dashboard/employees/subunit,395,0,0
1674472831459,402,https://opensource-demo.orangehrmlive.com/web/index.php/api/v2/dashboard/employees/subunit,401,Unauthorized,Thread Group 1-6,text,false,,328,532,8,8,https://opensource-demo.orangehrmlive.com/web/index.php/api/v2/dashboard/employees/subunit,402,0,0
1674472831562,412,https://opensource-demo.orangehrmlive.com/web/index.php/api/v2/dashboard/employees/locations,401,Unauthorized,Thread Group 1-3,text,false,,328,534,8,8,https://opensource-demo.orangehrmlive.com/web/index.php/api/v2/dashboard/employees/locations,412,0,0
1674472831693,397,https://opensource-demo.orangehrmlive.com/web/index.php/api/v2/dashboard/employees/locations,401,Unauthorized,Thread Group 1-7,text,false,,328,534,8,8,https://opensource-demo.orangehrmlive.com/web/index.php/api/v2/dashboard/employees/locations,397,0,0
1674472831861,400,https://opensource-demo.orangehrmlive.com/web/index.php/api/v2/dashboard/employees/locations,401,Unauthorized,Thread Group 1-6,text,false,,328,534,8,8,https://opensource-demo.orangehrmlive.com/web/index.php/api/v2/dashboard/employees/locations,400,0,0
1674472831276,1082,https://opensource-demo.orangehrmlive.com/web/index.php/events/push,200,OK,Thread Group 1-9,text,true,,10942,3594,8,8,https://opensource-demo.orangehrmlive.com/web/index.php/auth/login,389,0,0
1674472831276,389,https://opensource-demo.orangehrmlive.com/web/index.php/events/push-0,302,Found,Thread Group 1-9,text,true,,1659,514,8,8,https://opensource-demo.orangehrmlive.com/web/index.php/events/push,389,0,0
1674472831666,426,https://opensource-demo.orangehrmlive.com/web/index.php/events/push-1,200,OK,Thread Group 1-9,text,true,,4318,429,8,8,https://opensource-demo.orangehrmlive.com/web/index.php/auth/login,426,0,0
1674472832095,260,https://opensource-demo.orangehrmlive.com/web/index.php/events/push-2,304,Not Modified,Thread Group 1-9,,true,,991,525,8,8,https://opensource-demo.orangehrmlive.com/web/dist/favicon.ico?1672659722816,0,0,0
1674472832095,263,https://opensource-demo.orangehrmlive.com/web/index.php/events/push-3,304,Not Modified,Thread Group 1-9,,true,,993,537,8,8,https://opensource-demo.orangehrmlive.com/web/dist/css/chunk-vendors.css?1672659722816,0,0,0
1674472832095,258,https://opensource-demo.orangehrmlive.com/web/index.php/events/push-4,304,Not Modified,Thread Group 1-9,,true,,993,527,8,8,https://opensource-demo.orangehrmlive.com/web/dist/css/app.css?1672659722816,0,0,0
1674472832095,258,https://opensource-demo.orangehrmlive.com/web/index.php/events/push-5,304,Not Modified,Thread Group 1-9,,true,,994,536,8,8,https://opensource-demo.orangehrmlive.com/web/dist/js/chunk-vendors.js?1672659722816,0,0,0
1674472832095,260,https://opensource-demo.orangehrmlive.com/web/index.php/events/push-6,304,Not Modified,Thread Group 1-9,,true,,994,526,8,8,https://opensource-demo.orangehrmlive.com/web/dist/js/app.js?1672659722816,0,0,0
1674472831175,1292,https://opensource-demo.orangehrmlive.com/web/index.php/events/push,200,OK,Thread Group 1-8,text,true,,10940,3594,8,8,https://opensource-demo.orangehrmlive.com/web/index.php/auth/login,476,0,0
1674472831175,477,https://opensource-demo.orangehrmlive.com/web/index.php/events/push-0,302,Found,Thread Group 1-8,text,true,,1659,514,8,8,https://opensource-demo.orangehrmlive.com/web/index.php/events/push,476,0,0
1674472831652,522,https://opensource-demo.orangehrmlive.com/web/index.php/events/push-1,200,OK,Thread Group 1-8,text,true,,4316,429,8,8,https://opensource-demo.orangehrmlive.com/web/index.php/auth/login,522,0,0
1674472832176,245,https://opensource-demo.orangehrmlive.com/web/index.php/events/push-2,304,Not Modified,Thread Group 1-8,,true,,991,525,8,8,https://opensource-demo.orangehrmlive.com/web/dist/favicon.ico?1672659722816,0,0,0
1674472832177,244,https://opensource-demo.orangehrmlive.com/web/index.php/events/push-3,304,Not Modified,Thread Group 1-8,,true,,993,537,8,8,https://opensource-demo.orangehrmlive.com/web/dist/css/chunk-vendors.css?1672659722816,0,0,0
1674472832176,272,https://opensource-demo.orangehrmlive.com/web/index.php/events/push-4,304,Not Modified,Thread Group 1-8,,true,,993,527,8,8,https://opensource-demo.orangehrmlive.com/web/dist/css/app.css?1672659722816,0,0,0
1674472832176,291,https://opensource-demo.orangehrmlive.com/web/index.php/events/push-5,304,Not Modified,Thread Group 1-8,,true,,994,536,8,8,https://opensource-demo.orangehrmlive.com/web/dist/js/chunk-vendors.js?1672659722816,0,0,0
1674472832177,244,https://opensource-demo.orangehrmlive.com/web/index.php/events/push-6,304,Not Modified,Thread Group 1-8,,true,,994,526,8,8,https://opensource-demo.orangehrmlive.com/web/dist/js/app.js?1672659722816,0,0,0
1674472831975,1119,https://opensource-demo.orangehrmlive.com/web/index.php/events/push,200,OK,Thread Group 1-3,text,true,,10945,3594,8,8,https://opensource-demo.orangehrmlive.com/web/index.php/auth/login,398,0,0
1674472831975,398,https://opensource-demo.orangehrmlive.com/web/index.php/events/push-0,302,Found,Thread Group 1-3,text,true,,1659,514,8,8,https://opensource-demo.orangehrmlive.com/web/index.php/events/push,398,0,0
1674472832374,448,https://opensource-demo.orangehrmlive.com/web/index.php/events/push-1,200,OK,Thread Group 1-3,text,true,,4321,429,8,8,https://opensource-demo.orangehrmlive.com/web/index.php/auth/login,447,0,0
1674472832824,244,https://opensource-demo.orangehrmlive.com/web/index.php/events/push-2,304,Not Modified,Thread Group 1-3,,true,,991,525,8,8,https://opensource-demo.orangehrmlive.com/web/dist/favicon.ico?1672659722816,0,0,0
1674472832824,270,https://opensource-demo.orangehrmlive.com/web/index.php/events/push-3,304,Not Modified,Thread Group 1-3,,true,,993,537,8,8,https://opensource-demo.orangehrmlive.com/web/dist/css/chunk-vendors.css?1672659722816,0,0,0
1674472832824,244,https://opensource-demo.orangehrmlive.com/web/index.php/events/push-4,304,Not Modified,Thread Group 1-3,,true,,993,527,8,8,https://opensource-demo.orangehrmlive.com/web/dist/css/app.css?1672659722816,0,0,0
1674472832824,267,https://opensource-demo.orangehrmlive.com/web/index.php/events/push-5,304,Not Modified,Thread Group 1-3,,true,,994,536,8,8,https://opensource-demo.orangehrmlive.com/web/dist/js/chunk-vendors.js?1672659722816,0,0,0
1674472832824,261,https://opensource-demo.orangehrmlive.com/web/index.php/events/push-6,304,Not Modified,Thread Group 1-3,,true,,994,526,8,8,https://opensource-demo.orangehrmlive.com/web/dist/js/app.js?1672659722816,0,0,0
1674472832091,1154,https://opensource-demo.orangehrmlive.com/web/index.php/events/push,200,OK,Thread Group 1-7,text,true,,10926,3594,8,8,https://opensource-demo.orangehrmlive.com/web/index.php/auth/login,415,0,0
1674472832091,415,https://opensource-demo.orangehrmlive.com/web/index.php/events/push-0,302,Found,Thread Group 1-7,text,true,,1659,514,8,8,https://opensource-demo.orangehrmlive.com/web/index.php/events/push,415,0,0
1674472832507,473,https://opensource-demo.orangehrmlive.com/web/index.php/events/push-1,200,OK,Thread Group 1-7,text,true,,4302,429,8,8,https://opensource-demo.orangehrmlive.com/web/index.php/auth/login,473,0,0
1674472832981,242,https://opensource-demo.orangehrmlive.com/web/index.php/events/push-2,304,Not Modified,Thread Group 1-7,,true,,991,525,8,8,https://opensource-demo.orangehrmlive.com/web/dist/favicon.ico?1672659722816,0,0,0
1674472832981,264,https://opensource-demo.orangehrmlive.com/web/index.php/events/push-3,304,Not Modified,Thread Group 1-7,,true,,993,537,8,8,https://opensource-demo.orangehrmlive.com/web/dist/css/chunk-vendors.css?1672659722816,0,0,0
1674472832981,242,https://opensource-demo.orangehrmlive.com/web/index.php/events/push-4,304,Not Modified,Thread Group 1-7,,true,,993,527,8,8,https://opensource-demo.orangehrmlive.com/web/dist/css/app.css?1672659722816,0,0,0
1674472832981,264,https://opensource-demo.orangehrmlive.com/web/index.php/events/push-5,304,Not Modified,Thread Group 1-7,,true,,994,536,8,8,https://opensource-demo.orangehrmlive.com/web/dist/js/chunk-vendors.js?1672659722816,0,0,0
1674472832981,264,https://opensource-demo.orangehrmlive.com/web/index.php/events/push-6,304,Not Modified,Thread Group 1-7,,true,,994,526,8,8,https://opensource-demo.orangehrmlive.com/web/dist/js/app.js?1672659722816,0,0,0
1674472832262,1092,https://opensource-demo.orangehrmlive.com/web/index.php/events/push,200,OK,Thread Group 1-6,text,true,,10935,3594,8,8,https://opensource-demo.orangehrmlive.com/web/index.php/auth/login,404,0,0
1674472832262,404,https://opensource-demo.orangehrmlive.com/web/index.php/events/push-0,302,Found,Thread Group 1-6,text,true,,1659,514,8,8,https://opensource-demo.orangehrmlive.com/web/index.php/events/push,404,0,0
1674472832666,421,https://opensource-demo.orangehrmlive.com/web/index.php/events/push-1,200,OK,Thread Group 1-6,text,true,,4311,429,8,8,https://opensource-demo.orangehrmlive.com/web/index.php/auth/login,421,0,0
1674472833088,260,https://opensource-demo.orangehrmlive.com/web/index.php/events/push-2,304,Not Modified,Thread Group 1-6,,true,,991,525,8,8,https://opensource-demo.orangehrmlive.com/web/dist/favicon.ico?1672659722816,0,0,0
1674472833088,266,https://opensource-demo.orangehrmlive.com/web/index.php/events/push-3,304,Not Modified,Thread Group 1-6,,true,,993,537,8,8,https://opensource-demo.orangehrmlive.com/web/dist/css/chunk-vendors.css?1672659722816,0,0,0
1674472833088,242,https://opensource-demo.orangehrmlive.com/web/index.php/events/push-4,304,Not Modified,Thread Group 1-6,,true,,993,527,8,8,https://opensource-demo.orangehrmlive.com/web/dist/css/app.css?1672659722816,0,0,0
1674472833088,242,https://opensource-demo.orangehrmlive.com/web/index.php/events/push-5,304,Not Modified,Thread Group 1-6,,true,,994,536,8,8,https://opensource-demo.orangehrmlive.com/web/dist/js/chunk-vendors.js?1672659722816,0,0,0
1674472833088,263,https://opensource-demo.orangehrmlive.com/web/index.php/events/push-6,304,Not Modified,Thread Group 1-6,,true,,994,526,8,8,https://opensource-demo.orangehrmlive.com/web/dist/js/app.js?1672659722816,0,0,0
1674472833059,1129,https://opensource-demo.orangehrmlive.com/web/index.php/auth/validate,200,OK,Thread Group 1-1,text,true,,11080,5076,8,8,https://opensource-demo.orangehrmlive.com/web/index.php/auth/login,367,0,0
1674472833059,368,https://opensource-demo.orangehrmlive.com/web/index.php/auth/validate-0,302,Found,Thread Group 1-1,text,true,,1659,808,8,8,https://opensource-demo.orangehrmlive.com/web/index.php/auth/validate,367,0,0
1674472833427,475,https://opensource-demo.orangehrmlive.com/web/index.php/auth/validate-1,200,OK,Thread Group 1-1,text,true,,4456,627,8,8,https://opensource-demo.orangehrmlive.com/web/index.php/auth/login,475,0,0
1674472833904,251,https://opensource-demo.orangehrmlive.com/web/index.php/auth/validate-2,304,Not Modified,Thread Group 1-1,,true,,991,723,8,8,https://opensource-demo.orangehrmlive.com/web/dist/favicon.ico?1672659722816,0,0,0
1674472833904,262,https://opensource-demo.orangehrmlive.com/web/index.php/auth/validate-3,304,Not Modified,Thread Group 1-1,,true,,993,735,8,8,https://opensource-demo.orangehrmlive.com/web/dist/css/chunk-vendors.css?1672659722816,0,0,0
1674472833904,251,https://opensource-demo.orangehrmlive.com/web/index.php/auth/validate-4,304,Not Modified,Thread Group 1-1,,true,,993,725,8,8,https://opensource-demo.orangehrmlive.com/web/dist/css/app.css?1672659722816,0,0,0
1674472833904,270,https://opensource-demo.orangehrmlive.com/web/index.php/auth/validate-5,304,Not Modified,Thread Group 1-1,,true,,994,734,8,8,https://opensource-demo.orangehrmlive.com/web/dist/js/chunk-vendors.js?1672659722816,0,0,0
1674472833904,284,https://opensource-demo.orangehrmlive.com/web/index.php/auth/validate-6,304,Not Modified,Thread Group 1-1,,true,,994,724,8,8,https://opensource-demo.orangehrmlive.com/web/dist/js/app.js?1672659722816,0,0,0
1674472834190,396,https://opensource-demo.orangehrmlive.com/web/index.php/core/i18n/messages,304,Not Modified,Thread Group 1-1,,true,,1052,531,8,8,https://opensource-demo.orangehrmlive.com/web/index.php/core/i18n/messages,0,0,0
1674472834587,408,https://opensource-demo.orangehrmlive.com/web/index.php/api/v2/dashboard/employees/time-at-work?timezoneOffset=5.5&currentDate=2023-01-23&currentTime=11:51,401,Unauthorized,Thread Group 1-1,text,false,,328,599,8,8,https://opensource-demo.orangehrmlive.com/web/index.php/api/v2/dashboard/employees/time-at-work?currentTime=11%3A51&timezoneOffset=5.5&currentDate=2023-01-23,408,0,0
1674472834047,1144,https://opensource-demo.orangehrmlive.com/web/index.php/auth/logout,200,OK,Thread Group 1-8,text,true,,10948,4553,8,8,https://opensource-demo.orangehrmlive.com/web/index.php/auth/login,408,0,0
1674472834047,408,https://opensource-demo.orangehrmlive.com/web/index.php/auth/logout-0,302,Found,Thread Group 1-8,text,true,,1659,579,8,8,https://opensource-demo.orangehrmlive.com/web/index.php/auth/logout,408,0,0
1674472834455,444,https://opensource-demo.orangehrmlive.com/web/index.php/auth/logout-1,200,OK,Thread Group 1-8,text,true,,4324,578,8,8,https://opensource-demo.orangehrmlive.com/web/index.php/auth/login,444,0,0
1674472834901,240,https://opensource-demo.orangehrmlive.com/web/index.php/auth/logout-2,304,Not Modified,Thread Group 1-8,,true,,991,674,8,8,https://opensource-demo.orangehrmlive.com/web/dist/favicon.ico?1672659722816,0,0,0
1674472834900,241,https://opensource-demo.orangehrmlive.com/web/index.php/auth/logout-3,304,Not Modified,Thread Group 1-8,,true,,993,686,8,8,https://opensource-demo.orangehrmlive.com/web/dist/css/chunk-vendors.css?1672659722816,0,0,0
1674472834900,241,https://opensource-demo.orangehrmlive.com/web/index.php/auth/logout-4,304,Not Modified,Thread Group 1-8,,true,,993,676,8,8,https://opensource-demo.orangehrmlive.com/web/dist/css/app.css?1672659722816,0,0,0
1674472834900,291,https://opensource-demo.orangehrmlive.com/web/index.php/auth/logout-5,304,Not Modified,Thread Group 1-8,,true,,994,685,8,8,https://opensource-demo.orangehrmlive.com/web/dist/js/chunk-vendors.js?1672659722816,0,0,0
1674472834900,267,https://opensource-demo.orangehrmlive.com/web/index.php/auth/logout-6,304,Not Modified,Thread Group 1-8,,true,,994,675,8,8,https://opensource-demo.orangehrmlive.com/web/dist/js/app.js?1672659722816,0,0,0
1674472834995,415,https://opensource-demo.orangehrmlive.com/web/index.php/api/v2/dashboard/employees/action-summary,401,Unauthorized,Thread Group 1-1,text,false,,328,539,8,8,https://opensource-demo.orangehrmlive.com/web/index.php/api/v2/dashboard/employees/action-summary,415,0,0
1674472835192,408,https://opensource-demo.orangehrmlive.com/web/index.php/core/i18n/messages,304,Not Modified,Thread Group 1-8,,true,,1052,531,8,8,https://opensource-demo.orangehrmlive.com/web/index.php/core/i18n/messages,0,0,0
1674472793541,29979,Test,,"Number of samples in transaction : 14, number of failing samples : 7",Thread Group 1-8,,false,,4446668,22525,8,8,null,20462,12080,15319
1674472835410,412,https://opensource-demo.orangehrmlive.com/web/index.php/api/v2/dashboard/shortcuts,401,Unauthorized,Thread Group 1-1,text,false,,328,524,7,7,https://opensource-demo.orangehrmlive.com/web/index.php/api/v2/dashboard/shortcuts,411,0,0
1674472835822,409,https://opensource-demo.orangehrmlive.com/web/index.php/api/v2/buzz/feed?limit=5&offset=0&sortOrder=DESC&sortField=share.createdAtUtc,401,Unauthorized,Thread Group 1-1,text,false,,328,513,7,7,https://opensource-demo.orangehrmlive.com/web/index.php/api/v2/buzz/feed?offset=0&sortOrder=DESC&limit=5&sortField=share.createdAtUtc,409,0,0
1674472836231,403,https://opensource-demo.orangehrmlive.com/web/index.php/api/v2/dashboard/employees/leaves?date=2023-01-23,401,Unauthorized,Thread Group 1-1,text,false,,328,547,7,7,https://opensource-demo.orangehrmlive.com/web/index.php/api/v2/dashboard/employees/leaves?date=2023-01-23,403,0,0
1674472836634,423,https://opensource-demo.orangehrmlive.com/web/index.php/api/v2/dashboard/employees/subunit,401,Unauthorized,Thread Group 1-1,text,false,,328,532,7,7,https://opensource-demo.orangehrmlive.com/web/index.php/api/v2/dashboard/employees/subunit,423,0,0
1674472836125,1089,https://opensource-demo.orangehrmlive.com/web/index.php/auth/validate,200,OK,Thread Group 1-5,text,true,,11059,5076,7,7,https://opensource-demo.orangehrmlive.com/web/index.php/auth/login,397,0,0
1674472836125,397,https://opensource-demo.orangehrmlive.com/web/index.php/auth/validate-0,302,Found,Thread Group 1-5,text,true,,1659,808,7,7,https://opensource-demo.orangehrmlive.com/web/index.php/auth/validate,397,0,0
1674472836522,427,https://opensource-demo.orangehrmlive.com/web/index.php/auth/validate-1,200,OK,Thread Group 1-5,text,true,,4435,627,7,7,https://opensource-demo.orangehrmlive.com/web/index.php/auth/login,426,0,0
1674472836949,262,https://opensource-demo.orangehrmlive.com/web/index.php/auth/validate-2,304,Not Modified,Thread Group 1-5,,true,,991,723,7,7,https://opensource-demo.orangehrmlive.com/web/dist/favicon.ico?1672659722816,0,0,0
1674472836949,262,https://opensource-demo.orangehrmlive.com/web/index.php/auth/validate-3,304,Not Modified,Thread Group 1-5,,true,,993,735,7,7,https://opensource-demo.orangehrmlive.com/web/dist/css/chunk-vendors.css?1672659722816,0,0,0
1674472836949,265,https://opensource-demo.orangehrmlive.com/web/index.php/auth/validate-4,304,Not Modified,Thread Group 1-5,,true,,993,725,7,7,https://opensource-demo.orangehrmlive.com/web/dist/css/app.css?1672659722816,0,0,0
1674472836949,262,https://opensource-demo.orangehrmlive.com/web/index.php/auth/validate-5,304,Not Modified,Thread Group 1-5,,true,,994,734,7,7,https://opensource-demo.orangehrmlive.com/web/dist/js/chunk-vendors.js?1672659722816,0,0,0
1674472836949,241,https://opensource-demo.orangehrmlive.com/web/index.php/auth/validate-6,304,Not Modified,Thread Group 1-5,,true,,994,724,7,7,https://opensource-demo.orangehrmlive.com/web/dist/js/app.js?1672659722816,0,0,0
1674472837058,426,https://opensource-demo.orangehrmlive.com/web/index.php/api/v2/dashboard/employees/locations,401,Unauthorized,Thread Group 1-1,text,false,,328,534,7,7,https://opensource-demo.orangehrmlive.com/web/index.php/api/v2/dashboard/employees/locations,426,0,0
1674472837215,387,https://opensource-demo.orangehrmlive.com/web/index.php/core/i18n/messages,304,Not Modified,Thread Group 1-5,,true,,1052,531,7,7,https://opensource-demo.orangehrmlive.com/web/index.php/core/i18n/messages,0,0,0
1674472837603,393,https://opensource-demo.orangehrmlive.com/web/index.php/api/v2/dashboard/employees/time-at-work?timezoneOffset=5.5&currentDate=2023-01-23&currentTime=11:51,401,Unauthorized,Thread Group 1-5,text,false,,328,599,7,7,https://opensource-demo.orangehrmlive.com/web/index.php/api/v2/dashboard/employees/time-at-work?currentTime=11%3A51&timezoneOffset=5.5&currentDate=2023-01-23,392,0,0
1674472837996,383,https://opensource-demo.orangehrmlive.com/web/index.php/api/v2/dashboard/employees/action-summary,401,Unauthorized,Thread Group 1-5,text,false,,328,539,7,7,https://opensource-demo.orangehrmlive.com/web/index.php/api/v2/dashboard/employees/action-summary,383,0,0
1674472837484,1182,https://opensource-demo.orangehrmlive.com/web/index.php/events/push,200,OK,Thread Group 1-1,text,true,,10948,3594,7,7,https://opensource-demo.orangehrmlive.com/web/index.php/auth/login,403,0,0
1674472837484,403,https://opensource-demo.orangehrmlive.com/web/index.php/events/push-0,302,Found,Thread Group 1-1,text,true,,1659,514,7,7,https://opensource-demo.orangehrmlive.com/web/index.php/events/push,403,0,0
1674472837887,497,https://opensource-demo.orangehrmlive.com/web/index.php/events/push-1,200,OK,Thread Group 1-1,text,true,,4324,429,7,7,https://opensource-demo.orangehrmlive.com/web/index.php/auth/login,497,0,0
1674472838385,259,https://opensource-demo.orangehrmlive.com/web/index.php/events/push-2,304,Not Modified,Thread Group 1-1,,true,,991,525,7,7,https://opensource-demo.orangehrmlive.com/web/dist/favicon.ico?1672659722816,0,0,0
1674472838385,266,https://opensource-demo.orangehrmlive.com/web/index.php/events/push-3,304,Not Modified,Thread Group 1-1,,true,,993,537,7,7,https://opensource-demo.orangehrmlive.com/web/dist/css/chunk-vendors.css?1672659722816,0,0,0
1674472838385,240,https://opensource-demo.orangehrmlive.com/web/index.php/events/push-4,304,Not Modified,Thread Group 1-1,,true,,993,527,7,7,https://opensource-demo.orangehrmlive.com/web/dist/css/app.css?1672659722816,0,0,0
1674472838385,240,https://opensource-demo.orangehrmlive.com/web/index.php/events/push-5,304,Not Modified,Thread Group 1-1,,true,,994,536,7,7,https://opensource-demo.orangehrmlive.com/web/dist/js/chunk-vendors.js?1672659722816,0,0,0
1674472838385,281,https://opensource-demo.orangehrmlive.com/web/index.php/events/push-6,304,Not Modified,Thread Group 1-1,,true,,994,526,7,7,https://opensource-demo.orangehrmlive.com/web/dist/js/app.js?1672659722816,0,0,0
1674472838380,387,https://opensource-demo.orangehrmlive.com/web/index.php/api/v2/dashboard/shortcuts,401,Unauthorized,Thread Group 1-5,text,false,,328,524,7,7,https://opensource-demo.orangehrmlive.com/web/index.php/api/v2/dashboard/shortcuts,386,0,0
1674472838767,389,https://opensource-demo.orangehrmlive.com/web/index.php/api/v2/buzz/feed?limit=5&offset=0&sortOrder=DESC&sortField=share.createdAtUtc,401,Unauthorized,Thread Group 1-5,text,false,,328,513,7,7,https://opensource-demo.orangehrmlive.com/web/index.php/api/v2/buzz/feed?offset=0&sortOrder=DESC&limit=5&sortField=share.createdAtUtc,389,0,0
1674472839157,383,https://opensource-demo.orangehrmlive.com/web/index.php/api/v2/dashboard/employees/leaves?date=2023-01-23,401,Unauthorized,Thread Group 1-5,text,false,,328,547,7,7,https://opensource-demo.orangehrmlive.com/web/index.php/api/v2/dashboard/employees/leaves?date=2023-01-23,383,0,0
1674472839541,407,https://opensource-demo.orangehrmlive.com/web/index.php/api/v2/dashboard/employees/subunit,401,Unauthorized,Thread Group 1-5,text,false,,328,532,7,7,https://opensource-demo.orangehrmlive.com/web/index.php/api/v2/dashboard/employees/subunit,407,0,0
1674472839949,409,https://opensource-demo.orangehrmlive.com/web/index.php/api/v2/dashboard/employees/locations,401,Unauthorized,Thread Group 1-5,text,false,,328,534,7,7,https://opensource-demo.orangehrmlive.com/web/index.php/api/v2/dashboard/employees/locations,409,0,0
1674472839477,1090,https://opensource-demo.orangehrmlive.com/web/index.php/auth/logout,200,OK,Thread Group 1-6,text,true,,10925,4553,7,7,https://opensource-demo.orangehrmlive.com/web/index.php/auth/login,391,0,0
1674472839477,391,https://opensource-demo.orangehrmlive.com/web/index.php/auth/logout-0,302,Found,Thread Group 1-6,text,true,,1659,579,7,7,https://opensource-demo.orangehrmlive.com/web/index.php/auth/logout,391,0,0
1674472839868,430,https://opensource-demo.orangehrmlive.com/web/index.php/auth/logout-1,200,OK,Thread Group 1-6,text,true,,4301,578,7,7,https://opensource-demo.orangehrmlive.com/web/index.php/auth/login,430,0,0
1674472840299,263,https://opensource-demo.orangehrmlive.com/web/index.php/auth/logout-2,304,Not Modified,Thread Group 1-6,,true,,991,674,7,7,https://opensource-demo.orangehrmlive.com/web/dist/favicon.ico?1672659722816,0,0,0
1674472840299,241,https://opensource-demo.orangehrmlive.com/web/index.php/auth/logout-3,304,Not Modified,Thread Group 1-6,,true,,993,686,7,7,https://opensource-demo.orangehrmlive.com/web/dist/css/chunk-vendors.css?1672659722816,0,0,0
1674472840299,268,https://opensource-demo.orangehrmlive.com/web/index.php/auth/logout-4,304,Not Modified,Thread Group 1-6,,true,,993,676,7,7,https://opensource-demo.orangehrmlive.com/web/dist/css/app.css?1672659722816,0,0,0
1674472840299,241,https://opensource-demo.orangehrmlive.com/web/index.php/auth/logout-5,304,Not Modified,Thread Group 1-6,,true,,994,685,7,7,https://opensource-demo.orangehrmlive.com/web/dist/js/chunk-vendors.js?1672659722816,0,0,0
1674472840299,261,https://opensource-demo.orangehrmlive.com/web/index.php/auth/logout-6,304,Not Modified,Thread Group 1-6,,true,,994,675,7,7,https://opensource-demo.orangehrmlive.com/web/dist/js/app.js?1672659722816,0,0,0
1674472840568,394,https://opensource-demo.orangehrmlive.com/web/index.php/core/i18n/messages,304,Not Modified,Thread Group 1-6,,true,,1052,531,7,7,https://opensource-demo.orangehrmlive.com/web/index.php/core/i18n/messages,0,0,0
1674472793343,37657,Test,,"Number of samples in transaction : 14, number of failing samples : 7",Thread Group 1-6,,false,,4446616,22525,7,7,null,20406,9963,15517
1674472840358,1116,https://opensource-demo.orangehrmlive.com/web/index.php/events/push,200,OK,Thread Group 1-5,text,true,,10953,3594,6,6,https://opensource-demo.orangehrmlive.com/web/index.php/auth/login,427,0,0
1674472840358,427,https://opensource-demo.orangehrmlive.com/web/index.php/events/push-0,302,Found,Thread Group 1-5,text,true,,1659,514,6,6,https://opensource-demo.orangehrmlive.com/web/index.php/events/push,427,0,0
1674472840785,424,https://opensource-demo.orangehrmlive.com/web/index.php/events/push-1,200,OK,Thread Group 1-5,text,true,,4329,429,6,6,https://opensource-demo.orangehrmlive.com/web/index.php/auth/login,424,0,0
1674472841210,261,https://opensource-demo.orangehrmlive.com/web/index.php/events/push-2,304,Not Modified,Thread Group 1-5,,true,,991,525,6,6,https://opensource-demo.orangehrmlive.com/web/dist/favicon.ico?1672659722816,0,0,0
1674472841210,261,https://opensource-demo.orangehrmlive.com/web/index.php/events/push-3,304,Not Modified,Thread Group 1-5,,true,,993,537,6,6,https://opensource-demo.orangehrmlive.com/web/dist/css/chunk-vendors.css?1672659722816,0,0,0
1674472841210,261,https://opensource-demo.orangehrmlive.com/web/index.php/events/push-4,304,Not Modified,Thread Group 1-5,,true,,993,527,6,6,https://opensource-demo.orangehrmlive.com/web/dist/css/app.css?1672659722816,0,0,0
1674472841210,264,https://opensource-demo.orangehrmlive.com/web/index.php/events/push-5,304,Not Modified,Thread Group 1-5,,true,,994,536,6,6,https://opensource-demo.orangehrmlive.com/web/dist/js/chunk-vendors.js?1672659722816,0,0,0
1674472841210,241,https://opensource-demo.orangehrmlive.com/web/index.php/events/push-6,304,Not Modified,Thread Group 1-5,,true,,994,526,6,6,https://opensource-demo.orangehrmlive.com/web/dist/js/app.js?1672659722816,0,0,0
1674472841081,1050,https://opensource-demo.orangehrmlive.com/web/index.php/auth/logout,200,OK,Thread Group 1-2,text,true,,10940,4553,6,6,https://opensource-demo.orangehrmlive.com/web/index.php/auth/login,379,0,0
1674472841081,380,https://opensource-demo.orangehrmlive.com/web/index.php/auth/logout-0,302,Found,Thread Group 1-2,text,true,,1659,579,6,6,https://opensource-demo.orangehrmlive.com/web/index.php/auth/logout,379,0,0
1674472841461,408,https://opensource-demo.orangehrmlive.com/web/index.php/auth/logout-1,200,OK,Thread Group 1-2,text,true,,4316,578,6,6,https://opensource-demo.orangehrmlive.com/web/index.php/auth/login,408,0,0
1674472841871,260,https://opensource-demo.orangehrmlive.com/web/index.php/auth/logout-2,304,Not Modified,Thread Group 1-2,,true,,991,674,6,6,https://opensource-demo.orangehrmlive.com/web/dist/favicon.ico?1672659722816,0,0,0
1674472841871,240,https://opensource-demo.orangehrmlive.com/web/index.php/auth/logout-3,304,Not Modified,Thread Group 1-2,,true,,993,686,6,6,https://opensource-demo.orangehrmlive.com/web/dist/css/chunk-vendors.css?1672659722816,0,0,0
1674472841871,260,https://opensource-demo.orangehrmlive.com/web/index.php/auth/logout-4,304,Not Modified,Thread Group 1-2,,true,,993,676,6,6,https://opensource-demo.orangehrmlive.com/web/dist/css/app.css?1672659722816,0,0,0
1674472841871,260,https://opensource-demo.orangehrmlive.com/web/index.php/auth/logout-5,304,Not Modified,Thread Group 1-2,,true,,994,685,6,6,https://opensource-demo.orangehrmlive.com/web/dist/js/chunk-vendors.js?1672659722816,0,0,0
1674472841871,240,https://opensource-demo.orangehrmlive.com/web/index.php/auth/logout-6,304,Not Modified,Thread Group 1-2,,true,,994,675,6,6,https://opensource-demo.orangehrmlive.com/web/dist/js/app.js?1672659722816,0,0,0
1674472842131,387,https://opensource-demo.orangehrmlive.com/web/index.php/core/i18n/messages,304,Not Modified,Thread Group 1-2,,true,,1052,531,6,6,https://opensource-demo.orangehrmlive.com/web/index.php/core/i18n/messages,0,0,0
1674472792951,30345,Test,,"Number of samples in transaction : 14, number of failing samples : 7",Thread Group 1-2,,false,,4446635,22525,6,6,null,20882,19223,15902
1674472843641,1176,https://opensource-demo.orangehrmlive.com/web/index.php/auth/logout,200,OK,Thread Group 1-5,text,true,,10943,4553,5,5,https://opensource-demo.orangehrmlive.com/web/index.php/auth/login,452,0,0
1674472843641,453,https://opensource-demo.orangehrmlive.com/web/index.php/auth/logout-0,302,Found,Thread Group 1-5,text,true,,1659,579,5,5,https://opensource-demo.orangehrmlive.com/web/index.php/auth/logout,452,0,0
1674472844094,457,https://opensource-demo.orangehrmlive.com/web/index.php/auth/logout-1,200,OK,Thread Group 1-5,text,true,,4319,578,5,5,https://opensource-demo.orangehrmlive.com/web/index.php/auth/login,457,0,0
1674472844552,265,https://opensource-demo.orangehrmlive.com/web/index.php/auth/logout-2,304,Not Modified,Thread Group 1-5,,true,,991,674,5,5,https://opensource-demo.orangehrmlive.com/web/dist/favicon.ico?1672659722816,0,0,0
1674472844552,262,https://opensource-demo.orangehrmlive.com/web/index.php/auth/logout-3,304,Not Modified,Thread Group 1-5,,true,,993,686,5,5,https://opensource-demo.orangehrmlive.com/web/dist/css/chunk-vendors.css?1672659722816,0,0,0
1674472844552,262,https://opensource-demo.orangehrmlive.com/web/index.php/auth/logout-4,304,Not Modified,Thread Group 1-5,,true,,993,676,5,5,https://opensource-demo.orangehrmlive.com/web/dist/css/app.css?1672659722816,0,0,0
1674472844552,265,https://opensource-demo.orangehrmlive.com/web/index.php/auth/logout-5,304,Not Modified,Thread Group 1-5,,true,,994,685,5,5,https://opensource-demo.orangehrmlive.com/web/dist/js/chunk-vendors.js?1672659722816,0,0,0
1674472844552,244,https://opensource-demo.orangehrmlive.com/web/index.php/auth/logout-6,304,Not Modified,Thread Group 1-5,,true,,994,675,5,5,https://opensource-demo.orangehrmlive.com/web/dist/js/app.js?1672659722816,0,0,0
1674472843980,1119,https://opensource-demo.orangehrmlive.com/web/index.php/auth/logout,200,OK,Thread Group 1-3,text,true,,10941,4553,5,5,https://opensource-demo.orangehrmlive.com/web/index.php/auth/login,416,0,0
1674472843980,417,https://opensource-demo.orangehrmlive.com/web/index.php/auth/logout-0,302,Found,Thread Group 1-3,text,true,,1659,579,5,5,https://opensource-demo.orangehrmlive.com/web/index.php/auth/logout,416,0,0
1674472844397,432,https://opensource-demo.orangehrmlive.com/web/index.php/auth/logout-1,200,OK,Thread Group 1-3,text,true,,4317,578,5,5,https://opensource-demo.orangehrmlive.com/web/index.php/auth/login,432,0,0
1674472844830,267,https://opensource-demo.orangehrmlive.com/web/index.php/auth/logout-2,304,Not Modified,Thread Group 1-3,,true,,991,674,5,5,https://opensource-demo.orangehrmlive.com/web/dist/favicon.ico?1672659722816,0,0,0
1674472844830,267,https://opensource-demo.orangehrmlive.com/web/index.php/auth/logout-3,304,Not Modified,Thread Group 1-3,,true,,993,686,5,5,https://opensource-demo.orangehrmlive.com/web/dist/css/chunk-vendors.css?1672659722816,0,0,0
1674472844830,269,https://opensource-demo.orangehrmlive.com/web/index.php/auth/logout-4,304,Not Modified,Thread Group 1-3,,true,,993,676,5,5,https://opensource-demo.orangehrmlive.com/web/dist/css/app.css?1672659722816,0,0,0
1674472844830,267,https://opensource-demo.orangehrmlive.com/web/index.php/auth/logout-5,304,Not Modified,Thread Group 1-3,,true,,994,685,5,5,https://opensource-demo.orangehrmlive.com/web/dist/js/chunk-vendors.js?1672659722816,0,0,0
1674472844830,269,https://opensource-demo.orangehrmlive.com/web/index.php/auth/logout-6,304,Not Modified,Thread Group 1-3,,true,,994,675,5,5,https://opensource-demo.orangehrmlive.com/web/dist/js/app.js?1672659722816,0,0,0
1674472844818,396,https://opensource-demo.orangehrmlive.com/web/index.php/core/i18n/messages,304,Not Modified,Thread Group 1-5,,true,,1052,531,5,5,https://opensource-demo.orangehrmlive.com/web/index.php/core/i18n/messages,0,0,0
1674472793244,34341,Test,,"Number of samples in transaction : 14, number of failing samples : 7",Thread Group 1-5,,false,,4446645,22525,5,5,null,20424,17630,15630
1674472845100,397,https://opensource-demo.orangehrmlive.com/web/index.php/core/i18n/messages,304,Not Modified,Thread Group 1-3,,true,,1052,531,4,4,https://opensource-demo.orangehrmlive.com/web/index.php/core/i18n/messages,0,0,0
1674472793049,30244,Test,,"Number of samples in transaction : 14, number of failing samples : 7",Thread Group 1-3,,false,,4446674,22525,4,4,null,20677,22205,15810
1674472845920,1191,https://opensource-demo.orangehrmlive.com/web/index.php/auth/logout,200,OK,Thread Group 1-9,text,true,,10932,4553,3,3,https://opensource-demo.orangehrmlive.com/web/index.php/auth/login,387,0,0
1674472845920,388,https://opensource-demo.orangehrmlive.com/web/index.php/auth/logout-0,302,Found,Thread Group 1-9,text,true,,1659,579,3,3,https://opensource-demo.orangehrmlive.com/web/index.php/auth/logout,387,0,0
1674472846308,478,https://opensource-demo.orangehrmlive.com/web/index.php/auth/logout-1,200,OK,Thread Group 1-9,text,true,,4308,578,3,3,https://opensource-demo.orangehrmlive.com/web/index.php/auth/login,478,0,0
1674472846788,323,https://opensource-demo.orangehrmlive.com/web/index.php/auth/logout-2,304,Not Modified,Thread Group 1-9,,true,,991,674,3,3,https://opensource-demo.orangehrmlive.com/web/dist/favicon.ico?1672659722816,0,0,0
1674472846788,323,https://opensource-demo.orangehrmlive.com/web/index.php/auth/logout-3,304,Not Modified,Thread Group 1-9,,true,,993,686,3,3,https://opensource-demo.orangehrmlive.com/web/dist/css/chunk-vendors.css?1672659722816,0,0,0
1674472846788,323,https://opensource-demo.orangehrmlive.com/web/index.php/auth/logout-4,304,Not Modified,Thread Group 1-9,,true,,993,676,3,3,https://opensource-demo.orangehrmlive.com/web/dist/css/app.css?1672659722816,0,0,0
1674472846788,323,https://opensource-demo.orangehrmlive.com/web/index.php/auth/logout-5,304,Not Modified,Thread Group 1-9,,true,,994,685,3,3,https://opensource-demo.orangehrmlive.com/web/dist/js/chunk-vendors.js?1672659722816,0,0,0
1674472846788,323,https://opensource-demo.orangehrmlive.com/web/index.php/auth/logout-6,304,Not Modified,Thread Group 1-9,,true,,994,675,3,3,https://opensource-demo.orangehrmlive.com/web/dist/js/app.js?1672659722816,0,0,0
1674472847112,397,https://opensource-demo.orangehrmlive.com/web/index.php/core/i18n/messages,304,Not Modified,Thread Group 1-9,,true,,1052,531,3,3,https://opensource-demo.orangehrmlive.com/web/index.php/core/i18n/messages,0,0,0
1674472793641,30021,Test,,"Number of samples in transaction : 14, number of failing samples : 7",Thread Group 1-9,,false,,4446667,22525,3,3,null,19981,23848,15227
1674472853626,1602,https://opensource-demo.orangehrmlive.com/web/index.php/auth/logout,200,OK,Thread Group 1-7,text,true,,10949,4553,2,2,https://opensource-demo.orangehrmlive.com/web/index.php/auth/login,409,0,0
1674472853626,409,https://opensource-demo.orangehrmlive.com/web/index.php/auth/logout-0,302,Found,Thread Group 1-7,text,true,,1659,579,2,2,https://opensource-demo.orangehrmlive.com/web/index.php/auth/logout,409,0,0
1674472854035,415,https://opensource-demo.orangehrmlive.com/web/index.php/auth/logout-1,200,OK,Thread Group 1-7,text,true,,4325,578,2,2,https://opensource-demo.orangehrmlive.com/web/index.php/auth/login,415,0,0
1674472854452,243,https://opensource-demo.orangehrmlive.com/web/index.php/auth/logout-2,304,Not Modified,Thread Group 1-7,,true,,991,674,2,2,https://opensource-demo.orangehrmlive.com/web/dist/favicon.ico?1672659722816,0,0,0
1674472854452,261,https://opensource-demo.orangehrmlive.com/web/index.php/auth/logout-3,304,Not Modified,Thread Group 1-7,,true,,993,686,2,2,https://opensource-demo.orangehrmlive.com/web/dist/css/chunk-vendors.css?1672659722816,0,0,0
1674472854452,243,https://opensource-demo.orangehrmlive.com/web/index.php/auth/logout-4,304,Not Modified,Thread Group 1-7,,true,,993,676,2,2,https://opensource-demo.orangehrmlive.com/web/dist/css/app.css?1672659722816,0,0,0
1674472854452,776,https://opensource-demo.orangehrmlive.com/web/index.php/auth/logout-5,304,Not Modified,Thread Group 1-7,,true,,994,685,2,2,https://opensource-demo.orangehrmlive.com/web/dist/js/chunk-vendors.js?1672659722816,0,0,517
1674472854452,267,https://opensource-demo.orangehrmlive.com/web/index.php/auth/logout-6,304,Not Modified,Thread Group 1-7,,true,,994,675,2,2,https://opensource-demo.orangehrmlive.com/web/dist/js/app.js?1672659722816,0,0,0
1674472855229,372,https://opensource-demo.orangehrmlive.com/web/index.php/core/i18n/messages,304,Not Modified,Thread Group 1-7,,true,,1052,531,2,2,https://opensource-demo.orangehrmlive.com/web/index.php/core/i18n/messages,0,0,0
1674472793442,32806,Test,,"Number of samples in transaction : 14, number of failing samples : 7",Thread Group 1-7,,false,,4446654,22525,2,2,null,20168,29354,15437
1674472858700,1716,https://opensource-demo.orangehrmlive.com/web/index.php/auth/logout,200,OK,Thread Group 1-1,text,true,,10924,4553,1,1,https://opensource-demo.orangehrmlive.com/web/index.php/auth/login,416,0,0
1674472858700,416,https://opensource-demo.orangehrmlive.com/web/index.php/auth/logout-0,302,Found,Thread Group 1-1,text,true,,1659,579,1,1,https://opensource-demo.orangehrmlive.com/web/index.php/auth/logout,416,0,0
1674472859117,450,https://opensource-demo.orangehrmlive.com/web/index.php/auth/logout-1,200,OK,Thread Group 1-1,text,true,,4300,578,1,1,https://opensource-demo.orangehrmlive.com/web/index.php/auth/login,450,0,0
1674472859569,311,https://opensource-demo.orangehrmlive.com/web/index.php/auth/logout-2,304,Not Modified,Thread Group 1-1,,true,,991,674,1,1,https://opensource-demo.orangehrmlive.com/web/dist/favicon.ico?1672659722816,0,0,0
1674472859569,847,https://opensource-demo.orangehrmlive.com/web/index.php/auth/logout-3,304,Not Modified,Thread Group 1-1,,true,,993,686,1,1,https://opensource-demo.orangehrmlive.com/web/dist/css/chunk-vendors.css?1672659722816,0,0,578
1674472859569,311,https://opensource-demo.orangehrmlive.com/web/index.php/auth/logout-4,304,Not Modified,Thread Group 1-1,,true,,993,676,1,1,https://opensource-demo.orangehrmlive.com/web/dist/css/app.css?1672659722816,0,0,0
1674472859569,310,https://opensource-demo.orangehrmlive.com/web/index.php/auth/logout-5,304,Not Modified,Thread Group 1-1,,true,,994,685,1,1,https://opensource-demo.orangehrmlive.com/web/dist/js/chunk-vendors.js?1672659722816,0,0,0
1674472859569,311,https://opensource-demo.orangehrmlive.com/web/index.php/auth/logout-6,304,Not Modified,Thread Group 1-1,,true,,994,675,1,1,https://opensource-demo.orangehrmlive.com/web/dist/js/app.js?1672659722816,0,0,0
1674472860418,390,https://opensource-demo.orangehrmlive.com/web/index.php/core/i18n/messages,304,Not Modified,Thread Group 1-1,,true,,1052,531,1,1,https://opensource-demo.orangehrmlive.com/web/index.php/core/i18n/messages,0,0,0
1674472792853,32484,Test,,"Number of samples in transaction : 14, number of failing samples : 7",Thread Group 1-1,,false,,4446646,22525,1,1,null,20805,35472,15959
