{
  "https://opensource-demo.orangehrmlive.com/web/index.php/auth/logout" : {
    "transaction" : "https://opensource-demo.orangehrmlive.com/web/index.php/auth/logout",
    "sampleCount" : 10,
    "errorCount" : 0,
    "errorPct" : 0.0,
    "meanResTime" : 1238.5,
    "medianResTime" : 1160.0,
    "minResTime" : 1050.0,
    "maxResTime" : 1716.0,
    "pct1ResTime" : 1704.6000000000001,
    "pct2ResTime" : 1716.0,
    "pct3ResTime" : 1716.0,
    "throughput" : 0.30498963035256804,
    "receivedKBytesPerSec" : 3.257670489203367,
    "sentKBytesPerSec" : 1.3560720576125413
  },
  "https://opensource-demo.orangehrmlive.com/web/index.php/auth/validate-0" : {
    "transaction" : "https://opensource-demo.orangehrmlive.com/web/index.php/auth/validate-0",
    "sampleCount" : 10,
    "errorCount" : 0,
    "errorPct" : 0.0,
    "meanResTime" : 394.00000000000006,
    "medianResTime" : 395.0,
    "minResTime" : 368.0,
    "maxResTime" : 413.0,
    "pct1ResTime" : 413.0,
    "pct2ResTime" : 413.0,
    "pct3ResTime" : 413.0,
    "throughput" : 0.5098659052669148,
    "receivedKBytesPerSec" : 0.8260425164431755,
    "sentKBytesPerSec" : 0.40231606587467494
  },
  "https://opensource-demo.orangehrmlive.com/web/index.php/auth/validate-1" : {
    "transaction" : "https://opensource-demo.orangehrmlive.com/web/index.php/auth/validate-1",
    "sampleCount" : 10,
    "errorCount" : 0,
    "errorPct" : 0.0,
    "meanResTime" : 425.4,
    "medianResTime" : 424.0,
    "minResTime" : 396.0,
    "maxResTime" : 475.0,
    "pct1ResTime" : 471.20000000000005,
    "pct2ResTime" : 475.0,
    "pct3ResTime" : 475.0,
    "throughput" : 0.5091390458734281,
    "receivedKBytesPerSec" : 2.2107274801435772,
    "sentKBytesPerSec" : 0.31174822437757754
  },
  "https://opensource-demo.orangehrmlive.com/web/index.php/auth/validate-2" : {
    "transaction" : "https://opensource-demo.orangehrmlive.com/web/index.php/auth/validate-2",
    "sampleCount" : 10,
    "errorCount" : 0,
    "errorPct" : 0.0,
    "meanResTime" : 262.79999999999995,
    "medianResTime" : 261.0,
    "minResTime" : 240.0,
    "maxResTime" : 327.0,
    "pct1ResTime" : 321.1,
    "pct2ResTime" : 327.0,
    "pct3ResTime" : 327.0,
    "throughput" : 0.5131889561736632,
    "receivedKBytesPerSec" : 0.4966506402032228,
    "sentKBytesPerSec" : 0.3623394680796469
  },
  "https://opensource-demo.orangehrmlive.com/web/index.php/api/v2/dashboard/employees/subunit" : {
    "transaction" : "https://opensource-demo.orangehrmlive.com/web/index.php/api/v2/dashboard/employees/subunit",
    "sampleCount" : 10,
    "errorCount" : 10,
    "errorPct" : 100.0,
    "meanResTime" : 417.40000000000003,
    "medianResTime" : 413.5,
    "minResTime" : 393.0,
    "maxResTime" : 486.0,
    "pct1ResTime" : 479.70000000000005,
    "pct2ResTime" : 486.0,
    "pct3ResTime" : 486.0,
    "throughput" : 0.5149595756733096,
    "receivedKBytesPerSec" : 0.164947989082857,
    "sentKBytesPerSec" : 0.26753759204902416
  },
  "https://opensource-demo.orangehrmlive.com/web/index.php/auth/validate" : {
    "transaction" : "https://opensource-demo.orangehrmlive.com/web/index.php/auth/validate",
    "sampleCount" : 10,
    "errorCount" : 0,
    "errorPct" : 0.0,
    "meanResTime" : 1098.6000000000001,
    "medianResTime" : 1099.5,
    "minResTime" : 1071.0,
    "maxResTime" : 1129.0,
    "pct1ResTime" : 1128.0,
    "pct2ResTime" : 1129.0,
    "pct3ResTime" : 1129.0,
    "throughput" : 0.4924895345973898,
    "receivedKBytesPerSec" : 5.324225483255356,
    "sentKBytesPerSec" : 2.4412860132972174
  },
  "https://opensource-demo.orangehrmlive.com/web/index.php/auth/validate-3" : {
    "transaction" : "https://opensource-demo.orangehrmlive.com/web/index.php/auth/validate-3",
    "sampleCount" : 10,
    "errorCount" : 0,
    "errorPct" : 0.0,
    "meanResTime" : 259.59999999999997,
    "medianResTime" : 252.5,
    "minResTime" : 239.0,
    "maxResTime" : 327.0,
    "pct1ResTime" : 321.0,
    "pct2ResTime" : 327.0,
    "pct3ResTime" : 327.0,
    "throughput" : 0.5131889561736632,
    "receivedKBytesPerSec" : 0.4976529623832495,
    "sentKBytesPerSec" : 0.368353401159807
  },
  "https://opensource-demo.orangehrmlive.com/" : {
    "transaction" : "https://opensource-demo.orangehrmlive.com/",
    "sampleCount" : 10,
    "errorCount" : 0,
    "errorPct" : 0.0,
    "meanResTime" : 24138.600000000002,
    "medianResTime" : 23308.0,
    "minResTime" : 22037.0,
    "maxResTime" : 29945.0,
    "pct1ResTime" : 29625.4,
    "pct2ResTime" : 29945.0,
    "pct3ResTime" : 29945.0,
    "throughput" : 0.3290556103981573,
    "receivedKBytesPerSec" : 1385.7463328294668,
    "sentKBytesPerSec" : 1.2802319842053307
  },
  "https://opensource-demo.orangehrmlive.com/web/index.php/auth/validate-4" : {
    "transaction" : "https://opensource-demo.orangehrmlive.com/web/index.php/auth/validate-4",
    "sampleCount" : 10,
    "errorCount" : 0,
    "errorPct" : 0.0,
    "meanResTime" : 266.0,
    "medianResTime" : 261.5,
    "minResTime" : 243.0,
    "maxResTime" : 327.0,
    "pct1ResTime" : 322.3,
    "pct2ResTime" : 327.0,
    "pct3ResTime" : 327.0,
    "throughput" : 0.5131099594643133,
    "receivedKBytesPerSec" : 0.49757635717584275,
    "sentKBytesPerSec" : 0.36328585997229207
  },
  "https://opensource-demo.orangehrmlive.com/web/index.php/auth/validate-5" : {
    "transaction" : "https://opensource-demo.orangehrmlive.com/web/index.php/auth/validate-5",
    "sampleCount" : 10,
    "errorCount" : 0,
    "errorPct" : 0.0,
    "meanResTime" : 266.40000000000003,
    "medianResTime" : 265.0,
    "minResTime" : 240.0,
    "maxResTime" : 327.0,
    "pct1ResTime" : 322.3,
    "pct2ResTime" : 327.0,
    "pct3ResTime" : 327.0,
    "throughput" : 0.5131626212346693,
    "receivedKBytesPerSec" : 0.49812856006568484,
    "sentKBytesPerSec" : 0.3678333632678196
  },
  "https://opensource-demo.orangehrmlive.com/web/index.php/auth/validate-6" : {
    "transaction" : "https://opensource-demo.orangehrmlive.com/web/index.php/auth/validate-6",
    "sampleCount" : 10,
    "errorCount" : 0,
    "errorPct" : 0.0,
    "meanResTime" : 270.2,
    "medianResTime" : 265.0,
    "minResTime" : 241.0,
    "maxResTime" : 327.0,
    "pct1ResTime" : 322.70000000000005,
    "pct2ResTime" : 327.0,
    "pct3ResTime" : 327.0,
    "throughput" : 0.5137426149499101,
    "receivedKBytesPerSec" : 0.4986915617775495,
    "sentKBytesPerSec" : 0.3632320832263036
  },
  "https://opensource-demo.orangehrmlive.com/web/index.php/api/v2/buzz/feed?limit=5&offset=0&sortOrder=DESC&sortField=share.createdAtUtc" : {
    "transaction" : "https://opensource-demo.orangehrmlive.com/web/index.php/api/v2/buzz/feed?limit=5&offset=0&sortOrder=DESC&sortField=share.createdAtUtc",
    "sampleCount" : 10,
    "errorCount" : 10,
    "errorPct" : 100.0,
    "meanResTime" : 421.5,
    "medianResTime" : 409.5,
    "minResTime" : 389.0,
    "maxResTime" : 481.0,
    "pct1ResTime" : 479.9,
    "pct2ResTime" : 481.0,
    "pct3ResTime" : 481.0,
    "throughput" : 0.5142974696564493,
    "receivedKBytesPerSec" : 0.16473590824933143,
    "sentKBytesPerSec" : 0.25765097845093604
  },
  "https://opensource-demo.orangehrmlive.com/web/index.php/core/i18n/messages" : {
    "transaction" : "https://opensource-demo.orangehrmlive.com/web/index.php/core/i18n/messages",
    "sampleCount" : 30,
    "errorCount" : 0,
    "errorPct" : 0.0,
    "meanResTime" : 459.76666666666677,
    "medianResTime" : 399.5,
    "minResTime" : 372.0,
    "maxResTime" : 850.0,
    "pct1ResTime" : 677.9,
    "pct2ResTime" : 780.1499999999999,
    "pct3ResTime" : 850.0,
    "throughput" : 0.6643635397289397,
    "receivedKBytesPerSec" : 21.42096634445035,
    "sentKBytesPerSec" : 0.3308841848259368
  },
  "Test" : {
    "transaction" : "Test",
    "sampleCount" : 10,
    "errorCount" : 10,
    "errorPct" : 100.0,
    "meanResTime" : 31885.4,
    "medianResTime" : 30910.5,
    "minResTime" : 29501.0,
    "maxResTime" : 37657.0,
    "pct1ResTime" : 37325.4,
    "pct2ResTime" : 37657.0,
    "pct3ResTime" : 37657.0,
    "throughput" : 0.26214381209531545,
    "receivedKBytesPerSec" : 1138.3405088375232,
    "sentKBytesPerSec" : 5.766395866647443
  },
  "https://opensource-demo.orangehrmlive.com/-6" : {
    "transaction" : "https://opensource-demo.orangehrmlive.com/-6",
    "sampleCount" : 10,
    "errorCount" : 0,
    "errorPct" : 0.0,
    "meanResTime" : 6514.9,
    "medianResTime" : 5661.5,
    "minResTime" : 5004.0,
    "maxResTime" : 13104.0,
    "pct1ResTime" : 12489.300000000003,
    "pct2ResTime" : 13104.0,
    "pct3ResTime" : 13104.0,
    "throughput" : 0.7577479730241721,
    "receivedKBytesPerSec" : 1114.30983367432,
    "sentKBytesPerSec" : 0.433633117375161
  },
  "https://opensource-demo.orangehrmlive.com/-5" : {
    "transaction" : "https://opensource-demo.orangehrmlive.com/-5",
    "sampleCount" : 10,
    "errorCount" : 0,
    "errorPct" : 0.0,
    "meanResTime" : 6334.900000000001,
    "medianResTime" : 5553.5,
    "minResTime" : 5105.0,
    "maxResTime" : 9853.0,
    "pct1ResTime" : 9802.8,
    "pct2ResTime" : 9853.0,
    "pct3ResTime" : 9853.0,
    "throughput" : 1.0098969905069684,
    "receivedKBytesPerSec" : 1548.3722906357302,
    "sentKBytesPerSec" : 0.5877916077560089
  },
  "https://opensource-demo.orangehrmlive.com/-4" : {
    "transaction" : "https://opensource-demo.orangehrmlive.com/-4",
    "sampleCount" : 10,
    "errorCount" : 0,
    "errorPct" : 0.0,
    "meanResTime" : 4048.4,
    "medianResTime" : 3960.5,
    "minResTime" : 3508.0,
    "maxResTime" : 5938.0,
    "pct1ResTime" : 5745.400000000001,
    "pct2ResTime" : 5938.0,
    "pct3ResTime" : 5938.0,
    "throughput" : 1.5708451146716933,
    "receivedKBytesPerSec" : 1022.5051175188502,
    "sentKBytesPerSec" : 0.9020087181903865
  },
  "https://opensource-demo.orangehrmlive.com/-3" : {
    "transaction" : "https://opensource-demo.orangehrmlive.com/-3",
    "sampleCount" : 10,
    "errorCount" : 0,
    "errorPct" : 0.0,
    "meanResTime" : 3675.2,
    "medianResTime" : 3512.5,
    "minResTime" : 2232.0,
    "maxResTime" : 7481.0,
    "pct1ResTime" : 7249.700000000001,
    "pct2ResTime" : 7481.0,
    "pct3ResTime" : 7481.0,
    "throughput" : 1.2639029322548028,
    "receivedKBytesPerSec" : 694.681289101997,
    "sentKBytesPerSec" : 0.7380995639534884
  },
  "https://opensource-demo.orangehrmlive.com/-2" : {
    "transaction" : "https://opensource-demo.orangehrmlive.com/-2",
    "sampleCount" : 10,
    "errorCount" : 0,
    "errorPct" : 0.0,
    "meanResTime" : 1124.1,
    "medianResTime" : 1025.5,
    "minResTime" : 773.0,
    "maxResTime" : 1542.0,
    "pct1ResTime" : 1539.6,
    "pct2ResTime" : 1542.0,
    "pct3ResTime" : 1542.0,
    "throughput" : 5.827505827505828,
    "receivedKBytesPerSec" : 9.526606206293707,
    "sentKBytesPerSec" : 3.346263111888112
  },
  "https://opensource-demo.orangehrmlive.com/-1" : {
    "transaction" : "https://opensource-demo.orangehrmlive.com/-1",
    "sampleCount" : 10,
    "errorCount" : 0,
    "errorPct" : 0.0,
    "meanResTime" : 1036.1999999999998,
    "medianResTime" : 935.0,
    "minResTime" : 806.0,
    "maxResTime" : 1422.0,
    "pct1ResTime" : 1421.6,
    "pct2ResTime" : 1422.0,
    "pct3ResTime" : 1422.0,
    "throughput" : 7.032348804500703,
    "receivedKBytesPerSec" : 30.29197982594937,
    "sentKBytesPerSec" : 3.6123197960618847
  },
  "https://opensource-demo.orangehrmlive.com/-0" : {
    "transaction" : "https://opensource-demo.orangehrmlive.com/-0",
    "sampleCount" : 10,
    "errorCount" : 0,
    "errorPct" : 0.0,
    "meanResTime" : 15944.2,
    "medianResTime" : 15951.5,
    "minResTime" : 15502.0,
    "maxResTime" : 16347.0,
    "pct1ResTime" : 16341.4,
    "pct2ResTime" : 16347.0,
    "pct3ResTime" : 16347.0,
    "throughput" : 0.6117330397014743,
    "receivedKBytesPerSec" : 0.6296549060989783,
    "sentKBytesPerSec" : 0.2998925643849024
  },
  "https://opensource-demo.orangehrmlive.com/web/index.php/api/v2/dashboard/employees/locations" : {
    "transaction" : "https://opensource-demo.orangehrmlive.com/web/index.php/api/v2/dashboard/employees/locations",
    "sampleCount" : 10,
    "errorCount" : 10,
    "errorPct" : 100.0,
    "meanResTime" : 414.6,
    "medianResTime" : 408.5,
    "minResTime" : 395.0,
    "maxResTime" : 482.0,
    "pct1ResTime" : 476.40000000000003,
    "pct2ResTime" : 482.0,
    "pct3ResTime" : 482.0,
    "throughput" : 0.515331100231899,
    "receivedKBytesPerSec" : 0.16506699304303013,
    "sentKBytesPerSec" : 0.2687371167224942
  },
  "https://opensource-demo.orangehrmlive.com/web/index.php/events/push" : {
    "transaction" : "https://opensource-demo.orangehrmlive.com/web/index.php/events/push",
    "sampleCount" : 10,
    "errorCount" : 0,
    "errorPct" : 0.0,
    "meanResTime" : 1143.3,
    "medianResTime" : 1123.0,
    "minResTime" : 1078.0,
    "maxResTime" : 1292.0,
    "pct1ResTime" : 1281.9,
    "pct2ResTime" : 1292.0,
    "pct3ResTime" : 1292.0,
    "throughput" : 0.4969684921975947,
    "receivedKBytesPerSec" : 5.308438835602823,
    "sentKBytesPerSec" : 1.7442429306231986
  },
  "https://opensource-demo.orangehrmlive.com/web/index.php/events/push-5" : {
    "transaction" : "https://opensource-demo.orangehrmlive.com/web/index.php/events/push-5",
    "sampleCount" : 10,
    "errorCount" : 0,
    "errorPct" : 0.0,
    "meanResTime" : 261.8,
    "medianResTime" : 263.0,
    "minResTime" : 240.0,
    "maxResTime" : 291.0,
    "pct1ResTime" : 289.6,
    "pct2ResTime" : 291.0,
    "pct3ResTime" : 291.0,
    "throughput" : 0.518887505188875,
    "receivedKBytesPerSec" : 0.5036857228102948,
    "sentKBytesPerSec" : 0.2716051784973018
  },
  "https://opensource-demo.orangehrmlive.com/web/index.php/events/push-4" : {
    "transaction" : "https://opensource-demo.orangehrmlive.com/web/index.php/events/push-4",
    "sampleCount" : 10,
    "errorCount" : 0,
    "errorPct" : 0.0,
    "meanResTime" : 257.1,
    "medianResTime" : 258.5,
    "minResTime" : 240.0,
    "maxResTime" : 288.0,
    "pct1ResTime" : 286.4,
    "pct2ResTime" : 288.0,
    "pct3ResTime" : 288.0,
    "throughput" : 0.5189952252439277,
    "receivedKBytesPerSec" : 0.5032834557297072,
    "sentKBytesPerSec" : 0.267100081741748
  },
  "https://opensource-demo.orangehrmlive.com/web/index.php/api/v2/dashboard/employees/action-summary" : {
    "transaction" : "https://opensource-demo.orangehrmlive.com/web/index.php/api/v2/dashboard/employees/action-summary",
    "sampleCount" : 10,
    "errorCount" : 10,
    "errorPct" : 100.0,
    "meanResTime" : 410.29999999999995,
    "medianResTime" : 409.0,
    "minResTime" : 383.0,
    "maxResTime" : 441.0,
    "pct1ResTime" : 438.7,
    "pct2ResTime" : 441.0,
    "pct3ResTime" : 441.0,
    "throughput" : 0.5120589891955554,
    "receivedKBytesPerSec" : 0.16401889497670133,
    "sentKBytesPerSec" : 0.26953104997695737
  },
  "https://opensource-demo.orangehrmlive.com/web/index.php/events/push-6" : {
    "transaction" : "https://opensource-demo.orangehrmlive.com/web/index.php/events/push-6",
    "sampleCount" : 10,
    "errorCount" : 0,
    "errorPct" : 0.0,
    "meanResTime" : 260.0,
    "medianResTime" : 261.5,
    "minResTime" : 241.0,
    "maxResTime" : 281.0,
    "pct1ResTime" : 279.4,
    "pct2ResTime" : 281.0,
    "pct3ResTime" : 281.0,
    "throughput" : 0.5195344970906068,
    "receivedKBytesPerSec" : 0.5043137598711555,
    "sentKBytesPerSec" : 0.266870259247714
  },
  "https://opensource-demo.orangehrmlive.com/web/index.php/api/v2/dashboard/shortcuts" : {
    "transaction" : "https://opensource-demo.orangehrmlive.com/web/index.php/api/v2/dashboard/shortcuts",
    "sampleCount" : 10,
    "errorCount" : 10,
    "errorPct" : 100.0,
    "meanResTime" : 405.2,
    "medianResTime" : 403.5,
    "minResTime" : 387.0,
    "maxResTime" : 433.0,
    "pct1ResTime" : 431.7,
    "pct2ResTime" : 433.0,
    "pct3ResTime" : 433.0,
    "throughput" : 0.5134788189987163,
    "receivedKBytesPerSec" : 0.1644736842105263,
    "sentKBytesPerSec" : 0.26275673940949934
  },
  "https://opensource-demo.orangehrmlive.com/web/index.php/events/push-1" : {
    "transaction" : "https://opensource-demo.orangehrmlive.com/web/index.php/events/push-1",
    "sampleCount" : 10,
    "errorCount" : 0,
    "errorPct" : 0.0,
    "meanResTime" : 452.8,
    "medianResTime" : 443.5,
    "minResTime" : 414.0,
    "maxResTime" : 522.0,
    "pct1ResTime" : 519.5,
    "pct2ResTime" : 522.0,
    "pct3ResTime" : 522.0,
    "throughput" : 0.5141652527122217,
    "receivedKBytesPerSec" : 2.1661219728520744,
    "sentKBytesPerSec" : 0.2154071224741632
  },
  "https://opensource-demo.orangehrmlive.com/web/index.php/events/push-0" : {
    "transaction" : "https://opensource-demo.orangehrmlive.com/web/index.php/events/push-0",
    "sampleCount" : 10,
    "errorCount" : 0,
    "errorPct" : 0.0,
    "meanResTime" : 415.90000000000003,
    "medianResTime" : 405.5,
    "minResTime" : 389.0,
    "maxResTime" : 477.0,
    "pct1ResTime" : 473.0,
    "pct2ResTime" : 477.0,
    "pct3ResTime" : 477.0,
    "throughput" : 0.514588586425153,
    "receivedKBytesPerSec" : 0.8336938133587197,
    "sentKBytesPerSec" : 0.25829934904543816
  },
  "https://opensource-demo.orangehrmlive.com/web/index.php/events/push-3" : {
    "transaction" : "https://opensource-demo.orangehrmlive.com/web/index.php/events/push-3",
    "sampleCount" : 10,
    "errorCount" : 0,
    "errorPct" : 0.0,
    "meanResTime" : 259.7,
    "medianResTime" : 262.5,
    "minResTime" : 242.0,
    "maxResTime" : 270.0,
    "pct1ResTime" : 269.6,
    "pct2ResTime" : 270.0,
    "pct3ResTime" : 270.0,
    "throughput" : 0.5189952252439277,
    "receivedKBytesPerSec" : 0.5032834557297072,
    "sentKBytesPerSec" : 0.2721683944882707
  },
  "https://opensource-demo.orangehrmlive.com/web/index.php/events/push-2" : {
    "transaction" : "https://opensource-demo.orangehrmlive.com/web/index.php/events/push-2",
    "sampleCount" : 10,
    "errorCount" : 0,
    "errorPct" : 0.0,
    "meanResTime" : 252.8,
    "medianResTime" : 256.0,
    "minResTime" : 242.0,
    "maxResTime" : 262.0,
    "pct1ResTime" : 261.9,
    "pct2ResTime" : 262.0,
    "pct3ResTime" : 262.0,
    "throughput" : 0.5189952252439277,
    "receivedKBytesPerSec" : 0.5022697931804028,
    "sentKBytesPerSec" : 0.2660864191924434
  },
  "https://opensource-demo.orangehrmlive.com/web/index.php/auth/logout-1" : {
    "transaction" : "https://opensource-demo.orangehrmlive.com/web/index.php/auth/logout-1",
    "sampleCount" : 10,
    "errorCount" : 0,
    "errorPct" : 0.0,
    "meanResTime" : 447.9,
    "medianResTime" : 439.0,
    "minResTime" : 408.0,
    "maxResTime" : 531.0,
    "pct1ResTime" : 525.7,
    "pct2ResTime" : 531.0,
    "pct3ResTime" : 531.0,
    "throughput" : 0.31709791983764585,
    "receivedKBytesPerSec" : 1.3357749873160831,
    "sentKBytesPerSec" : 0.17898691178335868
  },
  "https://opensource-demo.orangehrmlive.com/web/index.php/auth/logout-2" : {
    "transaction" : "https://opensource-demo.orangehrmlive.com/web/index.php/auth/logout-2",
    "sampleCount" : 10,
    "errorCount" : 0,
    "errorPct" : 0.0,
    "meanResTime" : 267.8,
    "medianResTime" : 264.0,
    "minResTime" : 240.0,
    "maxResTime" : 323.0,
    "pct1ResTime" : 321.8,
    "pct2ResTime" : 323.0,
    "pct3ResTime" : 323.0,
    "throughput" : 0.3193153878085385,
    "receivedKBytesPerSec" : 0.3090249505061149,
    "sentKBytesPerSec" : 0.21017438611616693
  },
  "https://opensource-demo.orangehrmlive.com/web/index.php/auth/logout-0" : {
    "transaction" : "https://opensource-demo.orangehrmlive.com/web/index.php/auth/logout-0",
    "sampleCount" : 10,
    "errorCount" : 0,
    "errorPct" : 0.0,
    "meanResTime" : 405.7,
    "medianResTime" : 405.0,
    "minResTime" : 380.0,
    "maxResTime" : 453.0,
    "pct1ResTime" : 449.40000000000003,
    "pct2ResTime" : 453.0,
    "pct3ResTime" : 453.0,
    "throughput" : 0.3175813008130081,
    "receivedKBytesPerSec" : 0.5145189238757623,
    "sentKBytesPerSec" : 0.17956989567454268
  },
  "https://opensource-demo.orangehrmlive.com/web/index.php/auth/logout-5" : {
    "transaction" : "https://opensource-demo.orangehrmlive.com/web/index.php/auth/logout-5",
    "sampleCount" : 10,
    "errorCount" : 0,
    "errorPct" : 0.0,
    "meanResTime" : 323.79999999999995,
    "medianResTime" : 266.5,
    "minResTime" : 239.0,
    "maxResTime" : 776.0,
    "pct1ResTime" : 730.7000000000002,
    "pct2ResTime" : 776.0,
    "pct3ResTime" : 776.0,
    "throughput" : 0.31932558436581937,
    "receivedKBytesPerSec" : 0.30997034263635204,
    "sentKBytesPerSec" : 0.21361135282283816
  },
  "https://opensource-demo.orangehrmlive.com/web/index.php/auth/logout-6" : {
    "transaction" : "https://opensource-demo.orangehrmlive.com/web/index.php/auth/logout-6",
    "sampleCount" : 10,
    "errorCount" : 0,
    "errorPct" : 0.0,
    "meanResTime" : 268.09999999999997,
    "medianResTime" : 264.0,
    "minResTime" : 239.0,
    "maxResTime" : 323.0,
    "pct1ResTime" : 321.8,
    "pct2ResTime" : 323.0,
    "pct3ResTime" : 323.0,
    "throughput" : 0.3193153878085385,
    "receivedKBytesPerSec" : 0.3099604448063352,
    "sentKBytesPerSec" : 0.21048621754957372
  },
  "https://opensource-demo.orangehrmlive.com/web/index.php/auth/logout-3" : {
    "transaction" : "https://opensource-demo.orangehrmlive.com/web/index.php/auth/logout-3",
    "sampleCount" : 10,
    "errorCount" : 0,
    "errorPct" : 0.0,
    "meanResTime" : 317.2,
    "medianResTime" : 256.0,
    "minResTime" : 239.0,
    "maxResTime" : 847.0,
    "pct1ResTime" : 794.6000000000001,
    "pct2ResTime" : 847.0,
    "pct3ResTime" : 847.0,
    "throughput" : 0.3139421718519449,
    "receivedKBytesPerSec" : 0.30443806313377075,
    "sentKBytesPerSec" : 0.2103167284086271
  },
  "Total" : {
    "transaction" : "Total",
    "sampleCount" : 420,
    "errorCount" : 70,
    "errorPct" : 16.666666,
    "meanResTime" : 1837.3285714285698,
    "medianResTime" : 403.5,
    "minResTime" : 239.0,
    "maxResTime" : 29945.0,
    "pct1ResTime" : 5094.900000000003,
    "pct2ResTime" : 12941.449999999963,
    "pct3ResTime" : 24058.65000000001,
    "throughput" : 6.18474723527073,
    "receivedKBytesPerSec" : 1264.3220154913192,
    "sentKBytesPerSec" : 5.713643441959092
  },
  "https://opensource-demo.orangehrmlive.com/web/index.php/auth/logout-4" : {
    "transaction" : "https://opensource-demo.orangehrmlive.com/web/index.php/auth/logout-4",
    "sampleCount" : 10,
    "errorCount" : 0,
    "errorPct" : 0.0,
    "meanResTime" : 269.5,
    "medianResTime" : 264.5,
    "minResTime" : 241.0,
    "maxResTime" : 323.0,
    "pct1ResTime" : 321.8,
    "pct2ResTime" : 323.0,
    "pct3ResTime" : 323.0,
    "throughput" : 0.3193153878085385,
    "receivedKBytesPerSec" : 0.3096486133729284,
    "sentKBytesPerSec" : 0.2107980489829805
  },
  "https://opensource-demo.orangehrmlive.com/web/index.php/api/v2/dashboard/employees/leaves?date=2023-01-23" : {
    "transaction" : "https://opensource-demo.orangehrmlive.com/web/index.php/api/v2/dashboard/employees/leaves?date=2023-01-23",
    "sampleCount" : 10,
    "errorCount" : 10,
    "errorPct" : 100.0,
    "meanResTime" : 404.0,
    "medianResTime" : 402.0,
    "minResTime" : 383.0,
    "maxResTime" : 433.0,
    "pct1ResTime" : 432.3,
    "pct2ResTime" : 433.0,
    "pct3ResTime" : 433.0,
    "throughput" : 0.5150126178091363,
    "receivedKBytesPerSec" : 0.16496497914198896,
    "sentKBytesPerSec" : 0.27510927923984135
  },
  "https://opensource-demo.orangehrmlive.com/web/index.php/api/v2/dashboard/employees/time-at-work?timezoneOffset=5.5&currentDate=2023-01-23&currentTime=11:51" : {
    "transaction" : "https://opensource-demo.orangehrmlive.com/web/index.php/api/v2/dashboard/employees/time-at-work?timezoneOffset=5.5&currentDate=2023-01-23&currentTime=11:51",
    "sampleCount" : 10,
    "errorCount" : 10,
    "errorPct" : 100.0,
    "meanResTime" : 414.1,
    "medianResTime" : 401.5,
    "minResTime" : 386.0,
    "maxResTime" : 503.0,
    "pct1ResTime" : 497.70000000000005,
    "pct2ResTime" : 503.0,
    "pct3ResTime" : 503.0,
    "throughput" : 0.5102561485865904,
    "receivedKBytesPerSec" : 0.16344142259414227,
    "sentKBytesPerSec" : 0.2984799150423513
  }
}