Sigle MTL,Nom latin MTL,Nom français MTL,Nom anglais MTL,Latin,Genre,Famille,Code UQÀM,Gr.Fonct.
AB,Abies,Sapin,Fir,Abies balsamea,Abies,Pinaceae,ABBA,1A
ABBA,Abies balsamea,Sapin baumier,Balsam Fir,Abies balsamea,Abies,Pinaceae,ABBA,1A
ABCO,Abies concolor,Sapin argenté,White Fir,Abies concolor,Abies,Pinaceae,ABCO,1A
ABKO,Abies koreana,sapin de Corée,Korean fir,Abies koreana,Abies,Pinaceae,ABKO,1A
ABSI,Abies sibirica,Abies sibirica,Abies sibirica,Abies sibirica,Abies,Pinaceae,ABSI,1A
AC,Acer,Érable,Maple,Acer platanoides,Acer,Sapindaceae,ACPL,2A
ACCA,Acer campestre,Érable champêtre,Hedge Maple,Acer campestre,Acer,Sapindaceae,ACCA,2A
ACFR,Acer x freemanii,Érable de Freeman,Freeman Maple,Acer freemanii,Acer,Sapindaceae,ACFR,2A
ACFRAB,Acer x freemanii 'Autumn Blaze',Érable Autumn Blaze,Autumn Blaze Freeman Maple,Acer freemanii,Acer,Sapindaceae,ACFR,2A
ACFRAF,Acer x freemanii 'Autumn Fantasy',Acer x freemanii 'Autumn Fantasy',Acer x freemanii 'Autumn Fantasy',Acer freemanii,Acer,Sapindaceae,ACFR,2A
ACFRAG,Acer freemanii 'Amstrong Gold'',Acer fremanii 'Armstrong Gold,Acer fremanii Arnstrong Gold,Acer freemanii,Acer,Sapindaceae,ACFR,2A
ACFRAR,Acer x freemanii 'Armstrong',Acer x freemanii 'Armstrong',Acre x freemanii 'Armstrong',Acer freemanii,Acer,Sapindaceae,ACFR,2A
ACFRCE,Acer x freemanii 'Celebration',Acer x freemanii Celebration,Acer x freemanii Celebration,Acer freemanii,Acer,Sapindaceae,ACFR,2A
ACFRFI,Acer x freemanii 'Firefall',Acer x freemanii 'Firefall',Acer x freemanii 'Firefall',Acer freemanii,Acer,Sapindaceae,ACFR,2A
ACFRMA,Acer x freemanii 'Marmo',Acer x freemanii Marmo,Acer x freemanii Marmo,Acer freemanii,Acer,Sapindaceae,ACFR,2A
ACFRMO,Acer Fremanii 'Morgan',Érable rouge Morgan,Morgan Maple,Acer freemanii,Acer,Sapindaceae,ACFR,2A
ACFRSG,Acer x freemanii 'Sienna Glen',Acer x freemanii 'Sienna Glen',Acer x freemanii 'Sienna Glen',Acer freemanii,Acer,Sapindaceae,ACFR,2A
ACFRSI,Acer freemanii 'Sienna',Acer freemanii 'Sienna',Acer freemanii 'Sienna',Acer freemanii,Acer,Sapindaceae,ACFR,2A
ACFRSS,Acer x freemanii 'Scarlet Sentinel',Acer x freemanii 'Scarlet Sentinel',Acer x  freemanii 'Scarlet Sentinel',Acer freemanii,Acer,Sapindaceae,ACFR,2A
ACGA,Acer grandidentatum,,Bigtooth Maple,Acer grandidentatum,Acer,Sapindaceae,ACGA,2A
ACGARM,Acer grandidentatum ' Rocky Mountain Glow',Acer grandidentatum ' Rocky Mountain Glow',Acer grandidentatum ' Rocky Mountain Glow',Acer grandidentatum,Acer,Sapindaceae,ACGA,2A
ACGI,Acer ginnala,Érable de l'Armour,Armur Maple,Acer ginnala,Acer,Sapindaceae,ACGI,2A
ACGIBE,Acer ginnala 'Betzam',Érable de l'Amur Beethoven,Beethoven Amur Maple,Acer ginnala,Acer,Sapindaceae,ACGI,2A
ACGIEM,Acer ginnala 'Embers',Acer ginnala Embers,Acer ginnala Embers,Acer ginnala,Acer,Sapindaceae,ACGI,2A
ACGIFL,Acer ginnala 'Flame',Érable de l'Armour Flame,Flame Armur Maple,Acer ginnala,Acer,Sapindaceae,ACGI,2A
ACGIFT,Acer g. Flame tiges multiples,Acer g. Flame tiges multiples,Acer g. Flame tiges multiples,Acer ginnala,Acer,Sapindaceae,ACGI,2A
ACGIMO,Acer ginnala 'Morden',Érable de l'Armour Morden,Morden Armur Maple,Acer ginnala,Acer,Sapindaceae,ACGI,2A
ACGIRS,Acer ginnala 'Ruby Slippers',érable ginnala Ruby Slippers,Ruby Slippers Ginnala Maple,Acer ginnala,Acer,Sapindaceae,ACGI,2A
ACGR,Acer griseum,Acer griseum,Acer griseum,Acer griseum,Acer,Sapindaceae,ACGR,2A
ACMI,Acer Miyabei,Acer Miyabei,Acer Miyabei,Acer miyabei,Acer,Sapindaceae,ACMI,2A
ACMIMO,Acer miyabei 'Morton',Acer miyabei Morton,Acer miyabei Morton,Acer miyabei,Acer,Sapindaceae,ACMI,2A
ACNE,Acer negundo,Érable à Giguère,Manitoba Maple,Acer negundo,Acer,Sapindaceae,ACNE,2C
ACNEAU,Acer negundo 'Aureomarginatum',Acer negundo Aureomarginatum,Acer negundo Aureomarginatum,Acer negundo,Acer,Sapindaceae,ACNE,2C
ACNEBA,Acer negundo 'Baron',Acer negundo Baron,Acer negundo Baron,Acer negundo,Acer,Sapindaceae,ACNE,2C
ACNEFL,Acer negundo 'Flamingo',Érable à Giguère Flamingo,Flamingo Manitoba Maple,Acer negundo,Acer,Sapindaceae,ACNE,2C
ACNEKG,Acer negundo 'Kelly's Gold',Acer negundo Kelly's Gold,Acer negundo Kelly's Gold,Acer negundo,Acer,Sapindaceae,ACNE,2C
ACNEVA,Acer negundo 'Variegatum',Érable à Giguère panaché,Variegated Manitoba Maple,Acer negundo,Acer,Sapindaceae,ACNE,2C
ACNI,Acer nigrum,Érable noir,Black Maple,Acer nigrum,Acer,Sapindaceae,ACNI,2A
ACNIGC,Acer nigrum 'Green Column',Érable noir Green Column,Green Column Black Maple,Acer nigrum,Acer,Sapindaceae,ACNI,2A
ACPA,Acer palmatum,Érable du Japon,Japanese Maple,Acer palmatum,Acer,Sapindaceae,ACPA,2A
ACPE,Acer pensylvanicum,Érable de Pennsylvanie,Striped Maple,Acer pensylvanicum,Acer,Sapindaceae,ACPE,2A
ACPL,Acer platanoides,Érable de Norvège,Norway Maple,Acer platanoides,Acer,Sapindaceae,ACPL,2A
ACPLAP,Acer platanoides 'Alberta Park',Érable de Norvège Alberta Park,Alberta Park Norway Maple,Acer platanoides,Acer,Sapindaceae,ACPL,2A
ACPLCB,Acer platanoides 'Columnarbroad',Érable de Norvège Parkway,Parkway Norway Maple,Acer platanoides,Acer,Sapindaceae,ACPL,2A
ACPLCK,Acer platanoides 'Crimson King',Érable de Norvège Crimson King,Crimson King Norway Maple,Acer platanoides,Acer,Sapindaceae,ACPL,2A
ACPLCL,Acer platanoides 'Cleveland',Érable de Norvège Cleveland,Cleveland Norway Maple,Acer platanoides,Acer,Sapindaceae,ACPL,2A
ACPLCO,Acer platanoides 'Columnare',Érable de Norvège colonnaire,Columnare Norway Maple,Acer platanoides,Acer,Sapindaceae,ACPL,2A
ACPLCQ,Acer platanoides 'Conquest',Acer platanoides Conquest,Acer platanoides Conquest,Acer platanoides,Acer,Sapindaceae,ACPL,2A
ACPLCS,Acer platanoides 'Crimson Sentry',Érable de Norvège Crimson Sentry,Crimson Sentry Norway Maple,Acer platanoides,Acer,Sapindaceae,ACPL,2A
ACPLDE,Acer platanoides 'Deborah',Érable de Norvège Deborah,Deborah Norway Maple,Acer platanoides,Acer,Sapindaceae,ACPL,2A
ACPLDR,Acer platanoides 'Drummondii',Érable de Norvège panaché,Harlequin Norway Maple,Acer platanoides,Acer,Sapindaceae,ACPL,2A
ACPLEL,Acer platanoides 'Emerald Lustre',Acer platanoides Emerald Lustre,Acer platanoides Emerald Lustre,Acer platanoides,Acer,Sapindaceae,ACPL,2A
ACPLEQ,Acer platanoides 'Emerald Queen',Érable de Norvège Emerald Queen,Emerald Queen Norway Maple,Acer platanoides,Acer,Sapindaceae,ACPL,2A
ACPLER,Acer platanoides 'Erostan',Acer platanoides Erostan,Acer platanoides Erostan,Acer platanoides,Acer,Sapindaceae,ACPL,2A
ACPLES,Acer platanoides 'Easy Street',Acer platanoides Easy Street,Acer platanoides Easy Street,Acer platanoides,Acer,Sapindaceae,ACPL,2A
ACPLFA,Acer platanoides 'Fairview',Érable de Norvège Fairview,Fairview Norway Maple,Acer platanoides,Acer,Sapindaceae,ACPL,2A
ACPLGL,Acer platanoides 'Globosum',Érable de Norvège globe,Globe Norway Maple,Acer platanoides,Acer,Sapindaceae,ACPL,2A
ACPLJG,Acer platanoides 'Jade Glen',Acer platanoides Jade Glen,Acer platanoides Jade Glen,Acer platanoides,Acer,Sapindaceae,ACPL,2A
ACPLME,Acer platanoides 'Medallion',Acer platanoides Medallion,Acer platanoides Medallion,Acer platanoides,Acer,Sapindaceae,ACPL,2A
ACPLOL,Acer platanoides 'Olmsted',Érable de Norvège Olmsted,Olmsted Norway Maple,Acer platanoides,Acer,Sapindaceae,ACPL,2A
ACPLPG,Acer platanoides 'Princeton Gold',Acer platanoides 'Princeton Gold',Acer platanoides Princeton Gold,Acer platanoides,Acer,Sapindaceae,ACPL,2A
ACPLRR,Acer platanoides 'Royal Red',Érable de Norvège Royal Red,Royal Red Norway Maple,Acer platanoides,Acer,Sapindaceae,ACPL,2A
ACPLSC,Acer platanoides 'Schwedleri',Érable de Norvège Schwedleri,Schwedleri Norway Maple,Acer platanoides,Acer,Sapindaceae,ACPL,2A
ACPLSP,Acer platanoides 'Superform',Érable de Norvège Superform,Superform Norway Maple,Acer platanoides,Acer,Sapindaceae,ACPL,2A
ACPLSU,Acer platanoides 'Summershade',Érable de Norvège Summershade,Summershade Norway Maple,Acer platanoides,Acer,Sapindaceae,ACPL,2A
ACPS,Acer pseudoplatanus,Érable sycamore,Sycamore Maple,Acer pseudoplatanus,Acer,Sapindaceae,ACPS,2A
ACPSRP,Acer pseudoplatanus 'Regal Petticoat',Érable sycomore Regal Petticoat,Regal Petticoat maple,Acer pseudoplatanus,Acer,Sapindaceae,ACPS,2A
ACRU,Acer rubrum,Érable rouge,Red Maple,Acer rubrum,Acer,Sapindaceae,ACRU,2C
ACRUAA,Acer rubrum 'Autumn Radiance',érable rouge Autumn Radiance,Autumn Radiance Red maple,Acer rubrum,Acer,Sapindaceae,ACRU,2C
ACRUAF,Acer rubrum 'Autumn Flame',Acer rubrum 'Autumn Flame',Acer rubrum 'Autumn Flame',Acer rubrum,Acer,Sapindaceae,ACRU,2C
ACRUAR,Acer rubrum 'Armstrong',Érable rouge Armstrong,Armstrong Red Maple,Acer rubrum,Acer,Sapindaceae,ACRU,2C
ACRUBO,Acer rubrum 'Bowhall',Acer rubrum 'Bowhall',Acer rubrum 'Bowhall',Acer rubrum,Acer,Sapindaceae,ACRU,2C
ACRUBR,Acer rubrum 'Brandywine',érable rouge Brandywine,Brandiwine Red Maple,Acer rubrum,Acer,Sapindaceae,ACRU,2C
ACRUCO,Acer rubrum 'Columnare',Érable rouge colonnaire,Columnare Red Maple,Acer rubrum,Acer,Sapindaceae,ACRU,2C
ACRUMO,Acer rubrum 'Morgan',Érable rouge Morgan,Morgan Red Maple,Acer rubrum,Acer,Sapindaceae,ACRU,2C
ACRUNO,Acer rubrum 'Northwood',Érable rouge Northwood,Northwood Red Maple,Acer rubrum,Acer,Sapindaceae,ACRU,2C
ACRUOG,Acer rubrum 'October Glory',Acer rubrum 'October Glory',Acer rubrum 'October Glory',Acer rubrum,Acer,Sapindaceae,ACRU,2C
ACRUPY,Acer rubrum 'Pyramidal',Acer rubrum Pyramidal,Acer rubrum Pyramidal,Acer rubrum,Acer,Sapindaceae,ACRU,2C
ACRURE,Acer rubrum 'Frank Jr.. (Redpointe TM),érable rouge Redpointe,Redpointe Maple,Acer rubrum,Acer,Sapindaceae,ACRU,2C
ACRURR,Acer rubrum 'Red Rocket',érable rouge Red Rocket,Red Rocket  Red Maple,Acer rubrum,Acer,Sapindaceae,ACRU,2C
ACRURS,Acer rubrum 'Red Sunset',Érable rouge Red Sunset,Red Sunset Red Maple,Acer rubrum,Acer,Sapindaceae,ACRU,2C
ACRUSU,Acer rubrum Supersonic,Érable rouge Supersonic,Supersonic Red Maple,Acer rubrum,Acer,Sapindaceae,ACRU,2C
ACSA,Acer saccharinum,Érable argenté,Silver Maple,Acer saccharinum,Acer,Sapindaceae,ACSI,2C
ACSALA,Acer saccharinum 'Laciniatum',Érable argenté à feuilles laciniées,Cut-leaf Silver Maple,Acer saccharinum,Acer,Sapindaceae,ACSI,2C
ACSALU,Acer saccharinum 'Lutescens',Érable argenté lutescens,Golden Silver maple,Acer saccharinum,Acer,Sapindaceae,ACSI,2C
ACSAMO,Acer saccharinum 'Montréal',Érable argenté 'Montréal',Montréal Siler Maple,Acer saccharinum,Acer,Sapindaceae,ACSI,2C
ACSAPY,Acer saccharinum 'Pyramidalis',Érable argenté Pyramidal,Pyramidale Silver Maple,Acer saccharinum,Acer,Sapindaceae,ACSI,2C
ACSASC,Acer saccharinum 'Silver Cloud',Acer saccharinum 'Silver Cloud',Acer saccharinum 'Silver Cloud',Acer saccharinum,Acer,Sapindaceae,ACSI,2C
ACSASQ,Acer saccharinum 'Silver Queen',Érable argenté Silver Queen,Silver Queen Silver Maple,Acer saccharinum,Acer,Sapindaceae,ACSI,2C
ACSAWE,Acer saccharinum 'Wierie',Acer saccharinum Wierie,Acer saccharinum Wierie,Acer saccharinum,Acer,Sapindaceae,ACSI,2C
ACSC,Acer saccharum,Érable à sucre,Sugar Maple,Acer saccharum,Acer,Sapindaceae,ACSA,2A
ACSCAP,Acer saccharum 'Apollo',Acer saccharum Apollo,Acer saccharum Apollo,Acer saccharum,Acer,Sapindaceae,ACSA,2A
ACSCCO,Acer saccharum 'Commemoration'',Érable à sucre Commemoration,Commemoration Sugar Maple,Acer saccharum,Acer,Sapindaceae,ACSA,2A
ACSCEN,Acer saccharum 'Endowment',érable à sucre  Endowment,Endowment Sugar Maple,Acer saccharum,Acer,Sapindaceae,ACSA,2A
ACSCFF,Acer saccharum 'Fall Fiesta,Érable à sucre Fall Fiesta,Fall Fiesta sugar maple,Acer saccharum,Acer,Sapindaceae,ACSA,2A
ACSCGM,Acer saccharum 'Green Mountain',Érable à sucre 'Green Mountain',Green Mountain Sugar Maple,Acer saccharum,Acer,Sapindaceae,ACSA,2A
ACSCLE,Acer saccharum 'Legacy',Acer saccharum Legacy,Acer saccharum Legacy,Acer saccharum,Acer,Sapindaceae,ACSA,2A
ACSCTU,Acer saccharum 'Temple Upright',Érable à sucre Temple Upright,Temple Upright Sugar Maple,Acer saccharum,Acer,Sapindaceae,ACSA,2A
ACSCUN,Acer saccharum 'Unity',Acer saccharum Unity,Acer saccharum Unity,Acer saccharum,Acer,Sapindaceae,ACSA,2A
ACSP,Acer spicatum,Érable à épis,Mountain Maple,Acer spicatum,Acer,Sapindaceae,ACSP,2C
ACTA,Acer tataricum,Érable de Tartarie,Tartarian Maple,Acer tataricum,Acer,Sapindaceae,ACTA,2A
ACTAGA,Acer tataricum 'GarAnn' (Hot Wings TM),érable de Tartarie 'GarAnn' (Hot Wings TM),Tatarian maple 'GarAnn' (Hot Wings TN),Acer tataricum,Acer,Sapindaceae,ACTA,2A
ACTARU,Acer tatricum 'Rubrum',Érable de Tartarie,Red Tatarian Maple,Acer tataricum,Acer,Sapindaceae,ACTA,2A
ACTI,Acer triflorum,Érable aux trois fleurs,Three flowered maple,Acer triflorum,Acer,Sapindaceae,ACTI,2A
ACTR,Acer truncatum,Érable truncatum,Truncatum Maple,Acer truncatum,Acer,Sapindaceae,ACTR,2A
ACXPS,Acer x 'Pacific Sunset',Acer x 'Pacific Sunset',Acer x 'Pacific Sunset',Acer platanoides,Acer,Sapindaceae,ACPL,2A
AE,Aesculus,Marronnier,Horsechesnut,Aesculus hippocastanum,Aesculus,Sapindaceae,AEHI,2B
AEAR,Aesculus arguta,Marronnier du Texas,Texas Buckeye,Aesculus arguta,Aesculus,Sapindaceae,AEAR,2B
AEBU,Aesculus x bushii,Aesculus x bushii,Aesculus x bushii,Aesculus x bushii,Aesculus,Sapindaceae,AEBU,2B
AECA,Aesculus x carnea,Aesculus x carnea,Aesculus x carnea,Aesculus hippocastanum,Aesculus,Sapindaceae,AEHI,2B
AECABR,Aesculus carnea 'Briotii',Aesculus carnea 'Briotii',Aesculus carnea 'Briotii',Aesculus carnea,Aesculus,Sapindaceae,AECABR,2B
AECAFM,Aesculus x carnea 'Fort McNair',Aesculus x carnea Fort McNair,Aesculus x carnea Fort McNair,Aesculus carnea,Aesculus,Sapindaceae,AECABR,2B
AEFL,Aesculus flava,Aesculus flava,Aesculus flava,Aesculus flava,Aesculus,Sapindaceae,AEFL,2B
AEGL,Aesculus glabra,Marronnier glabre,Ohio Buckeye,Aesculus glabra,Aesculus,Sapindaceae,AEGL,2B
AEHI,Aesculus hippocastanum,Marronnier d'Inde,Common Horsechesnut,Aesculus hippocastanum,Aesculus,Sapindaceae,AEHI,2B
AEHIBA,Aesculus hippocastanum 'Baumanii',Marronnier de Bauman,Bauman's Horsechesnut,Aesculus hippocastanum,Aesculus,Sapindaceae,AEHI,2B
AEHY,Aesculus x hybrida,Aesculus x hybrida,Aesculus x hybrida,Aesculus hippocastanum,Aesculus,Sapindaceae,AEHI,2B
AEIN,Aesculus indica,Aesculus indica,Aesculus indica,Aesculus indica,Aesculus,Sapindaceae,AEIN,2B
AEOC,Aesculus octandra,Aesculus octandra,Aesculus octandra,Aesculus octandra,Aesculus,Sapindaceae,AEOC,2B
AI,Ailanthus,Ailante,Tree-of-heaven,Ailanthus altissima,Ailanthus,Simaroubaceae,AIAL,
AIAL,Ailanthus altissima,Ailante glanduleux,Tree of Heaven,Ailanthus altissima,Ailanthus,Simaroubaceae,AIAL,
AL,Alnus,Aulne,Alder,Alnus glutinosa,Alnus,Betulaceae,ALGL,2C
ALGL,Alnus glutinosa,Aulne glutineux,European Black Alder,Alnus glutinosa,Alnus,Betulaceae,ALGL,2C
ALGLIM,Alnus glutinosa 'Imperialis',Aulne glutineux Imperialis,Imperialis European Black Alder,Alnus glutinosa,Alnus,Betulaceae,ALGL,2C
ALGLIN,Alnus glutinosa 'Incisa',Aulne glutineux Incisa,Incisa European Black Alder,Alnus glutinosa,Alnus,Betulaceae,ALGL,2C
ALGLPY,Alnus glutinosa 'Pyramidalis',Alnus glutinosa 'Pyramidalis',Alnus glutinosa 'Pyramidalis',Alnus glutinosa,Alnus,Betulaceae,ALGL,2C
ALIN,Alnus incana,Aulne blanc,Grey alder,Alnus incana,Alnus,Betulaceae,ALIN,5
ALINRU,Alnus incana ssp. rugosa,Aulne rugueux,Speckled alder,Alnus incana,Alnus,Betulaceae,ALIN,5
AM,Amelanchier,Amélanchier,Serviceberry,Amelanchier canadensis,Amelanchier,Rosaceae,AMCA,3A
AMAR,Amelanchier arborea,Amelanchier arborea,Amelanchier arborea,Amelanchier arborea,Amelanchier,Rosaceae,AMAR,3A
AMCA,Amelanchier canadensis,Amélanchier du Canada,Downy Serviceberry,Amelanchier canadensis,Amelanchier,Rosaceae,AMCA,3A
AMCABA,Amelanchier canadensis 'Ballerina',Amélanchier du Canada Ballerina,Ballerina Downy Serviceberry,Amelanchier canadensis,Amelanchier,Rosaceae,AMCA,3A
AMCARP,Amelanchier c. 'Rainbow Pillar' (Glenn Form),Amelanchier c. 'Rainbow Pillar' (Glenn Form),Amelanchier c. 'Rainbow Pillar' (Glenn Form),Amelanchier canadensis,Amelanchier,Rosaceae,AMCA,3A
AMGR,Amelanchier x grandiflora,Amélanchier à grandes fleurs,Apple Serviceberry,Amelanchier grandiflora,Amelanchier,Rosaceae,AMGR,3A
AMGRAB,Amelanchier x grandiflora 'Autumn Brillance',Amélanchier à grandes fleurs Autumn Brillance,Autumn Brillance Serviceberry,Amelanchier grandiflora,Amelanchier,Rosaceae,AMGR,3A
AMGRBA,Amelanchier x grandiflora 'Ballerina',Ballerina Serviceberry,Amelanchier Ballerina,Amelanchier grandiflora,Amelanchier,Rosaceae,AMGR,3A
AMGRPD,Amelanchier g. 'Princess Diana',Amelanchier g. 'Princess Diana',Amelanchier g. 'Princess Diana',Amelanchier grandiflora,Amelanchier,Rosaceae,AMGR,3A
AMGRRH,Amelanchier x grandiflora 'Robin Hill',Amélanchier  Robin Hill,Robin Hill Serviceberry,Amelanchier grandiflora,Amelanchier,Rosaceae,AMGR,3A
AMLA,Amelanchier laevis,Amelanchier laevis,Amelanchier laevis,Amelanchier laevis,Amelanchier,Rosaceae,AMLE,3A
AMLACU,Amelanchier laevis 'Cumulus',Amelanchier laevis Cumulus,Amelanchier laevis Cumulus,Amelanchier laevis,Amelanchier,Rosaceae,AMLE,3A
AMLAPC,Amelanchier laevis 'Prince Charles',Amelanchier laevis 'Prince Charles',Amelanchier laevis 'Prince Charles',Amelanchier laevis,Amelanchier,Rosaceae,AMLE,3A
AMLASF,Amelanchier laevis 'Spring Flurry',Amélanchier glabre Spring Flurry,Spring Flurry Serviceberry,Amelanchier laevis,Amelanchier,Rosaceae,AMLE,3A
BE,Betula,Bouleau,Birch,Betula pendula,Betula,Betulaceae,BEPE,5
BEAB,Betula alba,Betula alba,Betula alba,Betula alba,Betula,Betulaceae,BEAB,5
BEAL,Betula alleghaniensis,Bouleau jaune,Yellow Birch,Betula alleghaniensis,Betula,Betulaceae,BEAL,2C
BELE,Betula lenta,Bouleau flexible,Cherry Birch,Betula lenta,Betula,Betulaceae,BELE,3B
BENI,Betula nigra,Bouleau noir,River Birch,Betula nigra,Betula,Betulaceae,BENI,5
BENICF,Betula nigra 'Crimson Frost',Betula nigra Crimson Frost,Betula nigra Crimson Frost,Betula nigra,Betula,Betulaceae,BENI,5
BENIHE,Betula nigra 'Heritage',Bouleau noir Heritage,Heritage River Birch,Betula nigra,Betula,Betulaceae,BENI,5
BENISS,Betula nigra 'Shiloh Splash',Betula nigra 'Shiloh Splash',Betula nigra 'Shilo Splash',Betula nigra,Betula,Betulaceae,BENI,5
BEPA,Betula papyrifera,Bouleau à papier,Paper Birch,Betula papyrifera,Betula,Betulaceae,BEPA,5
BEPARR,Betula papyrifera 'Renaissance Reflection',Betula papyrifera 'Renaissance Reflection',Betula papyrifera 'Renaissance Reflection',Betula papyrifera,Betula,Betulaceae,BEPA,5
BEPE,Betula pendula,Bouleau européen,European White Birch,Betula pendula,Betula,Betulaceae,BEPE,5
BEPEFA,Betula pendula 'Fastigiata',Betula pendula 'Fastigiata',Betula pendula 'Fastigiata',Betula pendula,Betula,Betulaceae,BEPE,5
BEPEGR,Betula pendula 'Gracilis',Bouleau pleureur à feuilles laciniées,Cut-leaf Weeping Birch,Betula pendula,Betula,Betulaceae,BEPE,5
BEPEPU,Betula pendula 'Purpurea',Bouleau à feuilles pourpres,Purple Leaf Birch,Betula pendula,Betula,Betulaceae,BEPE,5
BEPETR,Betula pendula 'Tristis',Betula pendula 'Tristis',Betula pendula 'Tristis',Betula pendula,Betula,Betulaceae,BEPE,5
BEPEYO,Betula pendula 'Youngii',Bouleau pleureur de Young,Young's Weeping Birch,Betula pendula,Betula,Betulaceae,BEPE,5
BEPLWH,Betula platyphylla var. japonica 'Whitespire',Bouleau japonais Whitespire,Whitespire Japanese white birch,Betula platyphylla,Betula,Betulaceae,BEPL,
BEPO,Betula populifolia,Bouleau gris,Gray Birch,Betula populifolia,Betula,Betulaceae,BEPO,5
BEPOPU,Betula populifolia 'Purpurea',Bouleau gris Purpurea,Purpurea Gray Birch,Betula populifolia,Betula,Betulaceae,BEPO,5
BEUTJA,Betula utilis var. jacquemontii,Bouleau de l'Himalaya,Whitebarked Himalayan Birch,,,,,
CA,Carpinus,Charme,Hornbeam,,,,,
CABE,Carpinus betulus,Charme européen,European Hornbeam,Carpinus betulus,Carpinus,Betulaceae,CABE,2A
CABEFA,Carpinus betulus 'Fastigiata',Charme européen fastigié,Pyramidal European Hornbeam,Carpinus betulus,Carpinus,Betulaceae,CABE,2A
CACA,Carpinus caroliniana,Charme de Caroline,Blue-beech,Carpinus caroliniana,Carpinus,Betulaceae,CACA,2A
CC,Caragana,Caraganier,Pea Tree,Caragana arborescens,Caragana,Fabaceae,CCAR,
CCAR,Caragana arborescens,Caraganier de Sibérie,Siberian Pea Tree,Caragana arborescens,Caragana,Fabaceae,CCAR,
CCARPE,Caragana arobrescens 'Pendula',Caraganier pleureur,Weeping Pea Shrub,Caragana arborescens,Caragana,Fabaceae,CCAR,
CCARWA,Caragana arborescens 'Walker',Caraganier de Sibérie Walker,Walker Siberian Pea Tree,Caragana arborescens,Caragana,Fabaceae,CCAR,
CD,Cercidiphyllum,Cercidiphyllum,Katsura Tree,,,,,
CDJA,Cercidiphyllum japonicum,Cercidiphyllum du Japon,Katsura Tree,Cercidiphyllum japonicum,Cercidiphyllum,Cercidiphyllaceae,CEJA,5
CDJARF,Cercidiphyllum japonicum 'Red Fox',arbre de Katsura Red Fox,Red Fox Katsura tree,Cercidiphyllum japonicum,Cercidiphyllum,Cercidiphyllaceae,CEJA,5
CE,Celtis,Micocoulier,Hackberry,,,,,
CEOC,Celtis occidentalis,Micocoulier occidental,Common Hackberry,Celtis occidentalis,Celtis,Cannabaceae,CEOC,2C
CEOCPP,Celtis occidentalis Prairie Pride,micocoulier Prairie Pride,Prairie Pride common Hackberry,Celtis occidentalis,Celtis,Cannabaceae,CEOC,2C
CEOCPS,Celtis occidentalis 'Prairie Sentinel',Celtis occidentalis 'Prairie Sentinel',Celtis occidentalis 'Prairie Sentinel',Celtis occidentalis,Celtis,Cannabaceae,CEOC,2C
CG,Crataegus,Aubépine,Hawthorn,Crataegus mordenensis,Crataegus,Rosaceae,CRMO,3A
CGCA,Crataegus canadensis,Crataegus canadensis,Crataegus canadensis,Crataegus canadensis,Crataegus,Rosaceae,CGCA,3A
CGCG,Crataegus crus-galli,Crataegus crus-galli,Crataegus crus-galli,Crataegus crus-galli,Crataegus,Rosaceae,CRCG,3A
CGCGIN,Crataegus crus-galli inermis,Aubépine crus-galli inerme,Crus-galli Hawthorn,Crataegus crus-galli,Crataegus,Rosaceae,CRCG,3A
CGLACC,Crataegus laevigata 'Crimson Cloud',Crataegus laevigata 'Crimson Cloud',Crataegus laevigata 'Crimson Cloud',Crataegus laevigata,Crataegus,Rosaceae,CRLA,3A
CGMO,Crataegus x mordensis,Aubépine mordensis,Hawthorn,Crataegus mordenensis,Crataegus,Rosaceae,CRMO,3A
CGMOSN,Crataegus x mordenensis 'Snowbird',Aubépine mordenensis Snowbird,Snowbird Hawthorn,Crataegus mordenensis,Crataegus,Rosaceae,CRMO,3A
CGMOTO,Crataegus x mordenensis 'Toba',Aubépine mordenensis Toba,Toba Hawthorn,Crataegus mordenensis,Crataegus,Rosaceae,CRMO,3A
CGOXPS,Crataegus x oxyacantha 'Paul Scarlet',Crataegus x oxyacantha Paul Scarlet,Crataegus x oxyacantha Paul Scarlet,,,,,
CGPH,Crataegus phaenopyrum,Aubépine Washington,Washington Hawthorn,Crataegus phaenopyrum,Crataegus,Rosaceae,CGPH,3A
CH,Chamaecyparis,Chamaecyparis,False Cypress,Chamaecyparis nootkatensis,Chamaecyparis,Cupressaceae,CHNO,1A
CHNO,Chamaecyparis nootkatensis,Chamaecyparis jaune,Nootka False Cypress,Chamaecyparis nootkatensis,Chamaecyparis,Cupressaceae,CHNO,1A
CICA,Cercis canadensis,Cercis canadensis,Cercis canadensis,Cercis canadensis,Cercis,Fabaceae,CICA,4B
CICAFP,Cercis canadensis 'Forest Pansy',Gainier du Canada 'Forest Pansy',Forest Pansy' Redbud,Cercis canadensis,Cercis,Fabaceae,CICA,4B
CL,Cladrastis,Virgilier,Yellow-wood,Cladrastis sp.,,,CL,
CLKE,Cladastris kentukea,"Virgilier, Virgilier à bois jaune",American Yellowwood,Cladrastis kentukea,,,CLKE,
CLLU,Cladastris lutea,Virgilier à bois jaune,American Yellow-wood,Cladrastis lutea,,,CLLU,
CLTI,Cladastris tinctoria,Cladastris tinctoria,Cladastris tinctoria,Cladrastis tinctoria,,,CLTI,
CN,Cornus,Cornouiller,Dogwood,Cornus sp.,,,,
CNAL,Cornus alternifolia,Cornouiller à feuilles alternes,Alternate-leaf Dogwood,Cornus alternifolia,Cornus,Cornaceae,CNAL,2A
CNST,Cornus stolonifera,Cornouiller stolonifère,Red-osier Dogwood,Cornus stolonifera,Cornus,Cornaceae,CNST,2A
CO,Corylus,Noisetier,Hazel,Corylus colurna,Corylus,Betulaceae,COCO,4A
COCO,Corylus colurna,Noisetier de Byzance,Turkish Filbert,Corylus colurna,Corylus,Betulaceae,COCO,4A
CR,Carya,Caryer,Hickory,Carya sp.,,,,
CRCO,Carya cordiformis,Caryer cordiforme,Bitternut Hickory,Carya cordiformis,Carya,Juglandaceae,CACO,4A
CROV,Carya ovata,Caryer ovale,Shagbark Hickory,Carya ovata,Carya,Juglandaceae,CAOV,4A
CS,Castanea,Châtaignier,Chesnut,Castanea,Castanea,Fagaceae,,
CT,Catalpa,Catalpa,Catalpa,Catalpa speciosa,Catalpa,Bignoniaceae,CTSP,3B
CTBINA,Catalpa bignonioides 'Nana',Catalpa parasol,Umbrella catalpa,Catalpa bignonioides,Catalpa,Bignoniaceae,CTBI,3B
CTSP,Catalpa speciosa,Catalpa de l'Ouest,Western Catalpa,Catalpa speciosa,Catalpa,Bignoniaceae,CTSP,3B
EL,Elaeagnus,Chalef,Russian Olive,Elaeagnus sp.,,,,
ELAN,Elaeagnus angustifolia,Olivier de Bohème,Russian Olive,Elaeagnus angustifolia,Elaeagnus,Elaeagnaceae,ELAU,4B
ELANVT,Elaeagnus angustifolia 'Velvet Touch',Elaeagnus angustifolia 'Velvet Touch',Elaeagnus angustifolia 'Velvet Touch',Elaeagnus angustifolia,Elaeagnus,Elaeagnaceae,ELAU,4B
EUUL,Eucommia ulmoides,Arbre à gomme,Hardy Rubber Tree,Eucommia ulmoides,Eucommia,Eucommiaceae,EUUL,
FA,Fagus,Hêtre,Beech,Fagus grandifolia,Fagus,Fagaceae,FAGR,2A
FAGR,Fagus grandifolia,Hêtre à grandes feuilles,American Beech,Fagus grandifolia,Fagus,Fagaceae,FAGR,2A
FASY,Fagus sylvatica,Hêtre européen,European Beech,Fagus sylvatica,Fagus,Fagaceae,FASY,2A
FASYDA,Fagus sylvatica 'Dawyck',Fagus sylvatica 'Dawyck',Fagus sylvatica 'Dawyck',Fagus sylvatica,Fagus,Fagaceae,FASY,2A
FASYDG,Fagus sylvatica 'Dawyck Gold',Fagus sylvatica 'Dawyck Gold',Fagus sylvatica 'Dawyck Gold',Fagus sylvatica,Fagus,Fagaceae,FASY,2A
FASYDP,Fagus sylvatica 'Dawyck Purple',Fagus sylvatica 'Dawyck Purple',Fagus sylvatica 'Dawyck Purple',Fagus sylvatica,Fagus,Fagaceae,FASY,2A
FASYPP,Fagus sylvatica 'Purpurea Pendula',Hêtre européen Purpurea Pendula,Purpurea Pendula European Beech,Fagus sylvatica,Fagus,Fagaceae,FASY,2A
FASYPU,Fagus sylvatica 'Purpurea',Hêtre européen purpurea,Purpurea European Beech,Fagus sylvatica,Fagus,Fagaceae,FASY,2A
FASYRO,Fagus sylvatica 'Red Obelisk',Hêtre européen 'Red Obelisk',Red Obelisk European beech,Fagus sylvatica,Fagus,Fagaceae,FASY,2A
FASYTR,Fagus sylvatica 'Tricolor',Hêtre pourpre européen 'Tricolor',Tricolor European beech,Fagus sylvatica,Fagus,Fagaceae,FASY,2A
FR,Fraxinus,Frêne,Ash,Fraxinus pennsylvanica,Fraxinus,Oleaceae,FRPE,2C
FRAM,Fraxinus americana,Frêne d'Amérique,White Ash,Fraxinus americana,Fraxinus,Oleaceae,FRAM,2C
FRAMAP,Fraxinus americana 'Autumn Purple',Frêne d'Amérique Autumn Puple,Autumn Purple Ash,Fraxinus americana,Fraxinus,Oleaceae,FRAM,2C
FRAMCI,Fraxinus a. Cimarron,Fraxinus a. Cimarron,Fraxinus a. Cimarron,Fraxinus americana,Fraxinus,Oleaceae,FRAM,2C
FRAMJU,Fraxinus americana 'Juglandifolia',Frêne d'Amérique' 'Juglandifolia',Juglandifolia' White Ash,Fraxinus americana,Fraxinus,Oleaceae,FRAM,2C
FRAMKL,Fraxinus americana 'Kleinberg',Frêne d'Amérique Kleinberg,Kleinberg White Ash,Fraxinus americana,Fraxinus,Oleaceae,FRAM,2C
FRAMMA,Fraxinus americana 'Manitou',Frêne d'Amérique Manitou,Manitou White Ash,Fraxinus americana,Fraxinus,Oleaceae,FRAM,2C
FRAMNB,Fraxinus americana 'Northern Blaze',Frêne d'Amérique Northern Blaze,Northern Blaze White Ash,Fraxinus americana,Fraxinus,Oleaceae,FRAM,2C
FRAMSK,Fraxinus americana 'Skyline',Frêne d'Amérique Skyline,Skyline White Ash,Fraxinus americana,Fraxinus,Oleaceae,FRAM,2C
FRAMWC,Fraxinus americana 'Windy City',Fraxinus americana Windy City,Fraxinus americana Windy City,Fraxinus americana,Fraxinus,Oleaceae,FRAM,2C
FRANOX,Fraxinus angustifolia ssp. oxycarpa,Fraxinus angustifolia ssp. oxycarpa,Fraxinus angustifolia ssp. oxycarpa,Fraxinus angustifolia,Fraxinus,Oleaceae,FRANOX,2C
FRANRA,Fraxinus angustifolia 'Raywood',Frêne à feuilles étroites 'Raywood',Raywood' Narrow-leaved ash,Fraxinus angustifolia,Fraxinus,Oleaceae,FRANOX,2C
FRANSY,Fraxinus angustifolia ssp. syriaca,Fraxinus angustifolia ssp. syriaca,Fraxinus angustifolia ssp. syriaca,Fraxinus angustifolia,Fraxinus,Oleaceae,FRANOX,2C
FRBU,Fraxinus bungeana,Fraxinus bungeana,Fraxinus bungeana,Fraxinus bungeana,Fraxinus,Oleaceae,FRBU,2C
FRCH,Fraxinus chinensis,Fraxinus chinensis,Fraxinus chinensis,Fraxinus chinensis,Fraxinus,Oleaceae,FRCH,2C
FRCHRH,Fraxinus chinensis ssp. rynchophylla,Fraxinus chinensis ssp. rynchophylla,Fraxinus chinensis ssp. rynchophylla,Fraxinus chinensis,Fraxinus,Oleaceae,FRCH,2C
FREX,Fraxinus excelsior,Frêne d'Europe,European Ash,Fraxinus excelsior,Fraxinus,Oleaceae,FREX,2C
FREXAU,Fraxinus excelsior 'Aurefolia',Fraxinus excelsior Aurefolia,Fraxinus excelsior Aurefolia,Fraxinus excelsior,Fraxinus,Oleaceae,FREX,2C
FREXDI,Fraxinus excelsior 'Diversifolia',Frêne d'Europe 'Diversifolia',European ash excelsior Diversifolia,Fraxinus excelsior,Fraxinus,Oleaceae,FREX,2C
FREXDO,Fraxinus excelsior 'Doorenbos',Frêne européen 'Doorenbos',Eurppean ash excelsior Doorenbos,Fraxinus excelsior,Fraxinus,Oleaceae,FREX,2C
FREXEU,Fraxinus excelsior 'Eureka',Frêne européen 'Eureka',European ash 'Eureka',Fraxinus excelsior,Fraxinus,Oleaceae,FREX,2C
FREXHE,Fraxinus excelsior 'Hessei',Frêne européen 'Hessei',European ash 'Hessei',Fraxinus excelsior,Fraxinus,Oleaceae,FREX,2C
FREXKI,Fraxinus excelsior 'Kimberly',Frêne européen 'Kimberly',European ash 'Kimberly',Fraxinus excelsior,Fraxinus,Oleaceae,FREX,2C
FRGR,Fraxinus griffithii,Frêne de Griffith,Griffith's ash,Fraxinus griffithii,Fraxinus,Oleaceae,FRGR,2C
FRIN,Fraxinus insularis,Fraxinus insularis,Fraxinus insularis,Fraxinus insularis,Fraxinus,Oleaceae,FRIN,2C
FRLO,Fraxinus longicuspis,Fraxinus longicuspis,Fraxinus longicuspis,Fraxinus longicuspis,Fraxinus,Oleaceae,FRLO,2C
FRMN,Fraxinus mandshurica,Fraxinus mandshurica,Fraxinus mandshurica,Fraxinus mandshurica,Fraxinus,Oleaceae,FRMA,2C
FRMNMA,Fraxinus mandshurica 'Mancana',Fraxinus mandshurica Mancana,Fraxinus mandshurica Mancana,Fraxinus mandshurica,Fraxinus,Oleaceae,FRMA,2C
FRNI,Fraxinus nigra,Frêne noir,Black Ash,Fraxinus nigra,Fraxinus,Oleaceae,FRNI,2C
FRNIFG,Fraxinus nigra 'Fall Gold',Frêne noir Fall Gold,Fall Gold Black Ash,Fraxinus nigra,Fraxinus,Oleaceae,FRNI,2C
FRNINT,Fraxinus nigra 'Northern Treasure',Frêne noir Northern Treasure,Northern Treasure Black Ash,Fraxinus nigra,Fraxinus,Oleaceae,FRNI,2C
FROR,Fraxinus ornus,Frêne à fleurs,Flowering ash,Fraxinus ornus,Fraxinus,Oleaceae,FROR,2C
FRPA,Fraxinus pallisiae,Frêne des Balkans,Pallis' ash,Fraxinus pallisae,Fraxinus,Oleaceae,FRPA,2C
FRPE,Fraxinus pennsylvanica,Frêne de Pennsylvanie,Red Ash,Fraxinus pennsylvanica,Fraxinus,Oleaceae,FRPE,2C
FRPEAU,Fraxinus pennsylvanica 'Aucubifolia',Frêne rouge 'Acubifolia',Red ash 'Acubifolia',Fraxinus pennsylvanica,Fraxinus,Oleaceae,FRPE,2C
FRPEBE,Fraxinus pennsylvanica 'Bergeson',Frêne de Pennsylvanie Bergeson,Bergeson Red ash,Fraxinus pennsylvanica,Fraxinus,Oleaceae,FRPE,2C
FRPECI,Fraxinus pennsylvanica 'Cimmzam' (Cimmaron),Frêne de Pennsylvanie 'Cimmzam' (Cimmaron),Cimmzam (Cimmaron) Red Ash,Fraxinus pennsylvanica,Fraxinus,Oleaceae,FRPE,2C
FRPEHA,Fraxinus pennsylvanica 'Harlequin',Frêne de Pennsylvanie Harlequin,Harlequin Red Ash,Fraxinus pennsylvanica,Fraxinus,Oleaceae,FRPE,2C
FRPEJO,Fraxinus pennsylvanica 'Johnson',Frêne de Pennsylvanie Johnson,Johnson Red Ash,Fraxinus pennsylvanica,Fraxinus,Oleaceae,FRPE,2C
FRPEMS,Fraxinus pennsylvanica 'Marshall Seedless',Frêne de Pennsylvanie Marshall Seedless,Marshall Seedless Red Ash,Fraxinus pennsylvanica,Fraxinus,Oleaceae,FRPE,2C
FRPEPA,Fraxinus pennsylvanica 'Patmore',Frêne de Pennsylvanie Patmore,Patmore Red Ash,Fraxinus pennsylvanica,Fraxinus,Oleaceae,FRPE,2C
FRPEPS,Fraxinus pennsylvanica 'Prairies Spires',Frêne de Pennsylvanie Prairies Spires,Prairies Spires Red Ash,Fraxinus pennsylvanica,Fraxinus,Oleaceae,FRPE,2C
FRPESB,Fraxinus pennsylvanica 'subintergerrima',Fraxinus p. 'subintergerrima',Fraxinus p. 'subintergerrima',Fraxinus pennsylvanica,Fraxinus,Oleaceae,FRPE,2C
FRPESP,Fraxinus pennsylvanica 'Superform',Fraxinus pennsylvanica Superform,Fraxinus pennsylvanica Superform,Fraxinus pennsylvanica,Fraxinus,Oleaceae,FRPE,2C
FRPESU,Fraxinus pennsylvanica 'Summit',Frêne de Pennsylvanie Summit,Summit Red Ash,Fraxinus pennsylvanica,Fraxinus,Oleaceae,FRPE,2C
FRPEUR,Fraxinus pennsylvanica 'Urbanite',Fraxinus pennsylvanica Urbanite,Fraxinus pennsylvanica Urbanite,Fraxinus pennsylvanica,Fraxinus,Oleaceae,FRPE,2C
FRPEWA,Fraxinus pennsylvanica 'Warverley',Frêne rouge 'Warverley',Red ash 'Warverley',Fraxinus pennsylvanica,Fraxinus,Oleaceae,FRPE,2C
FRPR,Fraxinus profunda,Frêne pubescent,Pumpkin ash,Fraxinus profunda,Fraxinus,Oleaceae,FRPR,2C
FRQU,Fraxinus quadrangulata,Fraxinus quadrangulata,Fraxinus quadrangulata,Fraxinus quadrangulata,Fraxinus,Oleaceae,FRQU,3B
FRSI,Fraxinus sieboldiana,Frêne de Siebold,Siebold ash,Fraxinus sieboldiana,Fraxinus,Oleaceae,FRSI,2C
FRSO,Fraxinus sogdiana,Fraxinus sogdiana,Fraxinus sogdiana,Fraxinus sogdiana,Fraxinus,Oleaceae,FRSO,2C
FRST,Fraxinus stylosa,Fraxinus stylosa,Fraxinus stylosa,Fraxinus stylosa,Fraxinus,Oleaceae,FRST,2C
FRVE,Fraxinus velutina,Fraxinus velutina,Fraxinus velutina,Fraxinus velutina,Fraxinus,Oleaceae,FRVE,3B
FRXXNG,Fraxinus x 'Northern Gem',Fraxinus x Northern Gem,Fraxinus x Northern Gem,Fraxinus x 'Northern Gem',Fraxinus,Oleaceae,FRXXNG,2C
FRXXNT,Fraxinus x 'Northern Treasure',Fraxinus x Northern Treasure,Fraxinus x Northern Treasure,,,,,
GI,Ginkgo,Ginkgo,Maidenhair Tree,Ginkgo sp.,,,,
GIBI,Ginkgo biloba,Ginkgo à feuilles bilobées,Maidenhair Tree,Ginkgo biloba,Ginkgo,Ginkgoaceae,GIBI,1B
GIBIAG,Ginkgo biloba 'Autumn Gold',Ginkgo à feuilles bilobées Autumn Gold,Autumn Gold Maidenhair Tree,Ginkgo biloba,Ginkgo,Ginkgoaceae,GIBI,1B
GIBIFA,Ginkgo biloba 'Fastigiata',Ginkgo Fastigiata,Fastigiata MAidenhair tree,Ginkgo biloba,Ginkgo,Ginkgoaceae,GIBI,1B
GIBIMA,Ginkgo biloba mâle,Ginkgo biloba mâle,Ginkgo biloba mâle,Ginkgo biloba,Ginkgo,Ginkgoaceae,GIBI,1B
GIBIMG,Ginkgo biloba ''Magyar'',Ginkgo biloba Magyar,Ginkgo biloba Magyar,Ginkgo biloba,Ginkgo,Ginkgoaceae,GIBI,1B
GIBIPE,Ginkgo biloba 'Pendula',Ginkgo à feuilles bilobées Pendula,Pendula Maidenhair Tree,Ginkgo biloba,Ginkgo,Ginkgoaceae,GIBI,1B
GIBIPS,Ginkgo biloba 'Princeton Sentry',Ginkgo à feuilles bilobées Princeton Sentry,Princeton Sentry Maidenhair Tree,Ginkgo biloba,Ginkgo,Ginkgoaceae,GIBI,1B
GIBIWO,Ginkgo biloba '''Woodstock'' (Emperor TM),Ginkgo biloba ''Woodstock'' (Emperor TM),Ginkgo biloba ''Woodstock'' (Emperor TM),Ginkgo biloba,Ginkgo,Ginkgoaceae,GIBI,1B
GL,Gleditsia,Févier,Honey-Locust,Gleditsia sp.,,,,
GLTR,Gleditsia triacanthos,Févier d'Amérique,Common Honey-Locust,Gleditsia triacanthos,Gleditsia,Fabaceae,GLTR,4B
GLTREL,Gleditsia triacanthos 'Elegantissima',Févier Elegantissima,Elegantissima Honey Locust,Gleditsia triacanthos,Gleditsia,Fabaceae,GLTR,4B
GLTRHA,Gleditsia triacanthos 'Halka',Févier Halka,Halka Honey-Locust,Gleditsia triacanthos,Gleditsia,Fabaceae,GLTR,4B
GLTRIM,Gleditsia triacanthos 'Imperial',Févier Imperial,Imperial Honey-Locust,Gleditsia triacanthos,Gleditsia,Fabaceae,GLTR,4B
GLTRIN,Gleditsia triacanthos var. inermis,Févier inerme d'Amérique,Thornless Honey-Locust,Gleditsia triacanthos,Gleditsia,Fabaceae,GLTR,4B
GLTRMO,Gleditsia triacanthos 'Moraine',Févier Moraine,Moraine Honey-Locust,Gleditsia triacanthos,Gleditsia,Fabaceae,GLTR,4B
GLTRNA,Gleditsia triacanthos 'Northern Acclaim',Févier 'Northern Acclaim',Northern Acclaim,Gleditsia triacanthos,Gleditsia,Fabaceae,GLTR,4B
GLTRPS,Gleditsia triacanthos 'Prairie Silk',Gleditsia triacanthos Prairie Silk,Gleditsia triacanthos Prairie Silk,Gleditsia triacanthos,Gleditsia,Fabaceae,GLTR,4B
GLTRRU,Gleditsia triacanthos 'Rubylace',Févier Rubylace,Rubylace Honey-Locust,Gleditsia triacanthos,Gleditsia,Fabaceae,GLTR,4B
GLTRSH,Gleditsia triacanthos 'Shademaster',Févier Shademaster,Shademaster Honey-Locust,Gleditsia triacanthos,Gleditsia,Fabaceae,GLTR,4B
GLTRSK,Gleditsia triacanthos 'Skyline',Févier Skyline,Skyline Honey-Locust,Gleditsia triacanthos,Gleditsia,Fabaceae,GLTR,4B
GLTRSP,Gleditsia triacanthos 'Spectrum',Févier Spectrum,Spectrum Honey-Locust,Gleditsia triacanthos,Gleditsia,Fabaceae,GLTR,4B
GLTRST,Gleditsia triacanthos 'Street Keeper',Gleditsia triacanthos 'Street Keeper',Gleditsia triacanthos 'Street Keeper',Gleditsia triacanthos,Gleditsia,Fabaceae,GLTR,4B
GLTRSU,Gleditsia triacanthos 'Sunburst',Févier Sunburst,Sunburst Honey-Locust,Gleditsia triacanthos,Gleditsia,Fabaceae,GLTR,4B
GY,Gymnocladus,Chicot,Coffee Tree,Gymnocladus sp.,,,,
GYDI,Gymnocladus dioicus,Chicot du Canada,Kentucky Coffee Tree,Gymnocladus dioicus,Gymnocladus,Fabaceae,GYDI,4B
GYDIES,Gymnocladus dioicus 'Espresso',Gymnocladus dioicus 'Espresso',Gymnocladus dioicus 'Espresso',Gymnocladus dioicus,Gymnocladus,Fabaceae,GYDI,4B
GYDISM,Gymnocladus dioicus 'Stately Manor',Chicot du Canada 'Stately Manor',Stately Manor Kentucky Coffeetree,Gymnocladus dioicus,Gymnocladus,Fabaceae,GYDI,4B
HEMI,Heptacodium miconioides,Heptacodium miconioides,Seven-son flower,Heptacodium miconioides,,,HEMI,
JN,Juniperus,Génévrier,Juniper,Juniperus virginiana,Juniperus,Cupressaceae,JUVI,1B
JNVI,Juniperus virginiana,Genévrier de Virginie,Eastern Red Cedar,Juniperus virginiana,Juniperus,Cupressaceae,JUVI,1B
JNVISK,Juniperus virginiana 'Skyrocket',Genévrier de Virginie Skyrocket,Skyrocket Juniper,Juniperus virginiana,Juniperus,Cupressaceae,JUVI,1B
JU,Juglans,Noyer,"Walnut, Butternut",Juglans sp.,,,,
JUAI,Juglans ailantifolia var. cordiformis,Juglans ailantifolia var. cordiformis,Juglans ailantifolia var. cordiformis,Juglans ailantifolia,Juglans,Juglandaceae,JUAI,4B
JUCI,Juglans cinerea,Noyer cendré,Butternut,Juglans cinerea,Juglans,Juglandaceae,JUCI,4A
JUMA,Juglans mandschurica,Juglans mandschurica,Juglans mandschurica,Juglans mandshurica,Juglans,Juglandaceae,JUMA,4B
JUNI,Juglans nigra,Noyer noir,Eastern Black Walnut,Juglans nigra,Juglans,Juglandaceae,JUNI,4A
JURE,Juglans regia,Noyer royal,English Walnut,Juglans regia,Juglans,Juglandaceae,JURE,4A
LA,Larix,Mélèze,Larch,Larix decidua,Larix,Pinaceae,LADE,1B
LADE,Larix decidua,Mélèze d'Europe,European Larch,Larix decidua,Larix,Pinaceae,LADE,1B
LADEPE,Larix decidua 'Pendula',Mélèze d'Europe pleureur,Weeping European Larch,Larix decidua,Larix,Pinaceae,LADE,1B
LAKA,Larix kaempferi,Mélèze du Japon,Japanese Larch,Larix kaempferi,Larix,Pinaceae,LAKA,1B
LAKABR,Larix kaempferi 'Blue Rabbit',Larix kaempferi 'Blue Rabbit',Larix kaempferi 'Blue Rabbit',Larix kaempferi,Larix,Pinaceae,LAKA,1B
LAKAJP,Larix kaempferi Jacobsen's Pyramid,mélèze du Japon Jacobsen's Pyramid,Jacobsen's Pyramid Japanese larch,Larix kaempferi,Larix,Pinaceae,LAKA,1B
LALA,Larix laricina,Mélèze laricin,Tamarack,Larix laricina,Larix,Pinaceae,LALA,1B
LALEDE,Larix leptolepis x decidua,Larix leptolepis x decidua,Larix leptolepis x decidua,,,,,
LI,Liriodendron,Tulipier,Tulip Tree,,,,,
LITU,Liriodendron tulipifera,Tulipier de Virginie,Tulip Tree,Liriodendron tulipifera,Liriodendron,Magnoliaceae,LITU,3B
LQSTMO,Liquidambar styraciflua 'Moraine',Liquidambar 'Moraine',Moraine Sweetgum,Liquidambar styraciflua,,,LQST,
MA,Malus,Pommier,Crab Apple,Malus spp,Malus,Rosaceae,MA,3B
MAAN,Malus antanovka,Malus antanovka,Malus antanovka,Malus antonovka,Malus,Rosaceae,MAAN,3B
MABA,Malus baccata,Pommetier de Sibérie,Siberian Crab Apple,Malus baccata,Malus,Rosaceae,MABA,3B
MABACO,Malus baccata 'Columnaris',Pommetier de Sibérie colonnaire,Columnar Siberian Crab Apple,Malus baccata,Malus,Rosaceae,MABA,3B
MABAER,Malus baccata 'Erecta',Pommetier de Sibérie erecta,Erecta Siberian Crab Apple,Malus baccata,Malus,Rosaceae,MABA,3B
MABAJA,Malus baccata 'Jackii',Malus baccata 'Jackii',Malus baccata 'Jackii',Malus baccata,Malus,Rosaceae,MABA,3B
MABAMN,Malus baccata 'Mandshurica',Pommetier Mandshurica,Mandshurica Crab Apple,Malus baccata,Malus,Rosaceae,MABA,3B
MABARH,Malus baccata 'Rosthern',Pommetier Rosthern,Rosthern Crab Apple,Malus baccata,Malus,Rosaceae,MABA,3B
MACO,Malus coronaria,Pommetier odorant,Wild Crab Apple,Malus coronaria,Malus,Rosaceae,MACO,3B
MADOEM,Malus domestica 'Empire',Pommier Empire,Malus domestica 'Empire',Malus domestica,Malus,Rosaceae,MADOEM,3B
MAIO,Malus ioensis,Pommetier de Bechtel,Bechtel Crab Apple,Malus ioensis,Malus,Rosaceae,MAIO,3B
MAIOPL,Malus ionensis 'Plena',Pommetier de l'Iowa,Plena Bechtel Crab Apple,Malus ioensis,Malus,Rosaceae,MAIO,3B
MAPRRI,Malus prunifolia 'Rinki',Pommetier Rinki,Rinki Plum-leaved Crab Apple,Malus prunifolia,Malus,Rosaceae,MAPRRI,3B
MAROER,Malus robusta 'Erecta',Pommetier Erecta,Nom anglais,,,,,
MASA,Malus sargentii,Pommetier de Sargent,Sargent's Crab Apple,Malus sargentii,Malus,Rosaceae,MASA,3B
MAXDU,Malus x adstringens 'Durleo' (Gladiator TM),Malus x adstringens 'Durleo',Malus x adstringens 'Durleo',,,,,
MAXXAA,Malus 'Adams',Pommetier 'Adams',Adams crabapple,,,,,
MAXXAD,Malus x 'Adirondack',Malus x Adirondack,Malus x Adirondack,,,,,
MAXXAL,Malus x 'Almey',Pommetier Almey,Almey Crab Apple,Malus spp,Malus,Rosaceae,MA,3B
MAXXBE,Malus x domestica 'Belmac',Malus x domestica 'Belmac',Malus x domestica 'Belmac',Malus domestica,Malus,Rosaceae,MADOEM,3B
MAXXBR,Malus x Brandywine®,Pommetier Brandywine®,Brandywine® Crab Apple,,,,,
MAXXCE,Malus x Centurion®,Pommetier Centurion®,Centurion® Crab Apple,Malus spp,Malus,Rosaceae,MA,3B
MAXXDO,Malus x 'Dolgo',Pommetier Dolgo,Dolgo Crab Apple,,,,,
MAXXDR,Malus x DreamWeaver (TM),Pommetier colonnaire 'DreamWeaver',DreamWeaver columnar Crabapple,,,,,
MAXXFR,Malus x domestica 'Freedom',Malus x domestica 'Freedom',Malus x domestica 'Freedom',Malus domestica,Malus,Rosaceae,MADOEM,3B
MAXXGR,Malus x 'Golden Raindrop',Malus x 'Golden Raindrop',Malus x 'Golden Raindrop',Malus spp,Malus,Rosaceae,MA,3B
MAXXHG,Malus x 'Harvest Gold'¿,Pommetier Harvest Gold TM,Harvest Gold TM Crab Apple,Malus spp,Malus,Rosaceae,MA,3B
MAXXHO,Malus x 'Hopa',Pommetier Hopa,Hopa Crab Apple,Malus spp,Malus,Rosaceae,MA,3B
MAXXIM,Malus x 'Indian Magic',Pommetier Indian Magic,Indian Magic Crab Apple,Malus spp,Malus,Rosaceae,MA,3B
MAXXIS,Malus x 'Indian Summer',Pommetier Indian Summer,Indian Summer Crab Apple,Malus spp,Malus,Rosaceae,MA,3B
MAXXJE,Malus x 'Jefspire' (Purple Spire TM),Malus x 'Jefspire',Malus x 'Jefspire',Malus spp,Malus,Rosaceae,MA,3B
MAXXKE,Malus x 'Kelsey',Pommetier Kelsey,Kelsey Carbapple,Malus spp,Malus,Rosaceae,MA,3B
MAXXKL,Malus x 'Klem's',Malus Klem's,Malus Klem's,Malus spp,Malus,Rosaceae,MA,3B
MAXXLI,Malus x 'Liset',Malus x 'Liset',Malus x 'Liset',Malus spp,Malus,Rosaceae,MA,3B
MAXXLO,Malus x 'Lollizam' (Lollipop TM),Pommetier Lollipop,Lollipop Crabapple,Malus spp,Malus,Rosaceae,MA,3B
MAXXMA,Malus x 'Makamik',Pommetier Makamik,Makamik Crab Apple,Malus spp,Malus,Rosaceae,MA,3B
MAXXMB,Malus x 'Maybride',Pommetier Maybride,Maybride Crab Apple,Malus spp,Malus,Rosaceae,MA,3B
MAXXMC,Malus x 'MacIntosh',Malus MacIntosh,Malus MacIntosh,Malus spp,Malus,Rosaceae,MA,3B
MAXXMD,Malus x 'Madonna',Pommetier Madonna,Madonna Crab Apple,Malus spp,Malus,Rosaceae,MA,3B
MAXXMY,Malus x 'Maypole',Pommetier Maypole Colonade,Columnar apple MAypole,Malus spp,Malus,Rosaceae,MA,3B
MAXXPA,Malus x 'Prairifire',Pommetier Prairifire,Prairifire Crab Apple,Malus spp,Malus,Rosaceae,MA,3B
MAXXPP,Malus 'Pink Perfection',Malus 'Pink Perfection',Malus 'Pink Perfection',Malus spp,Malus,Rosaceae,MA,3B
MAXXPR,Malus x 'Profusion',Pommetier Profusion,Profusion Crab Apple,Malus spp,Malus,Rosaceae,MA,3B
MAXXPS,Malus x 'Pink Spires',Pommetier Pink Spires,Pink Spires Crab Apple,Malus spp,Malus,Rosaceae,MA,3B
MAXXPW,Malus x 'Purple Wave',Malus x 'Purple Wave',Malus x 'Purple Wave',Malus spp,Malus,Rosaceae,MA,3B
MAXXRA,Malus x 'Radiant',Pommetier Radiant,Radiant Crab Apple,Malus spp,Malus,Rosaceae,MA,3B
MAXXRB,Malus x 'Robinson',Pommetier Robinson,Robinson Crab Apple,Malus spp,Malus,Rosaceae,MA,3B
MAXXRI,Malus x Richelieu,pommier Richelieu,apple Richelieu,Malus spp,Malus,Rosaceae,MA,3B
MAXXRJ,Malus x 'Red Jade',Pommetier Red Jade,Red Jad Crab Apple,Malus spp,Malus,Rosaceae,MA,3B
MAXXRL,Malus 'Royal Splendor',Malus 'Royal Splendor',Malus 'Royal Splendor',Malus spp,Malus,Rosaceae,MA,3B
MAXXRO,Malus x 'Royalty',Pommetier Royalty,Royalty Crab Apple,Malus spp,Malus,Rosaceae,MA,3B
MAXXRP,Malus x 'Red Splendor',Malus x 'Red Splendor',Malus x 'Red Splendor',Malus spp,Malus,Rosaceae,MA,3B
MAXXRR,Malus x 'Royal Raindrop',Malus x 'Royal Raindrop',Malus x 'Royal Raindrop.,Malus spp,Malus,Rosaceae,MA,3B
MAXXRS,Malus x 'Rosseau',Pommetier Rosseau,Rosseau Crab Apple,Malus spp,Malus,Rosaceae,MA,3B
MAXXRU,Malus x 'Rudolph',Malus Rudolph,Malus Rudolph,Malus spp,Malus,Rosaceae,MA,3B
MAXXSC,Malus x 'Scarlet' (Brandy Wine TM),Malus Scarlet (Brandy Wine),Malus Scarlet (Brandy Wine),Malus spp,Malus,Rosaceae,MA,3B
MAXXSG,Malus x 'Sugar Tyme',Malus Sugar Tyme,Malus Sugar Tyme,Malus spp,Malus,Rosaceae,MA,3B
MAXXSK,Malus x 'Selkirk',Malus Selkirk,Malus Selkirk,Malus spp,Malus,Rosaceae,MA,3B
MAXXSN,Malus x 'Snowcloud',Pommetier Snowcloud,Snowcloud Crab Apple,Malus spp,Malus,Rosaceae,MA,3B
MAXXSO,Malus x 'Snowdrift',Pommetier Snowdrift,Snowdrift Crabapple,Malus spp,Malus,Rosaceae,MA,3B
MAXXSS,Malus x 'Spring Snow',Malus Spring Snow,Malus Spring Snow,Malus spp,Malus,Rosaceae,MA,3B
MAXXST,Malus x 'Strathmore',Pommetier Strathmore,Strathmore Crab Apple,Malus spp,Malus,Rosaceae,MA,3B
MAXXTH,Malus x 'Thunderchild',Pommetier Thunderchild,Thunderchild Crab Apple,Malus spp,Malus,Rosaceae,MA,3B
MAXXVP,Malus x 'Velvet Pillar',Pommetier Velvet Pillar,Velvet Pillar Crab Apple,Malus spp,Malus,Rosaceae,MA,3B
MAXXWA,Malus 'White Angel',Malus 'White Angel',Malus 'White Angel',Malus spp,Malus,Rosaceae,MA,3B
MAXXWG,Malus x 'Winter Gold',Pommetier Winter Gold,Winter Gold Crab Apple,Malus spp,Malus,Rosaceae,MA,3B
MAXXWS,Malus x 'White Splendor',Pommetier White Splendor,White Splendor Crab Apple,Malus spp,Malus,Rosaceae,MA,3B
MC,Maackia,Maackie,Maackia,Maackia amurensis,Maackia,Fabaceae,MAAM,3B
MCAM,Maackia amurensis,Maackie de l'Amur,Amur Maackia,Maackia amurensis,Maackia,Fabaceae,MAAM,3B
MCAMBU,Maackia amurensis var. buergeri,Maackia amurensis var. buergeri,Maackia amurensis var. buergeri,Maackia amurensis,Maackia,Fabaceae,MAAM,3B
MCAMST,Maackia amurensis 'Starburst',Maackia Starburst,Starburst Amur Maackia,Maackia amurensis,Maackia,Fabaceae,MAAM,3B
MEGL,Metasequoia glyptostroboides,Métaséquoia,Dawn Redwood,Metasequoia glyptostroboides,Metasequoia,Cupressaceae,MEGL,1A
MG,Magnolia,Magnolia,Magnolia,Magnolia spp,Magnolia,Magnoliaceae,MGSP,2A
MGAC,Magnolia acuminata,Magnolia acuminata,Magnolia acuminata,Magnolia acuminata,Magnolia,Magnoliaceae,MGAC,2A
MGFRGO,Magnolia fraseri 'Goldstar',Magnolia Goldstar,Goldstar Magnolia,Magnolia fraseri,Magnolia,Magnoliaceae,MGFRGO,2A
MGKO,Magnolia kobus,Magnolia kobus,=,Magnolia kobus,Magnolia,Magnoliaceae,MGKO,2A
MGLO,Magnolia x loebneri,Magnolia de Loebner,Loebner Magnolia,Magnolia loebneri,Magnolia,Magnoliaceae,MGLO,2A
MGLOLM,Magnolia x loebneri 'Leonard Messel',Magnolia Leonard Messel,Leonard Messel Magnolia,Magnolia loebneri,Magnolia,Magnoliaceae,MGLO,2A
MGRURU,Magnolia rustica 'Rubra',Magnolia rustica Rubra,Magnolia rustica Rubra,Magnolia rustica,Magnolia,Magnoliaceae,MGRURU,2A
MGSO,Magnolia x soulangiana,Magnolia de Soulange,Saucer Magnolia,,,,,
MGXXBB,Magnolia x 'Blushing Belle',Magnolia 'Blushing Belle',Magnolia 'Blushing Belle',,,,,
MGXXDA,Magnolia x 'Daybreak',Magnolia 'Daybreak',Magnolia 'Daybreak',,,,,
MGXXGA,Magnolia x 'Galaxy',Magnolia 'Galaxy',Magnolia 'Galaxy',,,,,
MGXXSU,Magnolia x 'Sunburst',Magnolia 'Sunburst',Magnolia 'Sunburst',,,,,
MO,Morus,Mûrier,Mulberry,,,,,
MOAL,Morus alba,Mûrier blanc,White Mulberry,Morus alba,Morus,Moraceae,MOAL,3B
MOALPE,Morus alba 'Pendula',Mûrier blanc pleureur,Weeping White Mulberry,Morus alba,Morus,Moraceae,MOAL,3B
MORU,Morus rubra,Mûrier rouge,Red Mulberry,Morus rubra,Morus,Moraceae,MORU,3B
NYSY,Nyssa sylvatica,Nyssa sylvatica,Nyssa sylvatica,Nyssa sylvatica,Nyssa,Nyssaceae,NYSY,2A
OS,Ostrya,Ostryer,Ironwood,Ostrya sp.,,,,
OSVI,Ostrya virginiana,Ostryer de Virginie,American Hop-Hornbeam Ironwood,Ostrya virginiana,Ostrya,Betulaceae,OSVI,2A
PH,Phellodendron,Phellodendron,Cork Tree,Phellodendron sp.,,,,
PHAM,Phellodendron amurensis,Phellodendron de l'Amour,Amur Cork tree,Phellodendron amurense,Phellodendron,Rutaceae,PHAM,5
PHAMMA,Phellodendron amurensis 'Macho',Phellodendron de l'Amour Macho,Macho Amur Cork Tree,Phellodendron amurense,Phellodendron,Rutaceae,PHAM,5
PHAMME,Phellodendron amurensis 'Maelio',Phellodendron de l'Amour Maelio,Maelio Amur Cork Tree,Phellodendron amurense,Phellodendron,Rutaceae,PHAM,5
PHLALO,Phellodendron l. 'Longenecker' (Eye Stopper),Phellodendron Lavallei Eye Stopper,Eye Stopper Cork Tree,Phellodendron lavallei,,,PHLA,
PI,Picea,Épinette,Spruce,Picea pungens,Picea,Pinaceae,PIPU,1A
PIAB,Picea abies,Épinette de Norvège,Norway Spruce,Picea abies,Picea,Pinaceae,PIAB,1A
PIABCU,Picea abies 'Cupressina',Épinette de Norvège Cupressina,Cupressina Norway spruce,Picea abies,Picea,Pinaceae,PIAB,1A
PIABRS,Picea abies Rubra Spicata,Épinette de Norvège Rubra Spicata,Red Tipped Norway Spruce,Picea abies,Picea,Pinaceae,PIAB,1A
PIABVI,Picea abies 'Virgita',Épinette de Norvège Virgita,Virgita Norway Spruce,Picea abies,Picea,Pinaceae,PIAB,1A
PIGL,Picea glauca,Épinette blanche,White Spruce,Picea glauca,Picea,Pinaceae,PIGL,1A
PIGLCO,Picea glauca 'Coerulea',Épniette blanche Coerulea,Coerulea White Spruce,Picea glauca,Picea,Pinaceae,PIGL,1A
PIGLPE,Picea glauca 'Pendula',Épinette blanche pleureuse,Weeping White Spruce,Picea glauca,Picea,Pinaceae,PIGL,1A
PIMA,Picea mariana,Épinette noire,Black Spruce,Picea mariana,Picea,Pinaceae,PIMA,1A
PIOM,Picea omorika,Épinette de Serbie,Serbian Spruce,Picea omorika,Picea,Pinaceae,PIOM,1A
PIPU,Picea pungens,Épinette du Colorado,Colorado Spruce,Picea pungens,Picea,Pinaceae,PIPU,1A
PIPUBA,Picea pungens 'Bakeri',Picea pungens 'Bakeri',Picea pungens 'Bakeri',Picea pungens,Picea,Pinaceae,PIPU,1A
PIPUCO,Picea punges glauca Colorado,Épinette bleu du Colorado,Colorado blue spruce,Picea pungens,Picea,Pinaceae,PIPU,1A
PIPUCS,Picea pungens Colson's Select Blue,épinette bleu Colson's Select Blue,Colorado spruce Colson's Select Blue,Picea pungens,Picea,Pinaceae,PIPU,1A
PIPUEN,Picea pungens 'Engelm',Picea pungens 'Engelm',Picea pungens 'Engelm',Picea pungens,Picea,Pinaceae,PIPU,1A
PIPUFA,Picea pungens 'Fat Albert',Épinette du Colorado Fat Albert,Fat Albert Colorado Spruce,Picea pungens,Picea,Pinaceae,PIPU,1A
PIPUGL,Picea pungens 'Glauca',Épinette du Colorado Glauca,Glauca Blue Spruce,Picea pungens,Picea,Pinaceae,PIPU,1A
PIPUHO,Picea pungens 'Hoopsii',Épinette du Colorado Hoopsii,Hoopse's Blue Spruce,Picea pungens,Picea,Pinaceae,PIPU,1A
PIPUIF,Picea pungens Iseli Fastigiata,épinette,spruce Iseli Fastigiata,Picea pungens,Picea,Pinaceae,PIPU,1A
PIPUKO,Picea pungens 'Koster',Épinette du Colorado Koster,Koster's Blue Spruce,Picea pungens,Picea,Pinaceae,PIPU,1A
PIPUPE,Picea pungens 'Pendula',Épinette du Colorado pleureuse,Weeping Colorado Spruce,Picea pungens,Picea,Pinaceae,PIPU,1A
PIRU,Picea rubens,Épinette rouge,Red Spruce,Picea rubens,Picea,Pinaceae,PIRU,1A
PL,Platanus,Platane,Sycamore,Platanus sp.,,,,
PLOC,Platanus occidentalis,Platane occidental,Eastern Sycamore,Platanus occidentalis,Platanus,Platanaceae,PLOC,2C
PN,Pinus,Pin,Pine,Pinus nigra,Pinus,Pinaceae,PINI,1B
PNBA,Pinus banksiana,Pin gris,Jack Pine,Pinus banksiana,Pinus,Pinaceae,PIBA,1B
PNCE,Pinus cembra,Pinus cembra,Pinus cembra,Pinus cembra,Pinus,Pinaceae,PICE,1B
PNCESI,Pinus cembre var. sibirica,pin cembro (pin des Alpes),swiss stone pine,Pinus cembra,Pinus,Pinaceae,PICE,1B
PNCO,Pinus contorta,Pinus contorta,Pinus contorta,Pinus contorta,Pinus,Pinaceae,PNCO,1B
PNDE,Pinus densiflora,Pin parasol du Japon,Japanese red pine,Pinus densiflora,Pinus,Pinaceae,PIDE,1B
PNMU,Pinus mugo,Pin mugo,Mugo Pine,Pinus mugo,Pinus,Pinaceae,PIMU,1B
PNMUTA,Pinus mugo 'Tannenbaum',Pinus mugo 'Tannenbaum',Pinus mugo 'Tannenbaum',Pinus mugo,Pinus,Pinaceae,PIMU,1B
PNNIAS,Pinus nigra 'Arnold Sentinel',Pin noir d'Autriche Arnold Sentinel,Arnold Sentinel Austrian Pine,Pinus nigra,Pinus,Pinaceae,PINI,1B
PNNIAU,Pinus nigra 'Austriaca',Pin noir d'Autriche,Austrian Pine,Pinus nigra,Pinus,Pinaceae,PINI,1B
PNPAGL,Pinus parvifolia 'Glauca',Pin parviflora Glauca,Japanese White PIne,Pinus parviflora,Pinus,Pinaceae,PIPA,1B
PNPO,Pinus ponderosa,Pin à bois lourd,Western Yellow Pine,Pinus ponderosa,Pinus,Pinaceae,PNPO,1B
PNRE,Pinus resinosa,Pin rouge,Red Pine,Pinus resinosa,Pinus,Pinaceae,PIRE,1B
PNRI,Pinus rigida,Pin rigide,Pitch Pine,Pinus rigida,Pinus,Pinaceae,PNRI,1B
PNST,Pinus strobus,Pin blanc,Eastern White Pine,Pinus strobus,Pinus,Pinaceae,PIST,1A
PNSTFA,Pinus strobus 'Fastigiata',Pin blanc 'Fastigiata',Fastigiata Eastern White Pine,Pinus strobus,Pinus,Pinaceae,PIST,1A
PNSY,Pinus sylvestris,Pin sylvestre,Scots Pine,Pinus sylvestris,Pinus,Pinaceae,PISY,1B
PNSYFA,Pinus sylvestris 'Fastigiata',Pin sylvestre 'Fastigiata',pyramidal Scotch pine,Pinus sylvestris,Pinus,Pinaceae,PISY,1B
PO,Populus,Peuplier,"Poplar, Aspen, Cottonwood",Populus sp.,,,,
POAL,Populus alba,Peuplier blanc,European White Poplar,Populus alba,Populus,Salicaceae,POAL,5
POALBO,Populus alba 'Bolleana',Populus alba 'Bolleana',Populus alba 'Bolleana',Populus alba,Populus,Salicaceae,POAL,5
POALNI,Populus alba 'Nivea',Populus alba 'Nivea',Populus alba 'Nivea',Populus alba,Populus,Salicaceae,POAL,5
POALPY,Populus alba 'Pyramidalis',Peuplier blanc pyramidal,Bolleana Poplar,Populus alba,Populus,Salicaceae,POAL,5
POBA,Populus balsamifera,Peuplier baumier,Balsam Poplar,Populus balsamifera,Populus,Salicaceae,POBA,5
POCA,Populus x canadensis,Peuplier de Caroline,Carolina Poplar,Populus canadensis,Populus,Salicaceae,POCA,5
POCAAU,Populus x canadensis 'Aurea',Populus x canadensis 'Aurea',Populus x canadensis 'Aurea',Populus canadensis,Populus,Salicaceae,POCA,5
POCAER,Populus x canadensis 'Erecta',Populus x canadensis 'Erecta',Populus x canadensis 'Erecta',Populus canadensis,Populus,Salicaceae,POCA,5
POCAEU,Populus x canadensis 'Eugenii',Peuplier de Caroline Eugenii,Eugenii Carolina Poplar,Populus canadensis,Populus,Salicaceae,POCA,5
POCAPS,Populus x canadensis 'Prairie Sky',Peuplier Prairie Sky,Prairie Sky Poplar,Populus canadensis,Populus,Salicaceae,POCA,5
POCASE,Populus x canadensis 'Serotina',Populus x canadensis 'Serotina',Populus x canadensis 'Serotina',Populus canadensis,Populus,Salicaceae,POCA,5
POCNTO,Populus canescens 'Tower',Peuplier Tower,Tower Poplar,Populus canescens,Populus,Salicaceae,POCE,5
PODE,Populus deltoides,Peuplier deltoïde,Eastern Cottonwood,Populus deltoides,Populus,Salicaceae,PODE,5
PODESI,Populus deltoides 'Siouxland',Peuplier deltoides Siouxland,Siouxland Eastern Cottonwood,Populus deltoides,Populus,Salicaceae,PODE,5
POGR,Populus grandidentata,Peuplier à grandes dents,Large Toothed Aspen,Populus grandidentata,Populus,Salicaceae,POGR,5
PONI,Populus nigra,Peuplier Noir,Black Poplar,Populus nigra,Populus,Salicaceae,PONI,5
PONIIT,Populus nigra 'Italica',Peuplier de Lombardie,Lombardy Poplar,Populus nigra,Populus,Salicaceae,PONI,5
PONITH,Populus nigra 'Thevestina',Peuplier de Thebessa,Thebessa Poplar,Populus nigra,Populus,Salicaceae,PONI,5
POSI,Populus simonii,Peuplier de Simon,Simon Poplar,Populus simonii,Populus,Salicaceae,POSI,5
POSIFA,Populus simonii 'Fastigiata',Peuplier de Simon fastigié,Pyramidal Simon Poplar,Populus simonii,Populus,Salicaceae,POSI,5
POTE,Populus tremula,Tremble européen,European Aspen,Populus tremula,Populus,Salicaceae,POTA,5
POTEER,Populus tremula 'Erecta',Tremble européen colonnaire,Upright European Aspen,Populus tremula,Populus,Salicaceae,POTA,5
POTR,Populus tremuloides,Peuplier faux-tremble,Trembling Aspen,Populus tremuloides,Populus,Salicaceae,POTR,5
POTRER,Populus tremuloides 'Erecta',Peuplier faux-tremble Erecta,Erecta Trembling Aspen,Populus tremuloides,Populus,Salicaceae,POTR,5
POXX,Populus sp.(hybrides),Populus sp.(hybrides),Populus sp.(hybrides),Populus sp.(hybrides),Populus,Salicaceae,POXX,5
POXX91,Populus X 915508,peuplier,Cotton wood,,,,,
PR,Prunus,"Prunier, Cerisier ou Pêcher","Plum, Cherry or Peach tree",Prunus serotina,Prunus,Rosaceae,PRSE,3B
PRAM,Prunus americana,Prunier d'Amérique,American Plum,Prunus americana,Prunus,Rosaceae,PRAM,3B
PRAR,Prunus armeniaca,Abricotier d'Arménie,Apricot,Prunus armeniaca,Prunus,Rosaceae,PRAR,4A
PRARSC,Prunus armeniaca 'Scout',Abricotier d'Arménie 'Scout',Apricot Scout,Prunus armeniaca,Prunus,Rosaceae,PRAR,4A
PRCE,Prunus cerasus,Cerisier aigre,Sour Cherry,Prunus cerasus,Prunus,Rosaceae,PRCE,3B
PRCENE,Prunus cerasifera 'Newport',Prunus cerasifera 'Newport',Prunus cerasifera 'Newport',Prunus cerasifera,Prunus,Rosaceae,PRCENE,3B
PRDO,Prunus domestica,Prunier domestique,Common Plum,Prunus domestica,Prunus,Rosaceae,PRDO,3B
PRDOMR,Prunus domestica 'Mont-Royal',Prunier 'Mont-Royal',European Plum Montr-Royal,Prunus domestica,Prunus,Rosaceae,PRDO,3B
PRMA,Prunus maackii,Ceriser de l'amur,Amur Chokecherry,Prunus maackii,Prunus,Rosaceae,PRMA,3B
PRMAJE,Prunus maakii 'Jefree' (Goldrush TM),Prunus maakii 'Jefree',Prunus maakii 'Jefree',Prunus maackii,Prunus,Rosaceae,PRMA,3B
PRMAJF,Prunus maakii 'Jefspur' (Goldspur TM),Prunus maakii 'Jefspur',Prunus maakii 'Jefspur',Prunus maackii,Prunus,Rosaceae,PRMA,3B
PRNI,Prunus nigra,Prunier noir,Canada Plum,Prunus nigra,Prunus,Rosaceae,PRNI,3B
PRPA,Prunus padus,Cerisier à grappes,European Birdcherry,Prunus padus,Prunus,Rosaceae,PRPA,2C
PRPACM,Prunus padus 'Commutata',Cerisier à grappes Commutata,Commutata Bird Cherry,Prunus padus,Prunus,Rosaceae,PRPA,2C
PRPACO,Prunus padus 'Colorata',Cerisier à grappes Colorata,Colorata European Birdcherry,Prunus padus,Prunus,Rosaceae,PRPA,2C
PRPASR,Prunus padus 'Skinner's Red',Prunus padus 'Skinner's Red',Prunus padus 'Skinner's Red',Prunus padus,Prunus,Rosaceae,PRPA,2C
PRPE,Prunus persica,Pêcher,Peach Tree,Prunus persica,Prunus,Rosaceae,PRPER,3B
PRPN,Prunus pensylvanica,Cerisier de Pennsylvanie,Wild Red Cherry,Prunus pensylvanica,Prunus,Rosaceae,PRPEN,3B
PRSA,Prunus sargentii,Prunus sargentii,Prunus sargentii,Prunus sargentii,Prunus,Rosaceae,PRSA,3B
PRSE,Prunus serotina,Cerisier tardif,Black Cherry,Prunus serotina,Prunus,Rosaceae,PRSE,3B
PRSRKW,Prunus serrulata 'Kwanzan',Cerisier du Japon Kwanzan,Kwanzan Flowering Japanese Cherry,Prunus serrulata,Prunus,Rosaceae,PRSRKW,3B
PRVI,Prunus virginiana,Cerisier de Virginie,Chokecherry,Prunus virginiana,Prunus,Rosaceae,PRVI,3B
PRVICR,Prunus virginiana 'Canada Red',Cerisier de Virginie Canada Red,Canada Red Chokecherry,Prunus virginiana,Prunus,Rosaceae,PRVI,3B
PRVISC,Prunus virginiana 'Schubert',Cerisier de Virginie Schubert,Schubert's Chokecherry,Prunus virginiana,Prunus,Rosaceae,PRVI,3B
PRXXCI,Prunus x cistena,Prunus x cistena,Prunus x cistena,Prunus cistena,Prunus,Rosaceae,PRCI,3B
PRXXST,Prunus x 'Stella',Cerisier Stella,Stella Cherry,Prunus serotina,Prunus,Rosaceae,PRSE,3B
PRXYAK,Prunus x yedoensis 'Akebono',Cerisier décoratif Akebono,Daybreak Yoshino Cherry,,,,,
PS,Pseudostuga,Sapin de Douglas,Douglas Fir,,,,,
PSME,Pseudotsuga menziesii,Sapin de Douglas,Douglas Fir,Pseudotsuga menziesii,Pseudotsuga,Pinaceae,PSME,1A
PSMEGL,Pseudostuga menziesii 'Glauca',Sapin de Douglas bleu,Rocky Mountain Douglas Blue Fir,Pseudotsuga menziesii,Pseudotsuga,Pinaceae,PSME,1A
PTST,Pterocarya stepnotera,Ptérocaryer de Chine,Chinese Wingnut,,,,,
PY,Pyrus,Poirier,Pear,Pyrus calleryana,Pyrus,Rosaceae,PYCA,3A
PYCAAB,Pyrus calleryana 'Autumn Blaze',Pyrus calleryana 'Autumn Blaze',Pyrus calleryana 'Autumn Blaze',Pyrus calleryana,Pyrus,Rosaceae,PYCA,3A
PYCACH,Pyrus calleryana 'Glen's Form (Chantecleer),Poirier Chantecleer,Pyrus calleryana Chantecleer,Pyrus calleryana,Pyrus,Rosaceae,PYCA,3A
PYCOPA,Pyrus communis 'Patten',Patten European Pear,Poirier Patten,Pyrus communis,Pyrus,Rosaceae,PYCO,3A
PYCOSA,Pyrus communis 'Savignac',Pyrus communis 'Savignac',Pyrus communis 'Savignac',Pyrus communis,Pyrus,Rosaceae,PYCO,3A
PYPYSH,Pyrus pyrifolia 'Shinseiki',Poirier asiatique Shinseiki,Shinseiki asian Pear,Pyrus pyrifolia,Pyrus,Rosaceae,PYPYSH,3A
PYUS,Pyrus ussuriensis,Pyrus ussuriensis,Pyrus ussuriensis,Pyrus ussuriensis,Pyrus,Rosaceae,PYUS,3A
PYUSMF,Pyrus ussuriensis 'Mountain Frost',Pyrus ussuriensis 'Mountain Frost',Pyrus ussuriensis 'Mountain Frost',Pyrus ussuriensis,Pyrus,Rosaceae,PYUS,3A
PYUSPG,Pyrus ussuriensis 'Prairie Gem',Poirier de Mandchourie Prairie Gem,Prairie Gem Ussurian Pear,Pyrus ussuriensis,Pyrus,Rosaceae,PYUS,3A
PYXMI,Pyrus x michauxii,Pyrus x michauxii,Pyrus x michauxii,Pyrus michauxii,Pyrus,Rosaceae,PYXMI,3A
PYXXPE,Pyrus x 'Petrovsk',Pyrus x 'Petrovsk',Pyrus x 'Petrovsk',,,,,
QU,Quercus,Chêne,Oak,Quercus sp.,,,,
QUAL,Quercus alba,Chêne blanc,White Oak,Quercus alba,Quercus,Fagaceae,QUAL,4A
QUBI,Quercus bicolor,Chêne bleu,Swamp White Oak,Quercus bicolor,Quercus,Fagaceae,QUBI,4A
QUCO,Quercus coccinea,Chêne écarlate,Scarlet Oak,Quercus coccinea,Quercus,Fagaceae,QUCO,3A
QUEL,Quercus ellipsoidalis,Quercus ellipsoidalis,Quercus ellipsoidalis,Quercus ellipsoidalis,Quercus,Fagaceae,QUEL,4A
QUIM,Quercus imbricaria,Chêne à feuilles de Laurier,Shingle oak,Quercus imbricaria,Quercus,Fagaceae,QUIM,4A
QUMA,Quercus macrocarpa,Chêne à gros fruits,Bur Oak,Quercus macrocarpa,Quercus,Fagaceae,QUMA,4A
QUMU,Quercus muehlenbergii,Quercus muehlenbergii,Quercus muehlenbergii,Quercus muehlenbergii,Quercus,Fagaceae,QUMU,4A
QUPA,Quercus palustris,Chêne des marais,Pin Oak,Quercus palustris,Quercus,Fagaceae,QUPA,4A
QUPAGP,Quercus palustris 'Green Pillar',Quercus palustris Green Pillar,Quercus palustris Green Pillar,Quercus palustris,Quercus,Fagaceae,QUPA,4A
QUPE,Quercus petraea,Chêne sessile,Sessile Oak,Quercus petraea,Quercus,Fagaceae,QUPE,4A
QURO,Quercus robur,Chêne pédonculé,English Oak,Quercus robur,Quercus,Fagaceae,QURO,4A
QUROAM,Quercus robur 'Aurea Marginata',Quercus robur Aurea Marginata,Quercus robur Aurea Marginata,Quercus robur,Quercus,Fagaceae,QURO,4A
QUROCN,Quercus robur 'Concordia',Quercus robur Concordia,Quercus robur Concordia,Quercus robur,Quercus,Fagaceae,QURO,4A
QUROCS,Quercus robur 'Crimson Spire',Quercus robur 'Crimson Spire',Quercus robur 'Crimson Spire',Quercus robur,Quercus,Fagaceae,QURO,4A
QUROFA,Quercus robur 'Fastigiata',Chêne anglais fastigié,Fastigiate English Oak,Quercus robur,Quercus,Fagaceae,QURO,4A
QURU,Quercus rubra,Chêne rouge,Red Oak,Quercus rubra,Quercus,Fagaceae,QURU,4A
QUWARP,Quercus x warei 'Regal Prince',Chêne Régal Prince,Regal Prince Oak,Quercus robur,Quercus,Fagaceae,QURO,4A
QUXXKS,Quercus x Kindred Spirit,Chêne Kindred Spirit,Kindred Spirit Hybrid Oak,,,,,
RH,Rhamnus,Nerprun,Buckthorn,,,,,
RHCA,Rhamnus cathartica,Nerprun cathartique,European Buckthorn,Rhamnus cathartica,Rhamnus,Rhamnaceae,RHCA,3A
RHFR,Rhamnus frangula,Nerprun bourdaine,Glossy Buckthorn,Rhamnus frangula,Rhamnus,Rhamnaceae,RHFR,2C
RO,Robinia,Robinier,Locust,,,,,
ROPS,Robinia pseudoacacia,Robinier faux-acacia,Black Locust,Robinia pseudoacacia,Robinia,Fabaceae,ROPS,4B
ROPSFR,Robinia pseudoacacia 'Frisia',Robinier faux-acacia Frisia,Frisia Black Locust,Robinia pseudoacacia,Robinia,Fabaceae,ROPS,4B
ROPSPR,Robinia pseudoacacia 'Purple Robe',Robinia pseudoacacia Purple Robe,Robinia pseudoacacia Purple Robe,Robinia pseudoacacia,Robinia,Fabaceae,ROPS,4B
ROPSTB,Robinia pseudoacacia 'Twisty Baby',Robinia pseudoacacia 'Twisty Baby',Robinia pseudoacacia 'Twisty Baby',Robinia pseudoacacia,Robinia,Fabaceae,ROPS,4B
ROSL,Robinia x slavinii,Nom français,Nom anglais,Robinia slavinii,,,ROSL,
ROSLPC,Robinia x slavinii 'Purple Crown',Nom français,Purple Crown Locust,Robinia slavinii,,,ROSL,
RU,Rhus,Sumac,Sumac,,,,,
RUTY,Rhus typhina,Vinaigrier,Staghorn Sumac,Rhus typhina,Rhus,Anacardiaceae,RHTY,4B
SA,Salix,Saule,Willow,,,,,
SAAL,Salix alba,Saule blanc,White Willow,Salix alba,Salix,Salicaceae,SAAL,5
SAALTR,Salix alba 'Tristis',Saule pleureur,Golden Weeping Willow,Salix alba,Salix,Salicaceae,SAAL,5
SABACR,Salix babylonica 'Crispa',Salix babylonica 'Crispa',Salix babylonica 'Crispa',Salix babylonica,,,SABA,
SAMA,Salix matsudana,Saule de Pékin,Hankow Willow,Salix matsudana,Salix,Salicaceae,SAMA,5
SAMATO,Salix matsudana 'Tortuosa',Saule tortueux de Pékin,Corkscrew Willow,,,,,
SAMI,Salix miyabeana,Saule miyabeana,,Salix miyabeana,Salix,Salicaceae,SAMI,5
SANI,Salix nigra,Saule noir,Black Willow,Salix nigra,Salix,Salicaceae,SANI,5
SAPE,Salix pentendra,Saule laurier,Laurel Willow,Salix pentandra,Salix,Salicaceae,SAPE,5
SAXXCR,Salix x chrysocoma,Salix x chrysocoma,Salix x chrysocoma,Salix sepulcralis,Salix,Salicaceae,SAXXCR,5
SAXXPC,Salix x 'Prairie Cascade',Saule Prairie Cascade,Prairie Cascade Willow,,,,,
SAXXRU,Salix x rubens,Saule osier jaune,Hybrid crack willow,Salix alba,Salix,Salicaceae,SAAL,5
SO,Sorbus,Sorbier,Mountain Ash,Sorbus aucuparia,Sorbus,Rosaceae,SOAU,3A
SOAL,Sorbus alnifolia,Sorbier de Corée,Korean Mountain Ash,Sorbus alnifolia,Sorbus,Rosaceae,SOAL,3A
SOAM,Sorbus americana,Sorbier d'Amérique,American Ash,Sorbus americana,Sorbus,Rosaceae,SOAM,3A
SOAR,Sorbus aria,Alisier blanc,White Bear,Sorbus aria,Sorbus,Rosaceae,SOAR,3A
SOARLU,Sorbus aria 'Lutescens',Sorbus aria 'Lutescens',Sorbus aria 'Lutescens',Sorbus aria,Sorbus,Rosaceae,SOAR,3A
SOAU,Sorbus aucuparia,Sorbier des oiseaux,European Mountain Ash,Sorbus aucuparia,Sorbus,Rosaceae,SOAU,3A
SOAUCA,Sorbus aucuparia 'Cardinal',Sorbus aucuparia Cardinal,Sorbus aucuparia Cardinal,Sorbus aucuparia,Sorbus,Rosaceae,SOAU,3A
SOAUCR,Sorbus aucuparia 'Cardinal Royal',Sorbier des oiseaux Cardinal Royal,Cardinal Royal European Mountain Ash,Sorbus aucuparia,Sorbus,Rosaceae,SOAU,3A
SOAUFA,Sorbus aucuparia 'Fastigiata',Sorbier des oiseaux fastigié,Upright European Mountain Ash,Sorbus aucuparia,Sorbus,Rosaceae,SOAU,3A
SOAUPE,Sorbus aucuparia 'Pekinensis',Sorbier des oiseaux Pekinensis,Pekinensis European Mountain Ash,Sorbus aucuparia,Sorbus,Rosaceae,SOAU,3A
SOAURO,Sorbus aucuparia 'Rosedale',Sorbier des oiseaux Rosedale,Rosedale European Mountain Ash,Sorbus aucuparia,Sorbus,Rosaceae,SOAU,3A
SOAURS,Sorbus aucuparia 'Rossica',Sorbier des oiseaux Rossica,Rossica European Mountain Ash,Sorbus aucuparia,Sorbus,Rosaceae,SOAU,3A
SODE,Sorbus decora,Sorbier des montagnes,Showy Mountain Ash,Sorbus decora,Sorbus,Rosaceae,SODE,3A
SOFO,Sorbus folgneri,Nom français,Nom anglais,Sorbus folgneri,Sorbus,Rosaceae,SOFO,3A
SOIN,Sorbus intermedia,Alisier de Suède,Swedish Whitebeam,Sorbus intermedia,Sorbus,Rosaceae,SOIN,3A
SOINBT,Sorbus intermedia basse-tige,Sorbus intermedia basse-tige,Sorbus intermedia basse-tige,Sorbus intermedia,Sorbus,Rosaceae,SOIN,3A
SOINMT,Sorbus intermedia mi-tige,Sorbus intermedia mi-tige,Sorbus intermedia mi-tige,Sorbus intermedia,Sorbus,Rosaceae,SOIN,3A
SOLA,Sorbus latifolia,Sorbus latifolia,Sorbus latifolia,Sorbus latifolia,Sorbus,Rosaceae,SOLA,3A
SOTH,Sorbus thuringiaca,Sorbier à feuilles de chêne,Oakleaf Mountain Ash,Sorbus thuringiaca,Sorbus,Rosaceae,SOTH,3A
SOTHFA,Sorbus thuringiaca 'Fastigiata',Sorbier à feuilles de chêne fastigié,Fastigiata Oakleaf Mountain Ash,Sorbus thuringiaca,Sorbus,Rosaceae,SOTH,3A
SOXA,Sorbus xanthocarpa,Sorbus xanthocarpa,Sorbus xanthocarpa,Sorbus xanthocarpa,Sorbus,Rosaceae,SOXA,3A
SPJA,Sophora japonica,Sophora japonica,Sophora japonica,Sophora japonica,Sophora,Fabaceae,SPJA,3B
SY,Syringa,Lilas,Lilac,Syringa reticulata,Syringa,Oleaceae,SYRE,3A
SYPE,Syringa pekinensis,Syringa pekinensis,Syringa pekinensis,Syringa pekinensis,Syringa,Oleaceae,SYPE,3A
SYPEMO,Syringa pekinensis 'Morton' (China Snow TM),Syringa pekinensis Morton,Syringa pekinensis Morton,Syringa pekinensis,Syringa,Oleaceae,SYPE,3A
SYPR,Syringa prestoniae,Lilas de Preston,Preston's Lilac,Syringa prestoniae,Syringa,Oleaceae,SYPR,3A
SYPRMC,Syringa X prestonia Miss Canada,lilas de Prestone Miss Canada,Miss Canada Preston Lilac,Syringa prestoniae,Syringa,Oleaceae,SYPR,3A
SYPRRO,Syringa prestoniae 'Royalty',Lilas de Preston Royalty,Royalty Preston's Lilac,Syringa prestoniae,Syringa,Oleaceae,SYPR,3A
SYRE,Syringa reticulata,Lilas japonais,Japanese Tree Lilac,Syringa reticulata,Syringa,Oleaceae,SYRE,3A
SYREGE,Syringa reticulata 'Golden Eclipse',Lilas japonais Golden Eclipse,Golden Eclipse Japanese Tree Lilac,Syringa reticulata,Syringa,Oleaceae,SYRE,3A
SYREIS,Syringa reticulata 'Ivory Silk',Lilas japonais Ivory Silk,Ivory Silk Japanese Tree Lilac,Syringa reticulata,Syringa,Oleaceae,SYRE,3A
SYRESC,Syringa reticulata DTR 124 (Summer Charm TM),Syringa reticulata DTR 124 (Summer Charm TM),Syringa reticulata DTR 124 (Summer Charm TM),Syringa reticulata,Syringa,Oleaceae,SYRE,3A
SYVU,Syringa vulgaris,Syringa vulgaris,Syringa vulgaris,Syringa vulgaris,Syringa,Oleaceae,SYVU,3A
TA,Taxus,If,Yew,Taxus cuspidata,Taxus,Taxaceae,TACUCA,
TACUCA,Taxus cuspidata 'Capitata',Taxus cuspidata Capitata,Taxus cuspidata Capitata,Taxus cuspidata,Taxus,Taxaceae,TACUCA,
TH,Thuja,Thuya,Arborvitae,Thuja occidentalis,Thuja,Cupressaceae,THOC,1A
THOC,Thuja occidentalis,Thuya occidental,Eastern White Cedar,Thuja occidentalis,Thuja,Cupressaceae,THOC,1A
THOCDA,Thuja occidentalis 'Douglasii Aurea',Thuya occidental Douglasii Aurea,Douglasii Aurea Eastern White Cedar,Thuja occidentalis,Thuja,Cupressaceae,THOC,1A
THOCDO,Thuja occidentalis 'Douglasii',Thuya occidental Douglasii,Douglasii Eastern White Cedar,Thuja occidentalis,Thuja,Cupressaceae,THOC,1A
THOCDS,Thuya occidentalis Degroot's Spire,thuyas,northern whitecedar,Thuja occidentalis,Thuja,Cupressaceae,THOC,1A
THOCFA,Thuja occidentalis 'Fastigiata',Thuya occidental fastigié,Pyramidal Arborvitae,Thuja occidentalis,Thuja,Cupressaceae,THOC,1A
THOCNI,Thuja occidentalis 'Nigra',Thuya occidental Nigra,Nigra American Arborvitae,Thuja occidentalis,Thuja,Cupressaceae,THOC,1A
THOCPY,Thuja occidentalis 'Pyramidalis',Thuya occidental pyramidal,Pyramid Cedar,Thuja occidentalis,Thuja,Cupressaceae,THOC,1A
THOCSM,Thuja occidentalis 'Smaragd',Thuya occidental Smaragd,Emerald Arborvitae,Thuja occidentalis,Thuja,Cupressaceae,THOC,1A
THOCSP,Thuja occidentalis 'Spiralis',Thuya occidental Spiralis,Spiralis Arborvitae,Thuja occidentalis,Thuja,Cupressaceae,THOC,1A
THOCSU,Thuja occidentalis 'Sunkist',Thuya occidental Sunkist,Sunkist American Arborvitae,Thuja occidentalis,Thuja,Cupressaceae,THOC,1A
THOCUN,Thuja occidentalis 'Unicorn',Thuja occidentalis 'Unicorn',Thuja occidentalis 'Unicorn',Thuja occidentalis,Thuja,Cupressaceae,THOC,1A
THOCWA,Thuya occidentalis 'Wareana',Thuya occidentalis 'Wareana',Thuya occidentalis 'Wareana',Thuja occidentalis,Thuja,Cupressaceae,THOC,1A
TI,Tilia,Tilleul,Linden,,,,,
TIAM,Tilia americana,Tilleul d'Amérique,Basswood,Tilia americana,Tilia,Malvaceae,TIAM,2A
TIAMBO,Tilia americana 'Boulevard',Tilleul d'Amérique Boulevard,Boulevard Linden,Tilia americana,Tilia,Malvaceae,TIAM,2A
TIAMFA,Tilia americana 'Fastigiata',Tilia americana Fastigiata,Tilia americana Fastigiata,Tilia americana,Tilia,Malvaceae,TIAM,2A
TIAMLI,Tilia a. Lincoln,Tilia a. Lincoln,Tilia a. Lincoln,Tilia americana,Tilia,Malvaceae,TIAM,2A
TIAMNO,Tilia americana 'Nova',Tilleul d'Amérique Nova,Nova American Linden,Tilia americana,Tilia,Malvaceae,TIAM,2A
TIAMRE,Tilia americana 'Redmond',Tilleul d'Amérique Redmond,Redmond American Linden,Tilia americana,Tilia,Malvaceae,TIAM,2A
TICO,Tilia cordata,Tilleul à petites feuilles,Littleleaf European Linden,Tilia cordata,Tilia,Malvaceae,TICO,2A
TICOCO,Tilia cordata 'Corzam',Tilleul à petites feuilles Corinthien,Corinthian Littleleaf Linden,Tilia cordata,Tilia,Malvaceae,TICO,2A
TICODG,Tilia cordata 'De Groot',Tilia cordata 'De Groot',Tilia cordata 'De Groot',Tilia cordata,Tilia,Malvaceae,TICO,2A
TICOGG,Tilia cordata 'Green Globe',Tilia cordata 'Green Globe',Tilia cordata 'Green Globe',Tilia cordata,Tilia,Malvaceae,TICO,2A
TICOGL,Tilia cordata 'Glenleven',Tilleul à petites feuilles Glenleven,Glenleven Littleleaf Linden,Tilia cordata,Tilia,Malvaceae,TICO,2A
TICOGR,Tilia cordata 'Greenspire',Tilleul à petites feuilles Greenspire,Greenspire Littleleaf Linden,Tilia cordata,Tilia,Malvaceae,TICO,2A
TICOMO,Tilia cordata 'Morden',Tilleul à petites feuilles Morden,Morden Littleleaf Linden,Tilia cordata,Tilia,Malvaceae,TICO,2A
TICONO,Tilia cordata 'Norland',Tilleul à petites feuilles Norland,Norland Littleleaf Linden,Tilia cordata,Tilia,Malvaceae,TICO,2A
TICORA,Tilia cordata 'Rancho',Tilleul à petites feuilles Rancho,Rancho Littleleaf Linden,Tilia cordata,Tilia,Malvaceae,TICO,2A
TICORO,Tilia cordata 'Ronald',Tilleul à petites feuilles 'Ronald',Ronald Littleleaf Linden,Tilia cordata,Tilia,Malvaceae,TICO,2A
TICOSH,Tilia cordata 'Sheridan',Tilleul à petites feuilles Sheridan,Sheridan Littleleaf Linden,Tilia cordata,Tilia,Malvaceae,TICO,2A
TIER,Tilia x europaea,Tilleul d'Europe,European Linden,Tilia europaea,Tilia,Malvaceae,TIEU,2A
TIEREC,Tilia x europea 'Euchlora',Tilia x europea 'Euchlora',Tilia x europea 'Euchlora',Tilia europaea,Tilia,Malvaceae,TIEU,2A
TIEREU,Tilia x europaea 'Eugenii',Tilia x europaea 'Eugenii',Tilia x europaea 'Eugenii',Tilia europaea,Tilia,Malvaceae,TIEU,2A
TIERWR,Tilia x europaea 'Wratislaviensis',Tilleul de Varsovie,Warsaw Linden,Tilia europaea,Tilia,Malvaceae,TIEU,2A
TIMO,Tilia mongolica,Tilleul de Mongolie,Mongolian Linden,Tilia mongolica,Tilia,Malvaceae,TIMO,2A
TIMOHG,Tilia x mongolica 'Harvest Gold',Tilleul de Mongolie Harvest Gold,Harvest Gold Mongolian Linden,Tilia mongolica,Tilia,Malvaceae,TIMO,2A
TIPL,Tilia platyphyllos,Tilleul à grandes feuilles,Large Leaved Lime,Tilia platyphyllos,Tilia,Malvaceae,TIPL,2A
TITO,Tilia tomentosa,Tilleul argenté,Silver Linden,Tilia tomentosa,Tilia,Malvaceae,TITO,2A
TITOBR,Tilia tomentosa 'Brabant',Tilia tomentosa 'Brabant',Tilia tomentosa 'Brabant',Tilia tomentosa,Tilia,Malvaceae,TITO,2A
TITOSS,Tilia tomentosa 'Satin Shadow',Tilleul argenté Satin Shadow,Satin Shadow Silver Linden,Tilia tomentosa,Tilia,Malvaceae,TITO,2A
TITOST,Tilia tomentosa 'Sterling',Tilleul argenté Sterling,Sterling Silver Linden,Tilia tomentosa,Tilia,Malvaceae,TITO,2A
TIVU,Tilia vulgaris,Tilleul de Hollande,Common Lime,Tilia vulgaris,Tilia,Malvaceae,TIVU,2A
TIVUPA,Tilia vulgaris 'Pallida',Tilleul de Hollande Pallida,Pallida Common Lime,Tilia vulgaris,Tilia,Malvaceae,TIVU,2A
TS,Tsuga,Pruche,Hemlock,,,,,
TSCA,Tsuga canadensis,Pruche de l'Est,Eastern Hemlock,Tsuga canadensis,Tsuga,Pinaceae,TSCA,1A
UL,Ulmus,Orme,Elm,,,,,
ULAM,Ulmus americana,Orme d'Amérique,White Elm,Ulmus americana,Ulmus,Ulmaceae,ULAM,2C
ULAMBR,Ulmus americana 'Brandon',Orme d'Amérique Brandon,Brandon White Elm,Ulmus americana,Ulmus,Ulmaceae,ULAM,2C
ULAMLA,Ulmus americana l'Assomption,Ulmus americana l'Assomption,ulmus americana l'Assomption,Ulmus americana,Ulmus,Ulmaceae,ULAM,2C
ULAMLI,Ulmus americana 'Liberty',Orme d'Amérique Liberty,Liberty American Elm,Ulmus americana,Ulmus,Ulmaceae,ULAM,2C
ULAMNH,Ulmus americana 'New Harmony',Ulmus americana New Harmony,Ulmus americana New Harmony,Ulmus americana,Ulmus,Ulmaceae,ULAM,2C
ULAMPM,Ulmus a. PMM-2,Ulmus a. PMM-2,Ulmus a. PMM-2,Ulmus americana,Ulmus,Ulmaceae,ULAM,2C
ULAMPR,Ulmus americana 'Princeton',Orme Princeton,Princeton american elm,Ulmus americana,Ulmus,Ulmaceae,ULAM,2C
ULDA,Ulmus davidiana,Nom français,Japanese Elm,Ulmus davidiana,Ulmus,Ulmaceae,ULDA,2C
ULDADI,Ulmus davidiana 'Discovery',Nom français,Nom anglais,Ulmus davidiana,Ulmus,Ulmaceae,ULDA,2C
ULGL,Ulmus glabra,Orme de montagne,Scotch Elm,Ulmus glabra,Ulmus,Ulmaceae,ULGA,2C
ULGLCA,Ulmus glabra 'Camperdownii',Orme parasol,Camperdown Elm,Ulmus glabra,Ulmus,Ulmaceae,ULGA,2C
ULGLPE,Ulmus glabra 'Pendula',Ulmus glabra 'Pendula',Ulmus g;abra 'Pendula',Ulmus glabra,Ulmus,Ulmaceae,ULGA,2C
ULHOGR,Ulmus x hollandica 'Groeneveld',Orme Groeneveld,Groeneveld Elm,Ulmus x,Ulmus,Ulmaceae,ULX,2C
ULHOPI,Ulmus x hollandica 'Pioneer',Orme Pioneer,Pioneer Elm,Ulmus x,Ulmus,Ulmaceae,ULX,2C
ULHOWR,Ulmus x hollandica 'Wredei',Ulmus x hollandica Wredei,Ulmus x hollandica Wredei,Ulmus x,Ulmus,Ulmaceae,ULX,2C
ULPA,Ulmus parvifolia,Ulmus parvifolia,Ulmus parvifolia,Ulmus parvifolia,Ulmus,Ulmaceae,ULPA,3B
ULPRES,Ulmus propinqua 'Emerald Sunshine TM,Ulmus propinqua 'Emerald Sunhine' TM,Ulmus propinqua 'Emerald Sunhine' TM,Ulmus propinqua,Ulmus,Ulmaceae,ULPRES,2C
ULPU,Ulmus pumila,Orme de Sibérie,Siberian Elm,Ulmus pumila,Ulmus,Ulmaceae,ULPU,3B
ULPUCO,Ulmus pumila conique,Ulmus pumila conique,Ulmus pumila conique,Ulmus pumila,Ulmus,Ulmaceae,ULPU,3B
ULPUPR,Ulmus pumila 'Park Royal',Orme de Sibérie Park Royal,Park Royal Siberian Elm,Ulmus pumila,Ulmus,Ulmaceae,ULPU,3B
ULRU,Ulmus rubra,Orme rouge,Slippery Elm,Ulmus rubra,Ulmus,Ulmaceae,ULRU,2C
ULTH,Ulmus thomasii,Orme de Thomas,Rock Elm,Ulmus thomasii,Ulmus,Ulmaceae,ULTH,2A
ULWIPR,Ulmus wilsoniana 'Prospector',Orme japonais du prospecteur,Prospector's Elm,Ulmus wilsoniana,Ulmus,Ulmaceae,ULWIPR,2C
ULXXFR,Ulmus x 'Frontier',Ulmus x 'Frontier',Ulmus x 'Frontier',Ulmus x,Ulmus,Ulmaceae,ULX,2C
ULXXHO,Ulmus x 'Homestead',Orme Homestead,Homestead Elm,Ulmus x,Ulmus,Ulmaceae,ULX,2C
ULXXMG,Ulmus x 'Morton Glossy' (Triumph TM),Ulmus x 'Morton Glossy' (Triumph TM),Ulmus x 'Morton Glossy' (Triumph TM),Ulmus x,Ulmus,Ulmaceae,ULX,2C
ULXXMO,Ulmus x 'Morton' (Accolade TM),Orme Morton (Accolade TM),Morton (Accolade TM) Elm,Ulmus x,Ulmus,Ulmaceae,ULX,2C
ULXXMS,Ulmus x 'Morton Stalwart',Orme hybride 'Morton Sarlwart' (Commendation,"Morton Stalwart' - Commendation (TM) Elm,",Ulmus x,Ulmus,Ulmaceae,ULX,2C
ULXXNH,Ulmus x New Horizon,Ulmus x New Horizon,Ulmus x New Horizon,Ulmus x,Ulmus,Ulmaceae,ULX,2C
ULXXPA,Ulmus x 'Patriots',Ulmus x Patriots,Ulmus x Patriots,Ulmus x,Ulmus,Ulmaceae,ULX,2C
ULXXRE,Ulmus x 'Regal',Orme Regal,Regal Elm,Ulmus x,Ulmus,Ulmaceae,ULX,2C
ULXXSA,Ulmus x 'Sapporo Autumn Gold',Orme Sapporo Autumn Gold,Sapporo Autumn Gold Elm,Ulmus x,Ulmus,Ulmaceae,ULX,2C
ULXXVF,Ulmus americana 'Valley Forge',Ulmus x Valley Forge,Ulmus x Valley Forge,Ulmus americana,Ulmus,Ulmaceae,ULAM,2C
ULXXVG,Ulmus x 'Morton Plainsman' (Vanguard TM),Orme Vanguard,Vanguard Elm,Ulmus x,Ulmus,Ulmaceae,ULX,2C
ZA,Zanthoxylum,Clavalier,Prickly Ash,,,,,
ZAAM,Zanthoxylum americanum,Frêne épineux,Common Prickly Ash,Zanthoxylum americanum,Zanthoxylum,Rutaceae,ZAAM,
ZE,Zelkova,Zelkova,Zelkova,,,,,
ZESE,Zelkova serrata,Zelkova du Japon,Japanese Zelkova,Zelkova serrata,Zelkova,Ulmaceae,ZESE,
ZESEGV,Zelkova serrata 'Green Vase',Zelkova du Japon Green Vase,Green Vase Japanese Zelkova,Zelkova serrata,Zelkova,Ulmaceae,ZESE,
