species_latin_cleaned,dbh,purchase_cost,source,species_factor
Abies balsamea,4,160,Cramer,
Abies balsamea,5,200,Cramer,
Abies balsamea,6,250,Cramer,0.65
Abies concolor,4,220,Dutchmaster,
Abies concolor,5,285,Dutchmaster,0.85
Abies koreana,4,190,Estimé,
Abies koreana,5,243,Estimé,0.75
Abies sibirica,4,190,estimé,
Abies sibirica,5,243,estimé,0.75
Abies sp.,4,190,estimé,
Abies sp.,5,243,estimé,
Abies sp.,6,220,estimé,0.75
Acer campestre,4,140,Cramer,
Acer campestre,5,185,Cramer,
Acer campestre,6,210,Cramer,
Acer campestre,7,260,Cramer,
Acer campestre,8,320,Cramer,
Acer campestre,9,380,Cramer,
Acer campestre,10,440,Cramer,0.75
Acer ginnala,4,140,Cramer,
Acer ginnala,5,185,Cramer,
Acer ginnala,6,210,Cramer,
Acer ginnala,7,260,Cramer,
Acer ginnala,8,320,Cramer,
Acer ginnala,9,380,Cramer,
Acer ginnala,10,440,Cramer,0.65
Acer grandidentatum,4,135,estimé,
Acer grandidentatum,5,171,estimé,
Acer grandidentatum,6,192,estimé,
Acer grandidentatum,7,232,estimé,
Acer grandidentatum,8,270,estimé,
Acer grandidentatum,9,326,estimé,
Acer grandidentatum,10,363,estimé,0.75
Acer griseum,4,210,Dutchmaster,
Acer griseum,5,245,Dutchmaster,
Acer griseum,6,295,Dutchmaster,0.8
Acer miyabei,4,185,Dutchmaster,
Acer miyabei,5,220,Dutchmaster,
Acer miyabei,6,240,Dutchmaster,
Acer miyabei,7,325,Dutchmaster,0.75
Acer negundo,3,65,Cramer,
Acer negundo,4,80,Cramer,0.3
Acer nigrum,4,135,estimé,
Acer nigrum,5,171,estimé,
Acer nigrum,6,192,estimé,
Acer nigrum,7,232,estimé,
Acer nigrum,8,270,estimé,
Acer nigrum,9,326,estimé,
Acer nigrum,10,363,estimé,0.75
Acer palmatum,3,85,Dutchmaster,
Acer palmatum,4,175,Dutchmaster,
Acer palmatum,5,235,Dutchmaster,0.85
Acer pensylvanicum,3,65,Cramer,
Acer pensylvanicum,4,80,Cramer,0.6
Acer platanoides,4,110,Cramer,
Acer platanoides,5,145,Cramer,
Acer platanoides,6,160,Cramer,
Acer platanoides,7,200,Cramer,
Acer platanoides,8,230,Cramer,
Acer platanoides,9,280,Cramer,
Acer platanoides,10,330,Cramer,0.6
Acer pseudoplatanus,5,225,Dutchmaster,
Acer pseudoplatanus,6,245,Dutchmaster,
Acer pseudoplatanus,7,295,Dutchmaster,0.6
Acer rubrum,4,140,Cramer,
Acer rubrum,5,185,Cramer,
Acer rubrum,6,210,Cramer,
Acer rubrum,7,260,Cramer,
Acer rubrum,8,280,Cramer,
Acer rubrum,9,360,Cramer,0.75
Acer saccharinum,4,140,Cramer,
Acer saccharinum,5,160,Cramer,
Acer saccharinum,6,180,Cramer,
Acer saccharinum,7,200,Cramer,
Acer saccharinum,8,240,Cramer,
Acer saccharinum,9,280,Cramer,
Acer saccharinum,10,320,Cramer,0.65
Acer saccharum,4,145,Cramer,
Acer saccharum,5,180,Cramer,
Acer saccharum,6,200,Cramer,
Acer saccharum,7,240,Cramer,
Acer saccharum,8,280,Cramer,
Acer saccharum,9,330,Cramer,
Acer saccharum,10,360,Cramer,0.8
Acer sp.,4,135,estimé,
Acer sp.,5,171,estimé,
Acer sp.,6,192,estimé,
Acer sp.,7,232,estimé,
Acer sp.,8,270,estimé,
Acer sp.,9,326,estimé,
Acer sp.,10,363,estimé,0.7
Acer spicatum,3,65,estimé,
Acer spicatum,4,80,estimé,0.6
Acer tataricum,4,150,Cramer,
Acer tataricum,5,180,Cramer,
Acer tataricum,6,200,Cramer,0.65
Acer truncatum,4,180,Dutchmaster,
Acer truncatum,5,200,Dutchmaster,
Acer truncatum,6,220,Dutchmaster,
Acer truncatum,7,285,Dutchmaster,
Acer truncatum,8,325,Dutchmaster,0.65
Acer x,4,140,estimé,
Acer x,5,185,estimé,
Acer x,6,210,estimé,
Acer x,7,260,estimé,
Acer x,8,280,estimé,
Acer x,9,360,estimé,0.75
Acer x freemanii,4,140,Cramer,
Acer x freemanii,5,185,Cramer,
Acer x freemanii,6,210,Cramer,
Acer x freemanii,7,260,Cramer,
Acer x freemanii,8,280,Cramer,
Acer x freemanii,9,360,Cramer,0.85
Aesculus flava,4,125,estimé,
Aesculus flava,5,200,estimé,
Aesculus flava,6,230,estimé,
Aesculus flava,7,260,estimé,
Aesculus flava,8,320,estimé,
Aesculus flava,9,350,estimé,
Aesculus flava,10,411,Auclair et freres,0.65
Aesculus glabra,4,125,Cramer,
Aesculus glabra,5,200,Cramer,
Aesculus glabra,6,230,Cramer,
Aesculus glabra,7,260,Cramer,
Aesculus glabra,8,320,Cramer,
Aesculus glabra,9,350,Cramer,
Aesculus glabra,10,425,Cramer,0.65
Aesculus hippocastanum,4,125,Cramer,
Aesculus hippocastanum,5,200,Cramer,
Aesculus hippocastanum,6,230,Cramer,
Aesculus hippocastanum,7,260,Cramer,
Aesculus hippocastanum,8,320,Cramer,
Aesculus hippocastanum,9,350,Cramer,
Aesculus hippocastanum,10,425,Cramer,0.65
Aesculus indica,4,125,estimé,
Aesculus indica,5,200,estimé,
Aesculus indica,6,230,estimé,
Aesculus indica,7,260,estimé,
Aesculus indica,8,320,estimé,
Aesculus indica,9,350,estimé,
Aesculus indica,10,425,estimé,0.65
Aesculus sp.,4,125,estimé,
Aesculus sp.,5,200,estimé,
Aesculus sp.,6,230,estimé,
Aesculus sp.,7,260,estimé,
Aesculus sp.,8,320,estimé,
Aesculus sp.,9,350,estimé,
Aesculus sp.,10,425,estimé,0.65
Aesculus x,4,125,estimé,
Aesculus x,5,200,estimé,
Aesculus x,6,230,estimé,
Aesculus x,7,260,estimé,
Aesculus x,8,320,estimé,
Aesculus x,9,350,estimé,
Aesculus x,10,425,estimé,0.65
Alnus glutinosa,4,215,Dutchmaster,
Alnus glutinosa,5,230,Dutchmaster,
Alnus glutinosa,6,250,Dutchmaster,
Alnus glutinosa,7,295,Dutchmaster,0.6
Alnus incana,4,215,Dutchmaster,
Alnus incana,5,230,Dutchmaster,
Alnus incana,6,250,Dutchmaster,
Alnus incana,7,295,Dutchmaster,0.6
Alnus sp.,4,215,Dutchmaster,
Alnus sp.,5,230,Dutchmaster,
Alnus sp.,6,250,Dutchmaster,
Alnus sp.,7,295,Dutchmaster,0.6
Amelanchier arborea,4,145,Cramer,
Amelanchier arborea,5,185,Cramer,
Amelanchier arborea,6,220,Cramer,
Amelanchier arborea,7,270,Cramer,
Amelanchier arborea,8,340,Cramer,
Amelanchier arborea,9,390,Cramer,
Amelanchier arborea,10,450,Cramer,0.75
Amelanchier canadensis,4,145,Cramer,
Amelanchier canadensis,5,185,Cramer,
Amelanchier canadensis,6,220,Cramer,
Amelanchier canadensis,7,270,Cramer,
Amelanchier canadensis,8,340,Cramer,
Amelanchier canadensis,9,390,Cramer,
Amelanchier canadensis,10,450,Cramer,0.75
Amelanchier laevis,4,145,Cramer,
Amelanchier laevis,5,185,Cramer,
Amelanchier laevis,6,220,Cramer,
Amelanchier laevis,7,270,Cramer,
Amelanchier laevis,8,340,Cramer,
Amelanchier laevis,9,390,Cramer,
Amelanchier laevis,10,450,Cramer,0.75
Amelanchier sp.,4,145,Cramer,
Amelanchier sp.,5,185,Cramer,
Amelanchier sp.,6,220,Cramer,
Amelanchier sp.,7,270,Cramer,
Amelanchier sp.,8,340,Cramer,
Amelanchier sp.,9,390,Cramer,
Amelanchier sp.,10,450,Cramer,0.75
Amelanchier x,4,145,Cramer,
Amelanchier x,5,185,Cramer,
Amelanchier x,6,220,Cramer,
Amelanchier x,7,270,Cramer,
Amelanchier x,8,340,Cramer,
Amelanchier x,9,390,Cramer,
Amelanchier x,10,450,Cramer,0.75
Betula alba,4,135,Cramer,
Betula alba,5,160,Cramer,
Betula alba,6,180,Cramer,
Betula alba,7,210,Cramer,
Betula alba,8,240,Cramer,
Betula alleghaniensis,4,120,Cramer,
Betula alleghaniensis,5,170,Cramer,
Betula alleghaniensis,6,190,Cramer,
Betula alleghaniensis,7,230,Cramer,0.65
Betula nigra,4,125,Cramer,
Betula nigra,5,160,Cramer,
Betula nigra,6,175,Cramer,
Betula nigra,7,200,Cramer,
Betula nigra,8,240,Cramer,
Betula nigra,9,280,Cramer,
Betula nigra,10,320,Cramer,0.65
Betula papyrifera,4,125,Cramer,
Betula papyrifera,5,160,Cramer,
Betula papyrifera,6,175,Cramer,
Betula papyrifera,7,200,Cramer,
Betula papyrifera,8,240,Cramer,
Betula papyrifera,9,280,Cramer,
Betula papyrifera,10,320,Cramer,0.65
Betula pendula,4,135,Cramer,
Betula pendula,5,160,Cramer,
Betula pendula,6,180,Cramer,
Betula pendula,7,210,Cramer,
Betula pendula,8,240,Cramer,0.55
Betula populifolia,4,126,estimé,
Betula populifolia,5,163,estimé,
Betula populifolia,6,180,estimé,
Betula populifolia,7,210,estimé,
Betula populifolia,8,240,estimé,
Betula populifolia,9,280,estimé,
Betula populifolia,10,320,estimé,0.3
Betula sp.,4,126,estimé,
Betula sp.,5,163,estimé,
Betula sp.,6,180,estimé,
Betula sp.,7,210,estimé,
Betula sp.,8,240,estimé,
Betula sp.,9,280,estimé,
Betula sp.,10,320,estimé,0.6
Betula x,4,126,estimé,
Betula x,5,163,estimé,
Betula x,6,180,estimé,
Betula x,7,210,estimé,
Betula x,8,240,estimé,
Betula x,9,280,estimé,
Betula x,10,320,estimé,
Betula utilis,4,180,Dutchmaster,
Betula utilis,5,195,Dutchmaster,
Betula utilis,6,220,Dutchmaster,
Betula utilis,7,230,Dutchmaster,0.6
Caragana arborescens,4,90,Dutchmaster,
Caragana arborescens,5,120,Dutchmaster,
Caragana arborescens,6,135,Dutchmaster,0.65
Caragana sp.,4,90,estimé,
Caragana sp.,5,120,estimé,
Caragana sp.,6,135,estimé,0.65
Carpinus betulus,4,225,Environs,
Carpinus betulus,5,245,Environs,
Carpinus betulus,6,265,Environs,
Carpinus betulus,7,295,Environs,
Carpinus betulus,8,325,Environs,0.8
Carpinus caroliniana,4,160,Cramer,
Carpinus caroliniana,5,200,Cramer,
Carpinus caroliniana,6,230,Cramer,0.8
Carpinus sp.,4,193,estimé,
Carpinus sp.,5,223,estimé,
Carpinus sp.,6,248,estimé,
Carpinus sp.,7,295,estimé,
Carpinus sp.,8,325,estimé,0.8
Carya cordiformis,4,225,Dutchmaster,
Carya cordiformis,5,245,Dutchmaster,
Carya cordiformis,6,295,Dutchmaster,0.7
Carya ovata,4,225,Dutchmaster,
Carya ovata,5,245,Dutchmaster,
Carya ovata,6,295,Dutchmaster,0.7
Carya sp.,4,225,Dutchmaster,
Carya sp.,5,245,Dutchmaster,
Carya sp.,6,295,Dutchmaster,0.7
Catalpa bignonioides,4,205,Dutchmaster,
Catalpa bignonioides,5,225,Dutchmaster,
Catalpa bignonioides,6,260,Dutchmaster,
Catalpa bignonioides,7,275,Dutchmaster,0.6
Catalpa sp.,4,200,estimé,
Catalpa sp.,5,218,estimé,
Catalpa sp.,6,245,estimé,
Catalpa sp.,7,275,estimé,
Catalpa sp.,8,325,estimé,
Catalpa sp.,9,350,estimé,
Catalpa sp.,10,375,estimé,0.65
Catalpa speciosa,4,195,Dutchmaster,
Catalpa speciosa,5,210,Dutchmaster,
Catalpa speciosa,6,230,Dutchmaster,
Catalpa speciosa,7,275,Dutchmaster,
Catalpa speciosa,8,325,Dutchmaster,
Catalpa speciosa,9,350,Dutchmaster,
Catalpa speciosa,10,375,Dutchmaster,0.65
Celtis occidentalis,4,140,Cramer,
Celtis occidentalis,5,180,Cramer,
Celtis occidentalis,6,200,Cramer,
Celtis occidentalis,7,240,Cramer,
Celtis occidentalis,8,260,Cramer,
Celtis occidentalis,9,310,Cramer,
Celtis occidentalis,10,350,Cramer,0.7
Celtis sp.,4,140,estimé,
Celtis sp.,5,180,estimé,
Celtis sp.,6,200,estimé,
Celtis sp.,7,240,estimé,
Celtis sp.,8,260,estimé,
Celtis sp.,9,310,estimé,
Celtis sp.,10,350,estimé,0.7
Cercidiphyllum japonicum,4,205,Dutchmaster,
Cercidiphyllum japonicum,5,230,Dutchmaster,
Cercidiphyllum japonicum,6,250,Dutchmaster,0.8
Cercidiphyllum sp.,4,205,Dutchmaster,
Cercidiphyllum sp.,5,230,Dutchmaster,
Cercidiphyllum sp.,6,250,Dutchmaster,0.8
Cercis canadensis,4,210,Dutchmaster,
Cercis canadensis,5,245,Dutchmaster,
Cercis canadensis,6,295,Dutchmaster,
Cercis canadensis,7,325,Dutchmaster,0.45
Chamaecyparis nootkatensis,7,165,Cramer,
Chamaecyparis nootkatensis,8,210,Cramer,0.75
Cladrastis kentukea,4,225,Dutchmaster,
Cladrastis kentukea,5,245,Dutchmaster,
Cladrastis kentukea,6,295,Dutchmaster,
Cladrastis kentukea,7,325,Dutchmaster,
Cladrastis kentukea,8,375,Dutchmaster,0.65
Cladrastis lutea,4,225,Dutchmaster,
Cladrastis lutea,5,245,Dutchmaster,
Cladrastis lutea,6,295,Dutchmaster,
Cladrastis lutea,7,325,Dutchmaster,
Cladrastis lutea,8,375,Dutchmaster,
Cladrastis sp.,4,225,estimé,
Cladrastis sp.,5,245,estimé,
Cladrastis sp.,6,295,estimé,
Cladrastis sp.,7,325,estimé,
Cladrastis sp.,8,375,estimé,0.65
Cornus alternifolia,4,210,Dutchmaster,
Cornus alternifolia,5,245,Dutchmaster,
Cornus alternifolia,6,295,Dutchmaster,0.65
Cornus sp.,4,210,Dutchmaster,
Cornus sp.,5,245,Dutchmaster,
Cornus sp.,6,295,Dutchmaster,0.65
Corylus colurna,4,175,Cramer,
Corylus colurna,5,200,Cramer,
Corylus colurna,6,220,Cramer,
Corylus colurna,7,260,Cramer,0.6
Corylus sp.,5,200,estimé,
Corylus sp.,6,220,estimé,
Corylus sp.,7,260,estimé,0.6
Crataegus crus-galli,4,170,Dutchmaster,
Crataegus crus-galli,5,210,Dutchmaster,
Crataegus crus-galli,6,230,Dutchmaster,
Crataegus crus-galli,7,275,Dutchmaster,
Crataegus crus-galli,8,325,Dutchmaster,0.6
Crataegus laevigata,4,170,Dutchmaster,
Crataegus laevigata,5,210,Dutchmaster,
Crataegus laevigata,6,230,Dutchmaster,
Crataegus laevigata,7,275,Dutchmaster,
Crataegus laevigata,8,325,Dutchmaster,0.6
Crataegus phaenopyrum,4,170,Dutchmaster,
Crataegus phaenopyrum,5,210,Dutchmaster,
Crataegus phaenopyrum,6,230,Dutchmaster,
Crataegus phaenopyrum,7,275,Dutchmaster,
Crataegus phaenopyrum,8,325,Dutchmaster,0.6
Crataegus sp.,4,170,Dutchmaster,
Crataegus sp.,5,210,Dutchmaster,
Crataegus sp.,6,230,Dutchmaster,
Crataegus sp.,7,275,Dutchmaster,
Crataegus sp.,8,325,Dutchmaster,0.6
Crataegus x,4,170,Dutchmaster,
Crataegus x,5,210,Dutchmaster,
Crataegus x,6,230,Dutchmaster,
Crataegus x,7,275,Dutchmaster,
Crataegus x,8,325,Dutchmaster,0.6
Elaeagnus angustifolia,4,125,Cramer,
Elaeagnus angustifolia,5,160,Cramer,
Elaeagnus angustifolia,6,175,Cramer,
Elaeagnus angustifolia,7,200,Cramer,
Elaeagnus angustifolia,8,250,Cramer,
Elaeagnus angustifolia,9,300,Cramer,
Elaeagnus angustifolia,10,380,Cramer,0.45
Elaeagnus sp.,4,125,Cramer,
Elaeagnus sp.,5,160,Cramer,
Elaeagnus sp.,6,175,Cramer,
Elaeagnus sp.,7,200,Cramer,
Elaeagnus sp.,8,250,Cramer,
Elaeagnus sp.,9,300,Cramer,
Elaeagnus sp.,10,380,Cramer,0.45
Fagus grandifolia,4,235,Environs,
Fagus grandifolia,5,275,Environs,
Fagus grandifolia,6,300,estimé,
Fagus grandifolia,7,325,Environs,0.7
Fagus sp.,4,197,estimé,
Fagus sp.,5,222,estimé,
Fagus sp.,6,242,estimé,
Fagus sp.,7,257,estimé,0.7
Fagus sylvatica,4,158,Winkelmolen,
Fagus sylvatica,5,168,Winkelmolen,
Fagus sylvatica,6,184,Winkelmolen,
Fagus sylvatica,7,189,Winkelmolen,0.7
Fraxinus americana,4,140,estimé via le Celtis,
Fraxinus americana,5,180,estimé via le Celtis,
Fraxinus americana,6,200,estimé via le Celtis,
Fraxinus americana,7,240,estimé via le Celtis,
Fraxinus americana,8,260,estimé via le Celtis,
Fraxinus americana,9,310,estimé via le Celtis,
Fraxinus americana,10,350,estimé via le Celtis,0.25
Fraxinus angustifolia,4,140,estimé via le Celtis,
Fraxinus angustifolia,5,180,estimé via le Celtis,
Fraxinus angustifolia,6,200,estimé via le Celtis,
Fraxinus angustifolia,7,240,estimé via le Celtis,
Fraxinus angustifolia,8,260,estimé via le Celtis,
Fraxinus angustifolia,9,310,estimé via le Celtis,
Fraxinus angustifolia,10,350,estimé via le Celtis,0.25
Fraxinus bungeana,4,140,estimé via le Celtis,
Fraxinus bungeana,5,180,estimé via le Celtis,
Fraxinus bungeana,6,200,estimé via le Celtis,
Fraxinus bungeana,7,240,estimé via le Celtis,
Fraxinus bungeana,8,260,estimé via le Celtis,
Fraxinus bungeana,9,310,estimé via le Celtis,
Fraxinus bungeana,10,350,estimé via le Celtis,0.25
Fraxinus chinensis,4,140,estimé via le Celtis,
Fraxinus chinensis,5,180,estimé via le Celtis,
Fraxinus chinensis,6,200,estimé via le Celtis,
Fraxinus chinensis,7,240,estimé via le Celtis,
Fraxinus chinensis,8,260,estimé via le Celtis,
Fraxinus chinensis,9,310,estimé via le Celtis,
Fraxinus chinensis,10,350,estimé via le Celtis,0.25
Fraxinus excelsior,4,140,estimé via le Celtis,
Fraxinus excelsior,5,180,estimé via le Celtis,
Fraxinus excelsior,6,200,estimé via le Celtis,
Fraxinus excelsior,7,240,estimé via le Celtis,
Fraxinus excelsior,8,260,estimé via le Celtis,
Fraxinus excelsior,9,310,estimé via le Celtis,
Fraxinus excelsior,10,350,estimé via le Celtis,0.25
Fraxinus longicuspis,4,140,estimé via le Celtis,
Fraxinus longicuspis,5,180,estimé via le Celtis,
Fraxinus longicuspis,6,200,estimé via le Celtis,
Fraxinus longicuspis,7,240,estimé via le Celtis,
Fraxinus longicuspis,8,260,estimé via le Celtis,
Fraxinus longicuspis,9,310,estimé via le Celtis,
Fraxinus longicuspis,10,350,estimé via le Celtis,0.25
Fraxinus mandshurica,4,140,estimé via le Celtis,
Fraxinus mandshurica,5,180,estimé via le Celtis,
Fraxinus mandshurica,6,200,estimé via le Celtis,
Fraxinus mandshurica,7,240,estimé via le Celtis,
Fraxinus mandshurica,8,260,estimé via le Celtis,
Fraxinus mandshurica,9,310,estimé via le Celtis,
Fraxinus mandshurica,10,350,estimé via le Celtis,0.25
Fraxinus nigra,4,140,estimé via le Celtis,
Fraxinus nigra,5,180,estimé via le Celtis,
Fraxinus nigra,6,200,estimé via le Celtis,
Fraxinus nigra,7,240,estimé via le Celtis,
Fraxinus nigra,8,260,estimé via le Celtis,
Fraxinus nigra,9,310,estimé via le Celtis,
Fraxinus nigra,10,350,estimé via le Celtis,0.25
Fraxinus ornus,4,140,estimé via le Celtis,
Fraxinus ornus,5,180,estimé via le Celtis,
Fraxinus ornus,6,200,estimé via le Celtis,
Fraxinus ornus,7,240,estimé via le Celtis,
Fraxinus ornus,8,260,estimé via le Celtis,
Fraxinus ornus,9,310,estimé via le Celtis,
Fraxinus ornus,10,350,estimé via le Celtis,0.25
Fraxinus pallisiae,4,140,estimé via le Celtis,
Fraxinus pallisiae,5,180,estimé via le Celtis,
Fraxinus pallisiae,6,200,estimé via le Celtis,
Fraxinus pallisiae,7,240,estimé via le Celtis,
Fraxinus pallisiae,8,260,estimé via le Celtis,
Fraxinus pallisiae,9,310,estimé via le Celtis,
Fraxinus pallisiae,10,350,estimé via le Celtis,0.25
Fraxinus pennsylvanica,4,140,estimé via le Celtis,
Fraxinus pennsylvanica,5,180,estimé via le Celtis,
Fraxinus pennsylvanica,6,200,estimé via le Celtis,
Fraxinus pennsylvanica,7,240,estimé via le Celtis,
Fraxinus pennsylvanica,8,260,estimé via le Celtis,
Fraxinus pennsylvanica,9,310,estimé via le Celtis,
Fraxinus pennsylvanica,10,350,estimé via le Celtis,0.25
Fraxinus profunda,4,140,estimé via le Celtis,
Fraxinus profunda,5,180,estimé via le Celtis,
Fraxinus profunda,6,200,estimé via le Celtis,
Fraxinus profunda,7,240,estimé via le Celtis,
Fraxinus profunda,8,260,estimé via le Celtis,
Fraxinus profunda,9,310,estimé via le Celtis,
Fraxinus profunda,10,350,estimé via le Celtis,0.25
Fraxinus quadrangulata,4,140,estimé via le Celtis,
Fraxinus quadrangulata,5,180,estimé via le Celtis,
Fraxinus quadrangulata,6,200,estimé via le Celtis,
Fraxinus quadrangulata,7,240,estimé via le Celtis,
Fraxinus quadrangulata,8,260,estimé via le Celtis,
Fraxinus quadrangulata,9,310,estimé via le Celtis,
Fraxinus quadrangulata,10,350,estimé via le Celtis,0.25
Fraxinus sieboldiana,4,140,estimé via le Celtis,
Fraxinus sieboldiana,5,180,estimé via le Celtis,
Fraxinus sieboldiana,6,200,estimé via le Celtis,
Fraxinus sieboldiana,7,240,estimé via le Celtis,
Fraxinus sieboldiana,8,260,estimé via le Celtis,
Fraxinus sieboldiana,9,310,estimé via le Celtis,
Fraxinus sieboldiana,10,350,estimé via le Celtis,
Fraxinus sogdiana,4,140,estimé via le Celtis,
Fraxinus sogdiana,5,180,estimé via le Celtis,
Fraxinus sogdiana,6,200,estimé via le Celtis,
Fraxinus sogdiana,7,240,estimé via le Celtis,
Fraxinus sogdiana,8,260,estimé via le Celtis,
Fraxinus sogdiana,9,310,estimé via le Celtis,
Fraxinus sogdiana,10,350,estimé via le Celtis,0.25
Fraxinus sp.,4,140,estimé via le Celtis,
Fraxinus sp.,5,180,estimé via le Celtis,
Fraxinus sp.,6,200,estimé via le Celtis,
Fraxinus sp.,7,240,estimé via le Celtis,
Fraxinus sp.,8,260,estimé via le Celtis,
Fraxinus sp.,9,310,estimé via le Celtis,
Fraxinus sp.,10,350,estimé via le Celtis,0.25
Fraxinus velutina,4,140,estimé via le Celtis,
Fraxinus velutina,5,180,estimé via le Celtis,
Fraxinus velutina,6,200,estimé via le Celtis,
Fraxinus velutina,7,240,estimé via le Celtis,
Fraxinus velutina,8,260,estimé via le Celtis,
Fraxinus velutina,9,310,estimé via le Celtis,
Fraxinus velutina,10,350,estimé via le Celtis,0.25
Ginkgo biloba,4,215,Dutchmaster,
Ginkgo biloba,5,260,Dutchmaster,
Ginkgo biloba,6,290,Dutchmaster,
Ginkgo biloba,7,365,Dutchmaster,
Ginkgo biloba,8,395,Dutchmaster,0.6
Ginkgo sp.,4,215,Dutchmaster,
Ginkgo sp.,5,260,Dutchmaster,
Ginkgo sp.,6,290,Dutchmaster,
Ginkgo sp.,7,365,Dutchmaster,
Ginkgo sp.,8,395,Dutchmaster,0.6
Gleditsia sp.,4,170,Dutchmaster,
Gleditsia sp.,5,205,Dutchmaster,
Gleditsia sp.,6,220,Dutchmaster,
Gleditsia sp.,7,285,Dutchmaster,
Gleditsia sp.,8,325,Dutchmaster,
Gleditsia sp.,9,375,Dutchmaster,
Gleditsia sp.,10,450,Dutchmaster,0.65
Gleditsia triacanthos,4,170,Dutchmaster,
Gleditsia triacanthos,5,205,Dutchmaster,
Gleditsia triacanthos,6,220,Dutchmaster,
Gleditsia triacanthos,7,285,Dutchmaster,
Gleditsia triacanthos,8,325,Dutchmaster,
Gleditsia triacanthos,9,375,Dutchmaster,
Gleditsia triacanthos,10,450,Dutchmaster,0.65
Gymnocladus dioicus,4,205,Dutchmaster,
Gymnocladus dioicus,5,230,Dutchmaster,
Gymnocladus dioicus,6,250,Dutchmaster,
Gymnocladus dioicus,7,325,Dutchmaster,0.8
Gymnocladus sp.,4,205,Dutchmaster,
Gymnocladus sp.,5,230,Dutchmaster,
Gymnocladus sp.,6,250,Dutchmaster,
Gymnocladus sp.,7,325,Dutchmaster,0.8
Juglans ailantifolia,4,170,estimé,
Juglans ailantifolia,5,210,estimé,
Juglans ailantifolia,6,230,estimé,
Juglans ailantifolia,7,250,estimé,
Juglans ailantifolia,8,290,estimé,0.65
Juglans cinerea,4,170,Dutchmaster,
Juglans cinerea,5,210,Dutchmaster,
Juglans cinerea,6,230,Dutchmaster,
Juglans cinerea,7,250,Dutchmaster,0.35
Juglans nigra,4,170,Dutchmaster,
Juglans nigra,5,210,Dutchmaster,
Juglans nigra,6,230,Dutchmaster,
Juglans nigra,7,250,Dutchmaster,
Juglans nigra,8,290,Dutchmaster,0.75
Juglans regia,4,170,estimé,
Juglans regia,5,210,estimé,
Juglans regia,6,230,estimé,
Juglans regia,7,250,estimé,
Juglans regia,8,290,estimé,0.65
Juglans sp.,4,170,estimé,
Juglans sp.,5,210,estimé,
Juglans sp.,6,230,estimé,
Juglans sp.,7,250,estimé,
Juglans sp.,8,290,estimé,0.65
Juniperus sp.,6,165,estimé,
Juniperus sp.,7,185,estimé,
Juniperus sp.,8,220,estimé,
Juniperus sp.,9,235,estimé,0.65
Juniperus virginiana,6,165,Dutchmaster,
Juniperus virginiana,7,185,Dutchmaster,
Juniperus virginiana,8,220,Dutchmaster,
Juniperus virginiana,9,235,Dutchmaster,0.65
Larix decidua,3,155,Dutchmaster,
Larix decidua,3,170,Dutchmaster,
Larix decidua,4,190,Dutchmaster,
Larix decidua,5,235,Dutchmaster,0.8
Larix kaempferi,3,138,estimé,
Larix kaempferi,4,170,estimé,
Larix kaempferi,5,208,estimé,0.8
Larix laricina,3,120,Cramer,
Larix laricina,4,150,Cramer,
Larix laricina,5,180,Cramer,0.8
Larix sp.,3,216,estimé,
Larix sp.,4,200,estimé,
Larix sp.,5,208,estimé,0.8
Liquidambar styraciflua,6,225,Environs,
Liquidambar styraciflua,7,250,Environs,
Liquidambar styraciflua,8,275,Environs,0.75
Liriodendron sp.,4,205,Dutchmaster,
Liriodendron sp.,5,230,Dutchmaster,
Liriodendron sp.,6,250,Dutchmaster,
Liriodendron sp.,7,325,Dutchmaster,0.75
Liriodendron tulipifera,4,205,Dutchmaster,
Liriodendron tulipifera,5,230,Dutchmaster,
Liriodendron tulipifera,6,250,Dutchmaster,
Liriodendron tulipifera,7,325,Dutchmaster,0.75
Maackia amurensis,4,210,Dutchmaster,
Maackia amurensis,5,245,Dutchmaster,
Maackia amurensis,6,295,Dutchmaster,0.65
Maackia sp.,4,210,Dutchmaster,
Maackia sp.,5,245,Dutchmaster,
Maackia sp.,6,295,Dutchmaster,0.65
Magnolia acuminata,4,225,estimé,
Magnolia acuminata,5,245,estimé,
Magnolia acuminata,6,295,estimé,
Magnolia acuminata,7,325,estimé,0.75
Magnolia fraseri,4,225,estimé,
Magnolia fraseri,5,245,estimé,
Magnolia fraseri,6,295,estimé,
Magnolia fraseri,7,325,estimé,0.75
Magnolia kobus,4,225,Dutchmaster,
Magnolia kobus,5,245,Dutchmaster,
Magnolia kobus,6,295,Dutchmaster,
Magnolia kobus,7,325,Dutchmaster,0.75
Magnolia rustica,4,225,estimé,
Magnolia rustica,5,245,estimé,
Magnolia rustica,6,295,estimé,
Magnolia rustica,7,325,estimé,0.75
Magnolia sp.,4,225,estimé,
Magnolia sp.,5,245,estimé,
Magnolia sp.,6,295,estimé,
Magnolia sp.,7,325,estimé,0.75
Magnolia x,4,225,estimé,
Magnolia x,5,245,estimé,
Magnolia x,6,295,estimé,
Magnolia x,7,325,estimé,0.75
Malus baccata,4,130,Cramer,
Malus baccata,5,150,Cramer,
Malus baccata,6,180,Cramer,
Malus baccata,7,220,Cramer,
Malus baccata,8,250,Cramer,
Malus baccata,9,310,Cramer,
Malus baccata,10,380,Cramer,0.5
Malus coronaria,4,125,Cramer,
Malus coronaria,5,148,Cramer,
Malus coronaria,6,175,Cramer,
Malus coronaria,7,210,Cramer,
Malus coronaria,8,245,Cramer,
Malus coronaria,9,295,Cramer,
Malus coronaria,10,355,Cramer,0.5
Malus domestica,4,125,Cramer,
Malus domestica,5,148,Cramer,
Malus domestica,6,175,Cramer,
Malus domestica,7,210,Cramer,
Malus domestica,8,245,Cramer,
Malus domestica,9,295,Cramer,
Malus domestica,10,355,Cramer,0.5
Malus ioensis,4,125,Cramer,
Malus ioensis,5,148,Cramer,
Malus ioensis,6,175,Cramer,
Malus ioensis,7,210,Cramer,
Malus ioensis,8,245,Cramer,
Malus ioensis,9,295,Cramer,
Malus ioensis,10,355,Cramer,0.5
Malus prunifolia,4,125,Cramer,
Malus prunifolia,5,148,Cramer,
Malus prunifolia,6,175,Cramer,
Malus prunifolia,7,210,Cramer,
Malus prunifolia,8,245,Cramer,
Malus prunifolia,9,295,Cramer,
Malus prunifolia,10,355,Cramer,0.5
Malus robusta,4,125,Cramer,
Malus robusta,5,148,Cramer,
Malus robusta,6,175,Cramer,
Malus robusta,7,210,Cramer,
Malus robusta,8,245,Cramer,
Malus robusta,9,295,Cramer,
Malus robusta,10,355,Cramer,0.5
Malus sp.,4,125,Cramer,
Malus sp.,5,148,Cramer,
Malus sp.,6,175,Cramer,
Malus sp.,7,210,Cramer,
Malus sp.,8,245,Cramer,
Malus sp.,9,295,Cramer,
Malus sp.,10,355,Cramer,0.5
Malus x,4,125,Cramer,
Malus x,5,148,Cramer,
Malus x,6,175,Cramer,
Malus x,7,210,Cramer,
Malus x,8,245,Cramer,
Malus x,9,295,Cramer,
Malus x,10,355,Cramer,0.5
Metasequoia glyptostroboides,3,180,Dutchmaster,
Metasequoia glyptostroboides,4,250,Dutchmaster,
Metasequoia glyptostroboides,5,310,Dutchmaster,0.65
Morus alba,3,120,Jardin Jasmin,0.3
Morus rubra,3,120,estimé,0.35
Morus sp.,3,120,estimé,0.35
Nyssa sylvatica,2,30,Environs,
Nyssa sylvatica,3,35,Environs,0.9
Ostrya carpinifolia,4,160,estimé,
Ostrya carpinifolia,5,200,estimé,
Ostrya carpinifolia,6,240,estimé,
Ostrya carpinifolia,7,280,estimé,
Ostrya carpinifolia,8,330,estimé,0.65
Ostrya virginiana,4,160,Cramer,
Ostrya virginiana,5,200,Cramer,
Ostrya virginiana,6,240,Cramer,
Ostrya virginiana,7,280,Cramer,
Ostrya virginiana,8,330,Cramer,0.65
Phellodendron amurense,4,125,Cramer,
Phellodendron amurense,5,170,Cramer,
Phellodendron amurense,6,190,Cramer,
Phellodendron amurense,7,220,Cramer,0.5
Phellodendron sp.,4,125,Cramer,
Phellodendron sp.,5,170,Cramer,
Phellodendron sp.,6,190,Cramer,
Phellodendron sp.,7,220,Cramer,0.5
Phellondendron lavallei,4,125,Cramer,
Phellondendron lavallei,5,170,Cramer,
Phellondendron lavallei,6,190,Cramer,
Phellondendron lavallei,7,220,Cramer,
Picea abies,4,125,Cramer,
Picea abies,4,180,Cramer,
Picea abies,5,220,Cramer,0.85
Picea glauca,4,125,Cramer,
Picea glauca,5,180,Cramer,
Picea glauca,6,220,Cramer,0.75
Picea mariana,4,125,Cramer,
Picea mariana,4,180,Cramer,
Picea mariana,5,220,Cramer,0.7
Picea omorika,4,180,Cramer,
Picea omorika,4,250,Cramer,
Picea omorika,5,320,Cramer,0.85
Picea pungens,4,160,Cramer,
Picea pungens,5,250,Cramer,
Picea pungens,6,340,Cramer,0.8
Picea rubens,4,143,estimé,
Picea rubens,5,238,estimé,
Picea rubens,6,280,estimé,0.65
Picea sp.,4,143,estimé,
Picea sp.,5,238,estimé,
Picea sp.,6,280,estimé,0.75
Pinus banksiana,6,140,Cramer,
Pinus banksiana,8,195,Cramer,
Pinus banksiana,10,240,Cramer,0.45
Pinus cembra,3,195,Cramer,0.85
Pinus contorta,5,170,estimé,
Pinus contorta,6,179,estimé,
Pinus contorta,7,233,estimé,
Pinus contorta,8,253,estimé,0.65
Pinus flexilis,5,220,Dutchmaster,
Pinus flexilis,6,275,Dutchmaster,0.65
Pinus Koraiensis,5,170,estimé,
Pinus Koraiensis,6,179,estimé,
Pinus Koraiensis,7,233,estimé,
Pinus Koraiensis,8,253,estimé,0.65
Pinus mugo,2,150,Cramer,0.65
Pinus nigra,5,160,Dutchmaster,
Pinus nigra,6,185,Dutchmaster,
Pinus nigra,7,220,Dutchmaster,
Pinus nigra,8,310,Dutchmaster,0.65
Pinus parvifolia,5,170,estimé,
Pinus parvifolia,6,179,estimé,
Pinus parvifolia,7,233,estimé,
Pinus parvifolia,8,253,estimé,0.65
Pinus ponderosa,5,170,estimé,
Pinus ponderosa,6,179,estimé,
Pinus ponderosa,7,233,estimé,
Pinus ponderosa,8,253,estimé,0.65
Pinus resinosa,5,140,Cramer,
Pinus resinosa,6,195,Cramer,
Pinus resinosa,7,240,Cramer,0.65
Pinus rigida,5,170,estimé,
Pinus rigida,6,179,estimé,
Pinus rigida,7,233,estimé,
Pinus rigida,8,253,estimé,0.65
Pinus sp.,5,170,estimé,
Pinus sp.,6,179,estimé,
Pinus sp.,7,233,estimé,
Pinus sp.,8,253,estimé,0.65
Pinus strobus,3,140,Cramer,
Pinus strobus,4,195,Cramer,
Pinus strobus,5,240,Cramer,0.85
Pinus sylvestris,5,140,Cramer,
Pinus sylvestris,6,195,Cramer,
Pinus sylvestris,7,240,Cramer,0.65
Platanus occidentalis,4,165,Environs,
Platanus occidentalis,5,190,Environs,
Platanus occidentalis,6,210,Environs,
Platanus occidentalis,7,235,Environs,
Platanus occidentalis,8,300,Environs,
Platanus occidentalis,9,325,Environs,
Platanus occidentalis,10,350,Environs,0.55
Platanus sp.,4,165,Environs,
Platanus sp.,5,190,Environs,
Platanus sp.,6,210,Environs,
Platanus sp.,7,235,Environs,
Platanus sp.,8,300,Environs,
Platanus sp.,9,325,Environs,
Platanus sp.,10,350,Environs,0.55
Platanus x,4,165,estimé,
Platanus x,5,190,estimé,
Platanus x,6,210,estimé,
Platanus x,7,235,estimé,
Platanus x,8,300,estimé,
Platanus x,9,325,estimé,
Platanus x,10,350,estimé,0.7
Populus alba,4,90,Cramer,
Populus alba,5,135,Cramer,
Populus alba,6,145,Cramer,
Populus alba,7,170,Cramer,
Populus alba,8,200,Cramer,
Populus alba,9,240,Cramer,
Populus alba,10,280,Cramer,0.45
Populus balsamifera,4,90,Cramer,
Populus balsamifera,5,135,Cramer,
Populus balsamifera,6,145,Cramer,
Populus balsamifera,7,170,Cramer,
Populus balsamifera,8,200,Cramer,
Populus balsamifera,9,240,Cramer,
Populus balsamifera,10,280,Cramer,0.45
Populus deltoides,4,90,Cramer,
Populus deltoides,5,135,Cramer,
Populus deltoides,6,145,Cramer,
Populus deltoides,7,170,Cramer,
Populus deltoides,8,200,Cramer,
Populus deltoides,9,240,Cramer,
Populus deltoides,10,280,Cramer,0.45
Populus grandidentata,4,90,Cramer,
Populus grandidentata,5,135,Cramer,
Populus grandidentata,6,145,Cramer,
Populus grandidentata,7,170,Cramer,
Populus grandidentata,8,200,Cramer,
Populus grandidentata,9,240,Cramer,
Populus grandidentata,10,280,Cramer,0.45
Populus nigra,4,90,Cramer,
Populus nigra,5,135,Cramer,
Populus nigra,6,145,Cramer,
Populus nigra,7,170,Cramer,
Populus nigra,8,200,Cramer,
Populus nigra,9,240,Cramer,
Populus nigra,10,280,Cramer,0.45
Populus simonii,4,90,Cramer,
Populus simonii,5,135,Cramer,
Populus simonii,6,145,Cramer,
Populus simonii,7,170,Cramer,
Populus simonii,8,200,Cramer,
Populus simonii,9,240,Cramer,
Populus simonii,10,280,Cramer,0.45
Populus sp.,4,90,Cramer,
Populus sp.,5,135,Cramer,
Populus sp.,6,145,Cramer,
Populus sp.,7,170,Cramer,
Populus sp.,8,200,Cramer,
Populus sp.,9,240,Cramer,
Populus sp.,10,280,Cramer,0.45
Populus tremula,4,90,Cramer,
Populus tremula,5,135,Cramer,
Populus tremula,6,145,Cramer,
Populus tremula,7,170,Cramer,
Populus tremula,8,200,Cramer,
Populus tremula,9,240,Cramer,
Populus tremula,10,280,Cramer,0.45
Populus tremuloides,4,90,Cramer,
Populus tremuloides,5,135,Cramer,
Populus tremuloides,6,145,Cramer,
Populus tremuloides,7,170,Cramer,
Populus tremuloides,8,200,Cramer,
Populus tremuloides,9,240,Cramer,
Populus tremuloides,10,280,Cramer,0.45
Populus x,4,90,Cramer,
Populus x,5,135,Cramer,
Populus x,6,145,Cramer,
Populus x,7,170,Cramer,
Populus x,8,200,Cramer,
Populus x,9,240,Cramer,
Populus x,10,280,Cramer,0.45
Prunus americana,4,144,estimé,
Prunus americana,5,178,estimé,
Prunus americana,6,205,estimé,
Prunus americana,7,235,estimé,
Prunus americana,8,270,estimé,0.45
Prunus armeniaca,4,144,estimé,
Prunus armeniaca,5,178,estimé,
Prunus armeniaca,6,205,estimé,
Prunus armeniaca,7,235,estimé,
Prunus armeniaca,8,270,estimé,0.45
Prunus avium,4,144,estimé,
Prunus avium,5,178,estimé,
Prunus avium,6,205,estimé,
Prunus avium,7,235,estimé,
Prunus avium,8,270,estimé,0.45
Prunus cerasifera,4,165,Dutchmaster,
Prunus cerasifera,5,195,Dutchmaster,
Prunus cerasifera,6,215,Dutchmaster,
Prunus cerasifera,7,245,Dutchmaster,
Prunus cerasifera,8,270,Dutchmaster,0.45
Prunus cerasus,4,144,estimé,
Prunus cerasus,5,178,estimé,
Prunus cerasus,6,205,estimé,
Prunus cerasus,7,235,estimé,
Prunus cerasus,8,270,estimé,0.45
Prunus domestica,4,144,estimé,
Prunus domestica,5,178,estimé,
Prunus domestica,6,205,estimé,
Prunus domestica,7,235,estimé,
Prunus domestica,8,270,estimé,0.45
Prunus maackii,4,130,Cramer,
Prunus maackii,5,170,Cramer,
Prunus maackii,6,200,Cramer,
Prunus maackii,7,230,Cramer,0.45
Prunus multifruits,4,144,estimé,
Prunus multifruits,5,178,estimé,
Prunus multifruits,6,205,estimé,
Prunus multifruits,7,235,estimé,
Prunus multifruits,8,270,estimé,0.45
Prunus nigra,4,144,estimé,
Prunus nigra,5,178,estimé,
Prunus nigra,6,205,estimé,
Prunus nigra,7,235,estimé,
Prunus nigra,8,270,estimé,0.45
Prunus padus,4,130,Cramer,
Prunus padus,5,170,Cramer,
Prunus padus,6,200,Cramer,
Prunus padus,7,230,Cramer,0.45
Prunus pensylvanica,4,130,Cramer,
Prunus pensylvanica,5,170,Cramer,
Prunus pensylvanica,6,200,Cramer,
Prunus pensylvanica,7,230,Cramer,0.45
Prunus persica,4,144,estimé,
Prunus persica,5,178,estimé,
Prunus persica,6,205,estimé,
Prunus persica,7,235,estimé,
Prunus persica,8,270,estimé,0.45
Prunus salicina,4,144,estimé,
Prunus salicina,5,178,estimé,
Prunus salicina,6,205,estimé,
Prunus salicina,7,235,estimé,
Prunus salicina,8,270,estimé,0.45
Prunus serotina,4,130,Cramer,
Prunus serotina,5,170,Cramer,
Prunus serotina,6,200,Cramer,
Prunus serotina,7,230,Cramer,0.45
Prunus sp.,4,144,estimé,
Prunus sp.,5,178,estimé,
Prunus sp.,6,205,estimé,
Prunus sp.,7,235,estimé,
Prunus sp.,8,270,estimé,0.45
Prunus virginiana,4,180,Dutchmaster,
Prunus virginiana,5,195,Dutchmaster,
Prunus virginiana,6,215,Dutchmaster,
Prunus virginiana,7,245,Dutchmaster,
Prunus virginiana,8,270,Dutchmaster,0.45
Prunus x,4,144,estimé,
Prunus x,5,178,estimé,
Prunus x,6,205,estimé,
Prunus x,7,235,estimé,
Prunus x,8,270,estimé,0.45
Pseudostuga sp.,5,160,Dutchmaster,
Pseudostuga sp.,6,230,Dutchmaster,
Pseudostuga sp.,7,310,Dutchmaster,
Pseudotsuga menziesii,5,160,Dutchmaster,
Pseudotsuga menziesii,6,230,Dutchmaster,
Pseudotsuga menziesii,7,310,Dutchmaster,0.85
Pyrus calleryana,4,170,Dutchmaster,
Pyrus calleryana,5,205,Dutchmaster,
Pyrus calleryana,6,220,Dutchmaster,
Pyrus calleryana,7,285,Dutchmaster,0.5
Pyrus communis,4,170,estimé,
Pyrus communis,5,205,estimé,
Pyrus communis,6,220,estimé,
Pyrus communis,7,285,estimé,0.5
Pyrus multifruits,4,170,estimé,
Pyrus multifruits,5,205,estimé,
Pyrus multifruits,6,220,estimé,
Pyrus multifruits,7,285,estimé,0.5
Pyrus sp.,4,170,estimé,
Pyrus sp.,5,205,estimé,
Pyrus sp.,6,220,estimé,
Pyrus sp.,7,285,estimé,0.5
Pyrus ussuriensis,4,170,Dutchmaster,
Pyrus ussuriensis,5,205,Dutchmaster,
Pyrus ussuriensis,6,220,Dutchmaster,
Pyrus ussuriensis,7,285,Dutchmaster,0.5
Quercus alba,4,185,Cramer,
Quercus alba,5,200,Cramer,
Quercus alba,6,230,Cramer,
Quercus alba,7,260,Cramer,
Quercus alba,8,300,Cramer,
Quercus alba,9,350,Cramer,
Quercus alba,10,425,Cramer,0.9
Quercus bicolor,4,185,Cramer,
Quercus bicolor,5,200,Cramer,
Quercus bicolor,6,230,Cramer,
Quercus bicolor,7,260,Cramer,
Quercus bicolor,8,300,Cramer,
Quercus bicolor,9,350,Cramer,
Quercus bicolor,10,425,Cramer,0.85
Quercus coccinea,4,185,Cramer,
Quercus coccinea,5,200,Cramer,
Quercus coccinea,6,230,Cramer,
Quercus coccinea,7,260,Cramer,
Quercus coccinea,8,300,Cramer,
Quercus coccinea,9,350,Cramer,
Quercus coccinea,10,425,Cramer,0.85
Quercus ellipsoidalis,4,185,estimé,
Quercus ellipsoidalis,5,200,estimé,
Quercus ellipsoidalis,6,230,estimé,
Quercus ellipsoidalis,7,260,estimé,
Quercus ellipsoidalis,8,300,estimé,
Quercus ellipsoidalis,9,350,estimé,
Quercus ellipsoidalis,10,425,estimé,0.85
Quercus imbricaria,4,185,estimé,
Quercus imbricaria,5,200,estimé,
Quercus imbricaria,6,230,estimé,
Quercus imbricaria,7,260,estimé,
Quercus imbricaria,8,300,estimé,
Quercus imbricaria,9,350,estimé,
Quercus imbricaria,10,425,estimé,0.85
Quercus macrocarpa,4,185,Cramer,
Quercus macrocarpa,5,200,Cramer,
Quercus macrocarpa,6,230,Cramer,
Quercus macrocarpa,7,260,Cramer,
Quercus macrocarpa,8,300,Cramer,
Quercus macrocarpa,9,350,Cramer,
Quercus macrocarpa,10,425,Cramer,0.9
Quercus muehlenbergii,4,185,estimé,
Quercus muehlenbergii,5,200,estimé,
Quercus muehlenbergii,6,230,estimé,
Quercus muehlenbergii,7,260,estimé,
Quercus muehlenbergii,8,300,estimé,
Quercus muehlenbergii,9,350,estimé,
Quercus muehlenbergii,10,425,estimé,0.85
Quercus palustris,4,185,Cramer,
Quercus palustris,5,200,Cramer,
Quercus palustris,6,230,Cramer,
Quercus palustris,7,260,Cramer,
Quercus palustris,8,300,Cramer,
Quercus palustris,9,350,Cramer,
Quercus palustris,10,425,Cramer,0.85
Quercus robur,4,185,Cramer,
Quercus robur,5,200,Cramer,
Quercus robur,6,230,Cramer,
Quercus robur,7,260,Cramer,
Quercus robur,8,300,Cramer,
Quercus robur,9,350,Cramer,
Quercus robur,10,425,Cramer,0.85
Quercus rubra,4,185,Cramer,
Quercus rubra,5,200,Cramer,
Quercus rubra,6,230,Cramer,
Quercus rubra,7,260,Cramer,
Quercus rubra,8,300,Cramer,
Quercus rubra,9,350,Cramer,
Quercus rubra,10,425,Cramer,0.9
Quercus sp.,4,185,Cramer,
Quercus sp.,5,200,Cramer,
Quercus sp.,6,230,Cramer,
Quercus sp.,7,260,Cramer,
Quercus sp.,8,300,Cramer,
Quercus sp.,9,350,Cramer,
Quercus sp.,10,425,Cramer,0.85
Quercus x,4,185,Cramer,
Quercus x,5,200,Cramer,
Quercus x,6,230,Cramer,
Quercus x,7,260,Cramer,
Quercus x,8,300,Cramer,
Quercus x,9,350,Cramer,
Quercus x,10,425,Cramer,0.85
Rhus sp.,5,150,Cramer,
Rhus sp.,6,170,Cramer,
Rhus sp.,7,210,Cramer,0.25
Rhus typhina,5,150,Cramer,
Rhus typhina,6,170,Cramer,
Rhus typhina,7,210,Cramer,0.25
Robinia pseudoacacia,4,195,Dutchmaster,
Robinia pseudoacacia,5,220,Dutchmaster,
Robinia pseudoacacia,6,240,Dutchmaster,0.25
Robinia sp.,4,195,Dutchmaster,
Robinia sp.,5,220,Dutchmaster,
Robinia sp.,6,240,Dutchmaster,0.25
Salix alba,4,110,Cramer,
Salix alba,5,140,Cramer,
Salix alba,6,160,Cramer,
Salix alba,7,180,Cramer,
Salix alba,8,200,Cramer,
Salix alba,9,240,Cramer,
Salix alba,10,280,Cramer,0.45
Salix babylonica,4,124,estimé,
Salix babylonica,5,148,estimé,
Salix babylonica,6,170,estimé,
Salix babylonica,7,190,estimé,
Salix babylonica,8,200,estimé,
Salix babylonica,9,240,estimé,
Salix babylonica,10,290,estimé,0.45
Salix matsudana,4,125,Dutchmaster,
Salix matsudana,5,160,Dutchmaster,
Salix matsudana,6,185,Dutchmaster,
Salix matsudana,7,205,Dutchmaster,0.45
Salix nigra,4,115,Cramer,
Salix nigra,5,130,Cramer,
Salix nigra,6,150,Cramer,
Salix nigra,7,170,Cramer,
Salix nigra,8,200,Cramer,
Salix nigra,9,240,Cramer,
Salix nigra,10,300,Cramer,0.45
Salix pentendra,4,145,Dutchmaster,
Salix pentendra,5,160,Dutchmaster,
Salix pentendra,6,185,Dutchmaster,
Salix pentendra,7,205,Dutchmaster,0.45
Salix sp.,4,124,estimé,
Salix sp.,5,148,estimé,
Salix sp.,6,170,estimé,
Salix sp.,7,190,estimé,
Salix sp.,8,200,estimé,
Salix sp.,9,240,estimé,
Salix sp.,10,290,estimé,0.45
Salix x,4,157,estimé,
Salix x,5,177,estimé,
Salix x,6,209,estimé,
Salix x,7,246,estimé,
Salix x,8,162,estimé,
Salix x,9,194,estimé,
Salix x,10,230,estimé,0.45
Sorbus alnifolia,4,122,estimé,
Sorbus alnifolia,5,150,estimé,
Sorbus alnifolia,6,175,estimé,
Sorbus alnifolia,7,200,estimé,
Sorbus alnifolia,8,220,estimé,
Sorbus alnifolia,9,257,estimé,
Sorbus alnifolia,10,300,estimé,0.8
Sorbus americana,4,122,estimé,
Sorbus americana,5,150,estimé,
Sorbus americana,6,175,estimé,
Sorbus americana,7,200,estimé,
Sorbus americana,8,220,estimé,
Sorbus americana,9,257,estimé,
Sorbus americana,10,300,estimé,0.65
Sorbus aria,4,120,Cramer,
Sorbus aria,5,150,Cramer,
Sorbus aria,6,175,Cramer,
Sorbus aria,7,195,Cramer,
Sorbus aria,8,215,Cramer,
Sorbus aria,9,250,Cramer,
Sorbus aria,10,300,Cramer,0.65
Sorbus aucuparia,4,120,Cramer,
Sorbus aucuparia,5,150,Cramer,
Sorbus aucuparia,6,175,Cramer,
Sorbus aucuparia,7,195,Cramer,
Sorbus aucuparia,8,215,Cramer,
Sorbus aucuparia,9,250,Cramer,
Sorbus aucuparia,10,300,Cramer,0.65
Sorbus decora,4,122,estimé,
Sorbus decora,5,150,estimé,
Sorbus decora,6,175,estimé,
Sorbus decora,7,200,estimé,
Sorbus decora,8,220,estimé,
Sorbus decora,9,257,estimé,
Sorbus decora,10,300,estimé,0.65
Sorbus intermedia,4,122,estimé,
Sorbus intermedia,5,150,estimé,
Sorbus intermedia,6,175,estimé,
Sorbus intermedia,7,200,estimé,
Sorbus intermedia,8,220,estimé,
Sorbus intermedia,9,257,estimé,
Sorbus intermedia,10,300,estimé,0.65
Sorbus sp.,4,122,estimé,
Sorbus sp.,5,150,estimé,
Sorbus sp.,6,175,estimé,
Sorbus sp.,7,200,estimé,
Sorbus sp.,8,220,estimé,
Sorbus sp.,9,257,estimé,
Sorbus sp.,10,300,estimé,0.65
Sorbus thuringiaca,4,125,Cramer,
Sorbus thuringiaca,5,150,Cramer,
Sorbus thuringiaca,6,175,Cramer,
Sorbus thuringiaca,7,210,Cramer,
Sorbus thuringiaca,8,230,Cramer,
Sorbus thuringiaca,9,270,Cramer,0.65
Sorbus x,4,122,estimé,
Sorbus x,5,150,estimé,
Sorbus x,6,175,estimé,
Sorbus x,7,200,estimé,
Sorbus x,8,220,estimé,
Sorbus x,9,257,estimé,
Sorbus x,10,300,estimé,0.65
Syringa prestoniae,3,130,estimé via Syringa vulgaris,
Syringa prestoniae,4,170,estimé via Syringa vulgaris,0.8
Syringa reticulata,4,135,Cramer,
Syringa reticulata,5,175,Cramer,
Syringa reticulata,6,190,Cramer,
Syringa reticulata,7,230,Cramer,
Syringa reticulata,8,270,Cramer,
Syringa reticulata,9,320,estimé,
Syringa reticulata,10,370,Stevens Large Tree Sales,0.85
Syringa sp.,4,135,estimé selon S. reticulata,
Syringa sp.,5,175,estimé selon S. reticulata,
Syringa sp.,6,190,estimé selon S. reticulata,
Syringa sp.,7,230,estimé selon S. reticulata,
Syringa sp.,8,270,estimé selon S. reticulata,
Syringa sp.,9,320,estimé selon S. reticulata,
Syringa sp.,10,370,estimé selon S. reticulata,0.8
Syringa vulgaris,3,130,Dutchmaster,
Syringa vulgaris,4,170,Dutchmaster,0.75
Syringa x,3,130,estimé via Syringa vulgaris,
Syringa x,4,170,estimé via Syringa vulgaris,0.8
Taxus cuspidata,3,150,Cramer,0.65
Taxus sp.,3,150,Cramer,0.65
Thuja occidentalis,5,91,Cramer,
Thuja occidentalis,6,108,Cramer,
Thuja occidentalis,7,148,Cramer,
Thuja occidentalis,8,150,Cramer,
Thuja occidentalis,9,206,Cramer,0.75
Thuja sp.,5,91,Cramer,
Thuja sp.,6,108,Cramer,
Thuja sp.,7,148,Cramer,
Thuja sp.,8,150,Cramer,
Thuja sp.,9,206,Cramer,0.75
Tilia americana,4,135,Cramer,
Tilia americana,5,165,Cramer,
Tilia americana,6,190,Cramer,
Tilia americana,7,220,Cramer,
Tilia americana,8,260,Cramer,
Tilia americana,9,325,Cramer,
Tilia americana,10,375,Cramer,0.65
Tilia cordata,4,135,Cramer,
Tilia cordata,5,165,Cramer,
Tilia cordata,6,190,Cramer,
Tilia cordata,7,220,Cramer,
Tilia cordata,8,260,Cramer,
Tilia cordata,9,325,Cramer,
Tilia cordata,10,375,Cramer,0.75
Tilia mongolica,4,135,Cramer,
Tilia mongolica,5,165,Cramer,
Tilia mongolica,6,190,Cramer,
Tilia mongolica,7,220,Cramer,
Tilia mongolica,8,260,Cramer,
Tilia mongolica,9,325,Cramer,
Tilia mongolica,10,375,Cramer,0.7
Tilia sp.,4,135,Cramer,
Tilia sp.,5,165,Cramer,
Tilia sp.,6,190,Cramer,
Tilia sp.,7,220,Cramer,
Tilia sp.,8,260,Cramer,
Tilia sp.,9,325,Cramer,
Tilia sp.,10,375,Cramer,0.7
Tilia tomentosa,4,135,Cramer,
Tilia tomentosa,5,165,Cramer,
Tilia tomentosa,6,190,Cramer,
Tilia tomentosa,7,220,Cramer,
Tilia tomentosa,8,260,Cramer,
Tilia tomentosa,9,325,Cramer,
Tilia tomentosa,10,375,Cramer,0.75
Tilia x,4,135,Cramer,
Tilia x,5,165,Cramer,
Tilia x,6,190,Cramer,
Tilia x,7,220,Cramer,
Tilia x,8,260,Cramer,
Tilia x,9,325,Cramer,
Tilia x,10,375,Cramer,0.7
Tsuga canadensis,5,220,Dutchmaster,
Tsuga canadensis,6,340,Dutchmaster,0.65
Ulmus americana,4,140,Cramer,
Ulmus americana,5,180,Cramer,
Ulmus americana,6,210,Cramer,
Ulmus americana,7,230,Cramer,
Ulmus americana,8,275,Cramer,
Ulmus americana,9,325,Cramer,
Ulmus americana,10,375,Cramer,0.55
Ulmus glabra,5,235,Dutchmaster,
Ulmus glabra,6,285,Dutchmaster,
Ulmus glabra,7,305,Dutchmaster,0.75
Ulmus parvifolia,4,140,Cramer,
Ulmus parvifolia,5,180,Cramer,
Ulmus parvifolia,6,210,Cramer,
Ulmus parvifolia,7,230,Cramer,
Ulmus parvifolia,8,275,Cramer,
Ulmus parvifolia,9,325,Cramer,
Ulmus parvifolia,10,375,Cramer,0.65
Ulmus propinqua,4,185,Dutchmaster,
Ulmus propinqua,5,220,Dutchmaster,
Ulmus propinqua,6,240,Dutchmaster,
Ulmus propinqua,7,305,Dutchmaster,
Ulmus propinqua,8,350,Dutchmaster,0.75
Ulmus pumila,4,120,Cramer,
Ulmus pumila,5,150,Cramer,
Ulmus pumila,6,170,Cramer,
Ulmus pumila,7,190,Cramer,
Ulmus pumila,8,230,Cramer,
Ulmus pumila,9,270,Cramer,
Ulmus pumila,10,330,Cramer,0.45
Ulmus rubra,4,144,estimé,
Ulmus rubra,5,189,estimé,
Ulmus rubra,6,219,estimé,
Ulmus rubra,7,246,estimé,
Ulmus rubra,8,280,estimé,
Ulmus rubra,9,314,estimé,
Ulmus rubra,10,366,estimé,0.55
Ulmus sp.,4,144,estimé,
Ulmus sp.,5,189,estimé,
Ulmus sp.,6,219,estimé,
Ulmus sp.,7,246,estimé,
Ulmus sp.,8,280,estimé,
Ulmus sp.,9,314,estimé,0.65
Ulmus thomasii,10,366,estimé,
Ulmus thomasii,4,144,estimé,
Ulmus thomasii,5,189,estimé,
Ulmus thomasii,6,219,estimé,
Ulmus thomasii,7,246,estimé,
Ulmus thomasii,8,280,estimé,
Ulmus thomasii,9,314,estimé,
Ulmus thomasii,10,366,estimé,0.55
Ulmus wilsoniana,4,140,Cramer,
Ulmus wilsoniana,5,180,Cramer,
Ulmus wilsoniana,6,210,Cramer,
Ulmus wilsoniana,7,230,Cramer,
Ulmus wilsoniana,8,275,Cramer,
Ulmus wilsoniana,9,325,Cramer,
Ulmus wilsoniana,10,375,Cramer,0.75
Ulmus x,4,140,Cramer,
Ulmus x,5,180,Cramer,
Ulmus x,6,210,Cramer,
Ulmus x,7,230,Cramer,
Ulmus x,8,275,Cramer,
Ulmus x,9,325,Cramer,
Ulmus x,10,375,Cramer,0.75
Zelkova serrata,4,170,Environs,
Zelkova serrata,5,220,Environs,
Zelkova serrata,6,258,estimé,
Zelkova serrata,7,295,Environs,
Zelkova serrata,8,325,Environs,0.75
