
Process has started
Process ID: 20682, process group ID: 1000, process session ID: 14618
Process is running...
Process is running...
Process is running...
Signal 1:
	si_signo: 1
	si_code: 0
	si_pid: 18611
	si_uid: 1000
	si_status: 0
Process is running...
Process is running...
Signal 1:
	si_signo: 1
	si_code: 0
	si_pid: 18611
	si_uid: 1000
	si_status: 0
Process is running...
Signal 1:
	si_signo: 1
	si_code: 0
	si_pid: 18611
	si_uid: 1000
	si_status: 0
Process is running...