\relax 
\providecommand\hyper@newdestlabel[2]{}
\providecommand\HyperFirstAtBeginDocument{\AtBeginDocument}
\HyperFirstAtBeginDocument{\ifx\hyper@anchor\@undefined
\global\let\oldcontentsline\contentsline
\gdef\contentsline#1#2#3#4{\oldcontentsline{#1}{#2}{#3}}
\global\let\oldnewlabel\newlabel
\gdef\newlabel#1#2{\newlabelxx{#1}#2}
\gdef\newlabelxx#1#2#3#4#5#6{\oldnewlabel{#1}{{#2}{#3}}}
\AtEndDocument{\ifx\hyper@anchor\@undefined
\let\contentsline\oldcontentsline
\let\newlabel\oldnewlabel
\fi}
\fi}
\global\let\hyper@last\relax 
\gdef\HyperFirstAtBeginDocument#1{#1}
\providecommand\HyField@AuxAddToFields[1]{}
\providecommand\HyField@AuxAddToCoFields[2]{}
\providecommand \oddpage@label [2]{}
\@writefile{toc}{\@ifundefined {etoctocstyle}{\let \etoc@startlocaltoc \@gobble \let \etoc@settocdepth \@gobble \let \etoc@depthtag \@gobble \let \etoc@setlocaltop \@gobble }{}}
\@writefile{toc}{\contentsline {chapter}{\numberline {1}Hierarchical Index}{1}{chapter.1}\protected@file@percent }
\@writefile{lof}{\addvspace {10\p@ }}
\@writefile{lot}{\addvspace {10\p@ }}
\@writefile{toc}{\contentsline {section}{\numberline {1.1}Class Hierarchy}{1}{section.1.1}\protected@file@percent }
\@writefile{toc}{\contentsline {chapter}{\numberline {2}Class Index}{3}{chapter.2}\protected@file@percent }
\@writefile{lof}{\addvspace {10\p@ }}
\@writefile{lot}{\addvspace {10\p@ }}
\@writefile{toc}{\contentsline {section}{\numberline {2.1}Class List}{3}{section.2.1}\protected@file@percent }
\@writefile{toc}{\contentsline {chapter}{\numberline {3}Class Documentation}{5}{chapter.3}\protected@file@percent }
\@writefile{lof}{\addvspace {10\p@ }}
\@writefile{lot}{\addvspace {10\p@ }}
\@writefile{toc}{\contentsline {section}{\numberline {3.1}Car.\discretionary {\mbox  {\scriptsize  $\hookleftarrow  $}}{}{}Car Class Reference}{5}{section.3.1}\protected@file@percent }
\newlabel{classCar_1_1Car}{{3.1}{5}{Car.\+Car Class Reference}{section.3.1}{}}
\newlabel{classCar_1_1Car_af992e2b3a404103e43008463e3ee5ac3}{{3.1}{5}{Public Attributes}{section*.2}{}}
\newlabel{classCar_1_1Car_a18c3cc33b0b97a0a35f5c3da7d61f9f2}{{3.1}{5}{Public Attributes}{section*.2}{}}
\newlabel{classCar_1_1Car_ad8dfa647586274cb3fc1253d98bb81dd}{{3.1}{5}{Public Attributes}{section*.2}{}}
\newlabel{classCar_1_1Car_adea503b30cbfabe92f01640ef7cf785c}{{3.1}{5}{Public Attributes}{section*.2}{}}
\@writefile{toc}{\contentsline {subsection}{\numberline {3.1.1}Constructor \& Destructor Documentation}{5}{subsection.3.1.1}\protected@file@percent }
\newlabel{classCar_1_1Car_a06b56c5efe7ccb56f4ba6dc00067db1a}{{3.1.1}{5}{Constructor \& Destructor Documentation}{subsection.3.1.1}{}}
\@writefile{toc}{\contentsline {subsubsection}{\numberline {3.1.1.1}\_\_init\_\_()}{6}{subsubsection.3.1.1.1}\protected@file@percent }
\newlabel{classCar_1_1Car_a2d9f61dd42566e52af4ff87a38e35e70}{{3.1.1.1}{6}{\texorpdfstring {\_\_init\_\_()}{\_\_init\_\_()}}{subsubsection.3.1.1.1}{}}
\@writefile{toc}{\contentsline {subsubsection}{\numberline {3.1.1.2}\_\_del\_\_()}{6}{subsubsection.3.1.1.2}\protected@file@percent }
\@writefile{toc}{\contentsline {subsection}{\numberline {3.1.2}Member Function Documentation}{6}{subsection.3.1.2}\protected@file@percent }
\newlabel{classCar_1_1Car_adf3b69304a5474391c93bf3b36d72f22}{{3.1.2}{6}{Member Function Documentation}{subsection.3.1.2}{}}
\@writefile{toc}{\contentsline {subsubsection}{\numberline {3.1.2.1}\_\_repr\_\_()}{6}{subsubsection.3.1.2.1}\protected@file@percent }
\newlabel{classCar_1_1Car_aec0c1afb7df0a4f7876d8df3920f5970}{{3.1.2.1}{6}{\texorpdfstring {\_\_repr\_\_()}{\_\_repr\_\_()}}{subsubsection.3.1.2.1}{}}
\@writefile{toc}{\contentsline {subsubsection}{\numberline {3.1.2.2}get\_direction()}{6}{subsubsection.3.1.2.2}\protected@file@percent }
\newlabel{classCar_1_1Car_ad422c38711106143cea393eb4744193f}{{3.1.2.2}{6}{\texorpdfstring {get\_direction()}{get\_direction()}}{subsubsection.3.1.2.2}{}}
\@writefile{toc}{\contentsline {subsubsection}{\numberline {3.1.2.3}get\_opposite\_direction()}{7}{subsubsection.3.1.2.3}\protected@file@percent }
\newlabel{classCar_1_1Car_a7ef7b85e3a1378cc6d8d3d00383124c6}{{3.1.2.3}{7}{\texorpdfstring {get\_opposite\_direction()}{get\_opposite\_direction()}}{subsubsection.3.1.2.3}{}}
\@writefile{toc}{\contentsline {subsubsection}{\numberline {3.1.2.4}get\_velocity()}{7}{subsubsection.3.1.2.4}\protected@file@percent }
\newlabel{classCar_1_1Car_aadd1efe9374525d459da23aee75b0862}{{3.1.2.4}{7}{\texorpdfstring {get\_velocity()}{get\_velocity()}}{subsubsection.3.1.2.4}{}}
\@writefile{toc}{\contentsline {subsubsection}{\numberline {3.1.2.5}move()}{7}{subsubsection.3.1.2.5}\protected@file@percent }
\newlabel{classCar_1_1Car_a160b108e09dda6d64f5a5231c1729c07}{{3.1.2.5}{7}{\texorpdfstring {move()}{move()}}{subsubsection.3.1.2.5}{}}
\@writefile{toc}{\contentsline {subsubsection}{\numberline {3.1.2.6}set\_direction()}{7}{subsubsection.3.1.2.6}\protected@file@percent }
\newlabel{classCar_1_1Car_a4fd032ed8980a5c3accbdc103928e44e}{{3.1.2.6}{7}{\texorpdfstring {set\_direction()}{set\_direction()}}{subsubsection.3.1.2.6}{}}
\@writefile{toc}{\contentsline {subsubsection}{\numberline {3.1.2.7}set\_velocity()}{8}{subsubsection.3.1.2.7}\protected@file@percent }
\@writefile{toc}{\contentsline {section}{\numberline {3.2}configure.\discretionary {\mbox  {\scriptsize  $\hookleftarrow  $}}{}{}config Class Reference}{8}{section.3.2}\protected@file@percent }
\newlabel{classconfigure_1_1config}{{3.2}{8}{configure.\+config Class Reference}{section.3.2}{}}
\newlabel{classconfigure_1_1config_aec381128e5bd69c2e5c1055aa207c033}{{3.2}{8}{Public Attributes}{section*.4}{}}
\@writefile{toc}{\contentsline {subsection}{\numberline {3.2.1}Detailed Description}{8}{subsection.3.2.1}\protected@file@percent }
\@writefile{toc}{\contentsline {subsection}{\numberline {3.2.2}Constructor \& Destructor Documentation}{8}{subsection.3.2.2}\protected@file@percent }
\newlabel{classconfigure_1_1config_a113bc6fac40f3b6434d1e4a6161871fd}{{3.2.2}{8}{Constructor \& Destructor Documentation}{subsection.3.2.2}{}}
\@writefile{toc}{\contentsline {subsubsection}{\numberline {3.2.2.1}\_\_init\_\_()}{8}{subsubsection.3.2.2.1}\protected@file@percent }
\@writefile{toc}{\contentsline {section}{\numberline {3.3}Direction.\discretionary {\mbox  {\scriptsize  $\hookleftarrow  $}}{}{}Direction Class Reference}{9}{section.3.3}\protected@file@percent }
\newlabel{classDirection_1_1Direction}{{3.3}{9}{Direction.\+Direction Class Reference}{section.3.3}{}}
\newlabel{classDirection_1_1Direction_a210e306edec2feff99306da6f201f221}{{3.3}{9}{Static Public Attributes}{section*.6}{}}
\newlabel{classDirection_1_1Direction_a6a11e491ece472eb70fac732cadf61fb}{{3.3}{9}{Static Public Attributes}{section*.6}{}}
\newlabel{classDirection_1_1Direction_a6718fd69ce1c1375c97f540166f28814}{{3.3}{9}{Static Public Attributes}{section*.6}{}}
\newlabel{classDirection_1_1Direction_a835bd87aa59f21d611652f6b7d7d162c}{{3.3}{9}{Static Public Attributes}{section*.6}{}}
\newlabel{classDirection_1_1Direction_a7273f71eb85eacb2473ddfb747552ac4}{{3.3}{9}{Static Public Attributes}{section*.6}{}}
\@writefile{toc}{\contentsline {subsection}{\numberline {3.3.1}Detailed Description}{9}{subsection.3.3.1}\protected@file@percent }
\@writefile{toc}{\contentsline {section}{\numberline {3.4}Motion.\discretionary {\mbox  {\scriptsize  $\hookleftarrow  $}}{}{}Motion Class Reference}{9}{section.3.4}\protected@file@percent }
\newlabel{classMotion_1_1Motion}{{3.4}{9}{Motion.\+Motion Class Reference}{section.3.4}{}}
\newlabel{classMotion_1_1Motion_a6180028842e2893d83dd857f085234bf}{{3.4}{10}{Public Attributes}{section*.8}{}}
\newlabel{classMotion_1_1Motion_af896b4d92a9eedecac1d698e3849de1c}{{3.4}{10}{Public Attributes}{section*.8}{}}
\newlabel{classMotion_1_1Motion_aa452aa953be03fa4867fc1518f5f36aa}{{3.4}{10}{Public Attributes}{section*.8}{}}
\newlabel{classMotion_1_1Motion_a42c1ddac6008da8d87c3895bcb7240a0}{{3.4}{10}{Public Attributes}{section*.8}{}}
\newlabel{classMotion_1_1Motion_a11b5037372bae70441e7855543729f17}{{3.4}{10}{Public Attributes}{section*.8}{}}
\newlabel{classMotion_1_1Motion_ab380574d83892d2937373421cde821e1}{{3.4}{10}{Public Attributes}{section*.8}{}}
\newlabel{classMotion_1_1Motion_a035bd3357d6d195be0c7ab0f7c5d6da1}{{3.4}{10}{Public Attributes}{section*.8}{}}
\newlabel{classMotion_1_1Motion_a139d52a534c71103169e3daa0772602d}{{3.4}{10}{Public Attributes}{section*.8}{}}
\@writefile{toc}{\contentsline {subsection}{\numberline {3.4.1}Detailed Description}{10}{subsection.3.4.1}\protected@file@percent }
\@writefile{toc}{\contentsline {subsection}{\numberline {3.4.2}Constructor \& Destructor Documentation}{10}{subsection.3.4.2}\protected@file@percent }
\newlabel{classMotion_1_1Motion_a5b14f16133a02be0bda8f603abbfac60}{{3.4.2}{10}{Constructor \& Destructor Documentation}{subsection.3.4.2}{}}
\@writefile{toc}{\contentsline {subsubsection}{\numberline {3.4.2.1}\_\_init\_\_()}{10}{subsubsection.3.4.2.1}\protected@file@percent }
\@writefile{toc}{\contentsline {subsection}{\numberline {3.4.3}Member Function Documentation}{10}{subsection.3.4.3}\protected@file@percent }
\newlabel{classMotion_1_1Motion_add00522f5d42bee565ec1184128f740c}{{3.4.3}{10}{Member Function Documentation}{subsection.3.4.3}{}}
\@writefile{toc}{\contentsline {subsubsection}{\numberline {3.4.3.1}nagel\_down()}{10}{subsubsection.3.4.3.1}\protected@file@percent }
\newlabel{classMotion_1_1Motion_ae7667aec216f2492e82be98c1e9380d7}{{3.4.3.1}{10}{\texorpdfstring {nagel\_down()}{nagel\_down()}}{subsubsection.3.4.3.1}{}}
\@writefile{toc}{\contentsline {subsubsection}{\numberline {3.4.3.2}nagel\_left()}{11}{subsubsection.3.4.3.2}\protected@file@percent }
\newlabel{classMotion_1_1Motion_a6bc8f921cc19dfb6de9b256be4420315}{{3.4.3.2}{11}{\texorpdfstring {nagel\_left()}{nagel\_left()}}{subsubsection.3.4.3.2}{}}
\@writefile{toc}{\contentsline {subsubsection}{\numberline {3.4.3.3}nagel\_right()}{11}{subsubsection.3.4.3.3}\protected@file@percent }
\newlabel{classMotion_1_1Motion_a3812c4cd45e1ee03518952cfa2a25e23}{{3.4.3.3}{11}{\texorpdfstring {nagel\_right()}{nagel\_right()}}{subsubsection.3.4.3.3}{}}
\@writefile{toc}{\contentsline {subsubsection}{\numberline {3.4.3.4}nagel\_up()}{11}{subsubsection.3.4.3.4}\protected@file@percent }
\newlabel{classMotion_1_1Motion_a40ebea6a49665a063330420fccee539b}{{3.4.3.4}{11}{\texorpdfstring {nagel\_up()}{nagel\_up()}}{subsubsection.3.4.3.4}{}}
\@writefile{toc}{\contentsline {subsubsection}{\numberline {3.4.3.5}spawn()}{11}{subsubsection.3.4.3.5}\protected@file@percent }
\@writefile{toc}{\contentsline {section}{\numberline {3.5}Rnd.\discretionary {\mbox  {\scriptsize  $\hookleftarrow  $}}{}{}Rnd Class Reference}{12}{section.3.5}\protected@file@percent }
\newlabel{classRnd_1_1Rnd}{{3.5}{12}{Rnd.\+Rnd Class Reference}{section.3.5}{}}
\@writefile{toc}{\contentsline {subsection}{\numberline {3.5.1}Detailed Description}{12}{subsection.3.5.1}\protected@file@percent }
\@writefile{toc}{\contentsline {subsection}{\numberline {3.5.2}Member Function Documentation}{12}{subsection.3.5.2}\protected@file@percent }
\newlabel{classRnd_1_1Rnd_a916a08c5f0182836f5f5490b85103be9}{{3.5.2}{12}{Member Function Documentation}{subsection.3.5.2}{}}
\@writefile{toc}{\contentsline {subsubsection}{\numberline {3.5.2.1}rand\_range()}{12}{subsubsection.3.5.2.1}\protected@file@percent }
\newlabel{classRnd_1_1Rnd_a86a171d146418819dab104d743bde50b}{{3.5.2.1}{12}{\texorpdfstring {rand\_range()}{rand\_range()}}{subsubsection.3.5.2.1}{}}
\@writefile{toc}{\contentsline {subsubsection}{\numberline {3.5.2.2}random\_pick()}{12}{subsubsection.3.5.2.2}\protected@file@percent }
\newlabel{classRnd_1_1Rnd_ab2e6d2915d3e79f12a6ce9ca8ffcab5d}{{3.5.2.2}{12}{\texorpdfstring {random\_pick()}{random\_pick()}}{subsubsection.3.5.2.2}{}}
\@writefile{toc}{\contentsline {subsubsection}{\numberline {3.5.2.3}rule\_break()}{13}{subsubsection.3.5.2.3}\protected@file@percent }
\newlabel{classRnd_1_1Rnd_a611100c9b05808d6d34459818e327e22}{{3.5.2.3}{13}{\texorpdfstring {rule\_break()}{rule\_break()}}{subsubsection.3.5.2.3}{}}
\@writefile{toc}{\contentsline {subsubsection}{\numberline {3.5.2.4}slow\_down()}{13}{subsubsection.3.5.2.4}\protected@file@percent }
\newlabel{classRnd_1_1Rnd_a8641357654f8d9bd794d68dee6db7dc8}{{3.5.2.4}{13}{\texorpdfstring {slow\_down()}{slow\_down()}}{subsubsection.3.5.2.4}{}}
\@writefile{toc}{\contentsline {subsubsection}{\numberline {3.5.2.5}spawn\_car()}{13}{subsubsection.3.5.2.5}\protected@file@percent }
\newlabel{classRnd_1_1Rnd_abe044fb113e2e7bf6db0f4d7601a419c}{{3.5.2.5}{13}{\texorpdfstring {spawn\_car()}{spawn\_car()}}{subsubsection.3.5.2.5}{}}
\@writefile{toc}{\contentsline {subsubsection}{\numberline {3.5.2.6}speed\_up()}{13}{subsubsection.3.5.2.6}\protected@file@percent }
\@writefile{toc}{\contentsline {section}{\numberline {3.6}Road.\discretionary {\mbox  {\scriptsize  $\hookleftarrow  $}}{}{}Road Class Reference}{14}{section.3.6}\protected@file@percent }
\newlabel{classRoad_1_1Road}{{3.6}{14}{Road.\+Road Class Reference}{section.3.6}{}}
\newlabel{classRoad_1_1Road_af9ff55b8cfe37e447e3897efc05d8168}{{3.6}{14}{Public Attributes}{section*.11}{}}
\@writefile{toc}{\contentsline {subsection}{\numberline {3.6.1}Detailed Description}{14}{subsection.3.6.1}\protected@file@percent }
\@writefile{toc}{\contentsline {subsection}{\numberline {3.6.2}Constructor \& Destructor Documentation}{14}{subsection.3.6.2}\protected@file@percent }
\newlabel{classRoad_1_1Road_a30eb9093e5ae2f2ba2b489b85f8b35da}{{3.6.2}{14}{Constructor \& Destructor Documentation}{subsection.3.6.2}{}}
\@writefile{toc}{\contentsline {subsubsection}{\numberline {3.6.2.1}\_\_init\_\_()}{14}{subsubsection.3.6.2.1}\protected@file@percent }
\@writefile{toc}{\contentsline {subsection}{\numberline {3.6.3}Member Function Documentation}{14}{subsection.3.6.3}\protected@file@percent }
\newlabel{classRoad_1_1Road_a9d1c7f66d905545bbfe73c4cf7006c11}{{3.6.3}{14}{Member Function Documentation}{subsection.3.6.3}{}}
\@writefile{toc}{\contentsline {subsubsection}{\numberline {3.6.3.1}show()}{14}{subsubsection.3.6.3.1}\protected@file@percent }
\@writefile{toc}{\contentsline {section}{\numberline {3.7}Tiles.\discretionary {\mbox  {\scriptsize  $\hookleftarrow  $}}{}{}Tiles Class Reference}{15}{section.3.7}\protected@file@percent }
\newlabel{classTiles_1_1Tiles}{{3.7}{15}{Tiles.\+Tiles Class Reference}{section.3.7}{}}
\newlabel{classTiles_1_1Tiles_aadd767127b0dd0107ea2519a34d4404e}{{3.7}{15}{Public Attributes}{section*.13}{}}
\newlabel{classTiles_1_1Tiles_a9e7ecbcb393d283567ab30bc9f66b1a9}{{3.7}{15}{Public Attributes}{section*.13}{}}
\newlabel{classTiles_1_1Tiles_a240c5c3f63438346423743a43fd7e1f8}{{3.7}{15}{Public Attributes}{section*.13}{}}
\newlabel{classTiles_1_1Tiles_a68dcae6aa756d3f94773785d83127d08}{{3.7}{15}{Public Attributes}{section*.13}{}}
\newlabel{classTiles_1_1Tiles_a5336c45b4cbb4da1acc9c8b22ee768e5}{{3.7}{15}{Public Attributes}{section*.13}{}}
\newlabel{classTiles_1_1Tiles_a9b7755b3905fae91b679afa429a9ad38}{{3.7}{15}{Public Attributes}{section*.13}{}}
\newlabel{classTiles_1_1Tiles_a5507d373d2ec05c9dfaa6dfe0a6cade7}{{3.7}{15}{Public Attributes}{section*.13}{}}
\@writefile{toc}{\contentsline {subsection}{\numberline {3.7.1}Detailed Description}{15}{subsection.3.7.1}\protected@file@percent }
\@writefile{toc}{\contentsline {subsection}{\numberline {3.7.2}Constructor \& Destructor Documentation}{15}{subsection.3.7.2}\protected@file@percent }
\newlabel{classTiles_1_1Tiles_a7c85a4a169aad0f10632c14d8ca0c9f2}{{3.7.2}{15}{Constructor \& Destructor Documentation}{subsection.3.7.2}{}}
\@writefile{toc}{\contentsline {subsubsection}{\numberline {3.7.2.1}\_\_init\_\_()}{15}{subsubsection.3.7.2.1}\protected@file@percent }
\@writefile{toc}{\contentsline {subsection}{\numberline {3.7.3}Member Function Documentation}{15}{subsection.3.7.3}\protected@file@percent }
\newlabel{classTiles_1_1Tiles_a3a8eb0a7d44006ffe8c1773dae493698}{{3.7.3}{15}{Member Function Documentation}{subsection.3.7.3}{}}
\@writefile{toc}{\contentsline {subsubsection}{\numberline {3.7.3.1}\_\_repr\_\_()}{16}{subsubsection.3.7.3.1}\protected@file@percent }
\@writefile{toc}{\contentsline {section}{\numberline {3.8}traffic\discretionary {\mbox  {\scriptsize  $\hookleftarrow  $}}{}{}\_\discretionary {\mbox  {\scriptsize  $\hookleftarrow  $}}{}{}light.\discretionary {\mbox  {\scriptsize  $\hookleftarrow  $}}{}{}traffic\discretionary {\mbox  {\scriptsize  $\hookleftarrow  $}}{}{}\_\discretionary {\mbox  {\scriptsize  $\hookleftarrow  $}}{}{}light Class Reference}{16}{section.3.8}\protected@file@percent }
\newlabel{classtraffic__light_1_1traffic__light}{{3.8}{16}{traffic\+\_\+light.\+traffic\+\_\+light Class Reference}{section.3.8}{}}
\newlabel{classtraffic__light_1_1traffic__light_ad54c8dabbdc32d7d6a78bb6ffdcbada6}{{3.8}{16}{Public Attributes}{section*.15}{}}
\newlabel{classtraffic__light_1_1traffic__light_a32c8bc631a05413154d63bb7c58f53ba}{{3.8}{16}{Public Attributes}{section*.15}{}}
\newlabel{classtraffic__light_1_1traffic__light_a5f443b2fe69c010cca0e700e75285b98}{{3.8}{16}{Public Attributes}{section*.15}{}}
\newlabel{classtraffic__light_1_1traffic__light_a7acd3c4e607995e5d9e0abda933cbe73}{{3.8}{16}{Static Public Attributes}{section*.16}{}}
\newlabel{classtraffic__light_1_1traffic__light_a4f4644ca5fab22c9215240b12f781da6}{{3.8}{16}{Static Public Attributes}{section*.16}{}}
\@writefile{toc}{\contentsline {subsection}{\numberline {3.8.1}Detailed Description}{16}{subsection.3.8.1}\protected@file@percent }
\@writefile{toc}{\contentsline {subsection}{\numberline {3.8.2}Constructor \& Destructor Documentation}{16}{subsection.3.8.2}\protected@file@percent }
\newlabel{classtraffic__light_1_1traffic__light_aa45d38121a8c8bbb68ce12d489396a61}{{3.8.2}{16}{Constructor \& Destructor Documentation}{subsection.3.8.2}{}}
\@writefile{toc}{\contentsline {subsubsection}{\numberline {3.8.2.1}\_\_init\_\_()}{17}{subsubsection.3.8.2.1}\protected@file@percent }
\@writefile{toc}{\contentsline {subsection}{\numberline {3.8.3}Member Function Documentation}{17}{subsection.3.8.3}\protected@file@percent }
\newlabel{classtraffic__light_1_1traffic__light_a119b518fa08ac411763cc0a289523c81}{{3.8.3}{17}{Member Function Documentation}{subsection.3.8.3}{}}
\@writefile{toc}{\contentsline {subsubsection}{\numberline {3.8.3.1}get\_light()}{17}{subsubsection.3.8.3.1}\protected@file@percent }
\newlabel{classtraffic__light_1_1traffic__light_a9701e27cd712f77caab2e4f1d06879ed}{{3.8.3.1}{17}{\texorpdfstring {get\_light()}{get\_light()}}{subsubsection.3.8.3.1}{}}
\@writefile{toc}{\contentsline {subsubsection}{\numberline {3.8.3.2}set\_light()}{17}{subsubsection.3.8.3.2}\protected@file@percent }
\newlabel{classtraffic__light_1_1traffic__light_a095254c480b2b34bddf1ac239a75322d}{{3.8.3.2}{17}{\texorpdfstring {set\_light()}{set\_light()}}{subsubsection.3.8.3.2}{}}
\@writefile{toc}{\contentsline {subsubsection}{\numberline {3.8.3.3}tick()}{17}{subsubsection.3.8.3.3}\protected@file@percent }
\@writefile{toc}{\contentsline {section}{\numberline {3.9}Traffic\discretionary {\mbox  {\scriptsize  $\hookleftarrow  $}}{}{}Light.\discretionary {\mbox  {\scriptsize  $\hookleftarrow  $}}{}{}traffic\discretionary {\mbox  {\scriptsize  $\hookleftarrow  $}}{}{}\_\discretionary {\mbox  {\scriptsize  $\hookleftarrow  $}}{}{}light Class Reference}{18}{section.3.9}\protected@file@percent }
\newlabel{classTrafficLight_1_1traffic__light}{{3.9}{18}{Traffic\+Light.\+traffic\+\_\+light Class Reference}{section.3.9}{}}
\newlabel{classTrafficLight_1_1traffic__light_aada568d315a65fb9d91a78565469287a}{{3.9}{18}{Public Attributes}{section*.18}{}}
\newlabel{classTrafficLight_1_1traffic__light_a00c25a4169499885eeaef836008f07de}{{3.9}{18}{Public Attributes}{section*.18}{}}
\newlabel{classTrafficLight_1_1traffic__light_a8ec6668a92e5699e846bfe8d311a02e5}{{3.9}{18}{Public Attributes}{section*.18}{}}
\newlabel{classTrafficLight_1_1traffic__light_aa1c908e60c5194102d86c091c9011efe}{{3.9}{18}{Public Attributes}{section*.18}{}}
\newlabel{classTrafficLight_1_1traffic__light_a980808cf2225a59fa253a0d5362b3a8a}{{3.9}{18}{Public Attributes}{section*.18}{}}
\newlabel{classTrafficLight_1_1traffic__light_ad56168a4c346806685a40413b3951b68}{{3.9}{18}{Public Attributes}{section*.18}{}}
\newlabel{classTrafficLight_1_1traffic__light_a5f1f524f8a47dc66fbd317c20ef466b2}{{3.9}{18}{Public Attributes}{section*.18}{}}
\newlabel{classTrafficLight_1_1traffic__light_a3140f8052ea6ea755b97a5f17d86d5e9}{{3.9}{18}{Public Attributes}{section*.18}{}}
\newlabel{classTrafficLight_1_1traffic__light_a291a052542803ebfeb433b523d5133dd}{{3.9}{18}{Public Attributes}{section*.18}{}}
\newlabel{classTrafficLight_1_1traffic__light_aefe9f921775b96c733e5275090677980}{{3.9}{18}{Public Attributes}{section*.18}{}}
\@writefile{toc}{\contentsline {subsection}{\numberline {3.9.1}Detailed Description}{18}{subsection.3.9.1}\protected@file@percent }
\@writefile{toc}{\contentsline {subsection}{\numberline {3.9.2}Constructor \& Destructor Documentation}{18}{subsection.3.9.2}\protected@file@percent }
\newlabel{classTrafficLight_1_1traffic__light_af320a7c90844b4c5e04927da93ff7698}{{3.9.2}{18}{Constructor \& Destructor Documentation}{subsection.3.9.2}{}}
\@writefile{toc}{\contentsline {subsubsection}{\numberline {3.9.2.1}\_\_init\_\_()}{18}{subsubsection.3.9.2.1}\protected@file@percent }
\@writefile{toc}{\contentsline {subsection}{\numberline {3.9.3}Member Function Documentation}{19}{subsection.3.9.3}\protected@file@percent }
\newlabel{classTrafficLight_1_1traffic__light_aa78d158ad984303ba8f6d5347a28dcae}{{3.9.3}{19}{Member Function Documentation}{subsection.3.9.3}{}}
\@writefile{toc}{\contentsline {subsubsection}{\numberline {3.9.3.1}get\_color()}{19}{subsubsection.3.9.3.1}\protected@file@percent }
\newlabel{classTrafficLight_1_1traffic__light_a30a999052644d19f11d7f3da6d6ae62a}{{3.9.3.1}{19}{\texorpdfstring {get\_color()}{get\_color()}}{subsubsection.3.9.3.1}{}}
\@writefile{toc}{\contentsline {subsubsection}{\numberline {3.9.3.2}tick()}{19}{subsubsection.3.9.3.2}\protected@file@percent }
\@writefile{toc}{\contentsline {chapter}{Index}{21}{section*.19}\protected@file@percent }
\gdef \@abspage@last{26}
