\@ifundefined {etoctocstyle}{\let \etoc@startlocaltoc \@gobble \let \etoc@settocdepth \@gobble \let \etoc@depthtag \@gobble \let \etoc@setlocaltop \@gobble }{}
\contentsline {chapter}{\numberline {1}Hierarchical Index}{1}{chapter.1}%
\contentsline {section}{\numberline {1.1}Class Hierarchy}{1}{section.1.1}%
\contentsline {chapter}{\numberline {2}Class Index}{3}{chapter.2}%
\contentsline {section}{\numberline {2.1}Class List}{3}{section.2.1}%
\contentsline {chapter}{\numberline {3}Class Documentation}{5}{chapter.3}%
\contentsline {section}{\numberline {3.1}Car.\discretionary {\mbox {\scriptsize $\hookleftarrow $}}{}{}Car Class Reference}{5}{section.3.1}%
\contentsline {subsection}{\numberline {3.1.1}Constructor \& Destructor Documentation}{5}{subsection.3.1.1}%
\contentsline {subsubsection}{\numberline {3.1.1.1}\_\_init\_\_()}{6}{subsubsection.3.1.1.1}%
\contentsline {subsubsection}{\numberline {3.1.1.2}\_\_del\_\_()}{6}{subsubsection.3.1.1.2}%
\contentsline {subsection}{\numberline {3.1.2}Member Function Documentation}{6}{subsection.3.1.2}%
\contentsline {subsubsection}{\numberline {3.1.2.1}\_\_repr\_\_()}{6}{subsubsection.3.1.2.1}%
\contentsline {subsubsection}{\numberline {3.1.2.2}get\_direction()}{6}{subsubsection.3.1.2.2}%
\contentsline {subsubsection}{\numberline {3.1.2.3}get\_opposite\_direction()}{7}{subsubsection.3.1.2.3}%
\contentsline {subsubsection}{\numberline {3.1.2.4}get\_velocity()}{7}{subsubsection.3.1.2.4}%
\contentsline {subsubsection}{\numberline {3.1.2.5}move()}{7}{subsubsection.3.1.2.5}%
\contentsline {subsubsection}{\numberline {3.1.2.6}set\_direction()}{7}{subsubsection.3.1.2.6}%
\contentsline {subsubsection}{\numberline {3.1.2.7}set\_velocity()}{8}{subsubsection.3.1.2.7}%
\contentsline {section}{\numberline {3.2}configure.\discretionary {\mbox {\scriptsize $\hookleftarrow $}}{}{}config Class Reference}{8}{section.3.2}%
\contentsline {subsection}{\numberline {3.2.1}Detailed Description}{8}{subsection.3.2.1}%
\contentsline {subsection}{\numberline {3.2.2}Constructor \& Destructor Documentation}{8}{subsection.3.2.2}%
\contentsline {subsubsection}{\numberline {3.2.2.1}\_\_init\_\_()}{8}{subsubsection.3.2.2.1}%
\contentsline {section}{\numberline {3.3}Direction.\discretionary {\mbox {\scriptsize $\hookleftarrow $}}{}{}Direction Class Reference}{9}{section.3.3}%
\contentsline {subsection}{\numberline {3.3.1}Detailed Description}{9}{subsection.3.3.1}%
\contentsline {section}{\numberline {3.4}Motion.\discretionary {\mbox {\scriptsize $\hookleftarrow $}}{}{}Motion Class Reference}{9}{section.3.4}%
\contentsline {subsection}{\numberline {3.4.1}Detailed Description}{10}{subsection.3.4.1}%
\contentsline {subsection}{\numberline {3.4.2}Constructor \& Destructor Documentation}{10}{subsection.3.4.2}%
\contentsline {subsubsection}{\numberline {3.4.2.1}\_\_init\_\_()}{10}{subsubsection.3.4.2.1}%
\contentsline {subsection}{\numberline {3.4.3}Member Function Documentation}{10}{subsection.3.4.3}%
\contentsline {subsubsection}{\numberline {3.4.3.1}nagel\_down()}{10}{subsubsection.3.4.3.1}%
\contentsline {subsubsection}{\numberline {3.4.3.2}nagel\_left()}{11}{subsubsection.3.4.3.2}%
\contentsline {subsubsection}{\numberline {3.4.3.3}nagel\_right()}{11}{subsubsection.3.4.3.3}%
\contentsline {subsubsection}{\numberline {3.4.3.4}nagel\_up()}{11}{subsubsection.3.4.3.4}%
\contentsline {subsubsection}{\numberline {3.4.3.5}spawn()}{11}{subsubsection.3.4.3.5}%
\contentsline {section}{\numberline {3.5}Rnd.\discretionary {\mbox {\scriptsize $\hookleftarrow $}}{}{}Rnd Class Reference}{12}{section.3.5}%
\contentsline {subsection}{\numberline {3.5.1}Detailed Description}{12}{subsection.3.5.1}%
\contentsline {subsection}{\numberline {3.5.2}Member Function Documentation}{12}{subsection.3.5.2}%
\contentsline {subsubsection}{\numberline {3.5.2.1}rand\_range()}{12}{subsubsection.3.5.2.1}%
\contentsline {subsubsection}{\numberline {3.5.2.2}random\_pick()}{12}{subsubsection.3.5.2.2}%
\contentsline {subsubsection}{\numberline {3.5.2.3}rule\_break()}{13}{subsubsection.3.5.2.3}%
\contentsline {subsubsection}{\numberline {3.5.2.4}slow\_down()}{13}{subsubsection.3.5.2.4}%
\contentsline {subsubsection}{\numberline {3.5.2.5}spawn\_car()}{13}{subsubsection.3.5.2.5}%
\contentsline {subsubsection}{\numberline {3.5.2.6}speed\_up()}{13}{subsubsection.3.5.2.6}%
\contentsline {section}{\numberline {3.6}Road.\discretionary {\mbox {\scriptsize $\hookleftarrow $}}{}{}Road Class Reference}{14}{section.3.6}%
\contentsline {subsection}{\numberline {3.6.1}Detailed Description}{14}{subsection.3.6.1}%
\contentsline {subsection}{\numberline {3.6.2}Constructor \& Destructor Documentation}{14}{subsection.3.6.2}%
\contentsline {subsubsection}{\numberline {3.6.2.1}\_\_init\_\_()}{14}{subsubsection.3.6.2.1}%
\contentsline {subsection}{\numberline {3.6.3}Member Function Documentation}{14}{subsection.3.6.3}%
\contentsline {subsubsection}{\numberline {3.6.3.1}show()}{14}{subsubsection.3.6.3.1}%
\contentsline {section}{\numberline {3.7}Tiles.\discretionary {\mbox {\scriptsize $\hookleftarrow $}}{}{}Tiles Class Reference}{15}{section.3.7}%
\contentsline {subsection}{\numberline {3.7.1}Detailed Description}{15}{subsection.3.7.1}%
\contentsline {subsection}{\numberline {3.7.2}Constructor \& Destructor Documentation}{15}{subsection.3.7.2}%
\contentsline {subsubsection}{\numberline {3.7.2.1}\_\_init\_\_()}{15}{subsubsection.3.7.2.1}%
\contentsline {subsection}{\numberline {3.7.3}Member Function Documentation}{15}{subsection.3.7.3}%
\contentsline {subsubsection}{\numberline {3.7.3.1}\_\_repr\_\_()}{16}{subsubsection.3.7.3.1}%
\contentsline {section}{\numberline {3.8}traffic\discretionary {\mbox {\scriptsize $\hookleftarrow $}}{}{}\_\discretionary {\mbox {\scriptsize $\hookleftarrow $}}{}{}light.\discretionary {\mbox {\scriptsize $\hookleftarrow $}}{}{}traffic\discretionary {\mbox {\scriptsize $\hookleftarrow $}}{}{}\_\discretionary {\mbox {\scriptsize $\hookleftarrow $}}{}{}light Class Reference}{16}{section.3.8}%
\contentsline {subsection}{\numberline {3.8.1}Detailed Description}{16}{subsection.3.8.1}%
\contentsline {subsection}{\numberline {3.8.2}Constructor \& Destructor Documentation}{16}{subsection.3.8.2}%
\contentsline {subsubsection}{\numberline {3.8.2.1}\_\_init\_\_()}{17}{subsubsection.3.8.2.1}%
\contentsline {subsection}{\numberline {3.8.3}Member Function Documentation}{17}{subsection.3.8.3}%
\contentsline {subsubsection}{\numberline {3.8.3.1}get\_light()}{17}{subsubsection.3.8.3.1}%
\contentsline {subsubsection}{\numberline {3.8.3.2}set\_light()}{17}{subsubsection.3.8.3.2}%
\contentsline {subsubsection}{\numberline {3.8.3.3}tick()}{17}{subsubsection.3.8.3.3}%
\contentsline {section}{\numberline {3.9}Traffic\discretionary {\mbox {\scriptsize $\hookleftarrow $}}{}{}Light.\discretionary {\mbox {\scriptsize $\hookleftarrow $}}{}{}traffic\discretionary {\mbox {\scriptsize $\hookleftarrow $}}{}{}\_\discretionary {\mbox {\scriptsize $\hookleftarrow $}}{}{}light Class Reference}{18}{section.3.9}%
\contentsline {subsection}{\numberline {3.9.1}Detailed Description}{18}{subsection.3.9.1}%
\contentsline {subsection}{\numberline {3.9.2}Constructor \& Destructor Documentation}{18}{subsection.3.9.2}%
\contentsline {subsubsection}{\numberline {3.9.2.1}\_\_init\_\_()}{18}{subsubsection.3.9.2.1}%
\contentsline {subsection}{\numberline {3.9.3}Member Function Documentation}{19}{subsection.3.9.3}%
\contentsline {subsubsection}{\numberline {3.9.3.1}get\_color()}{19}{subsubsection.3.9.3.1}%
\contentsline {subsubsection}{\numberline {3.9.3.2}tick()}{19}{subsubsection.3.9.3.2}%
\contentsline {chapter}{Index}{21}{section*.19}%
