%YAML 1.1
%TAG !u! tag:unity3d.com,2011:
--- !u!74 &7400000
AnimationClip:
  m_ObjectHideFlags: 0
  m_CorrespondingSourceObject: {fileID: 0}
  m_PrefabInstance: {fileID: 0}
  m_PrefabAsset: {fileID: 0}
  m_Name: Merge
  serializedVersion: 6
  m_Legacy: 0
  m_Compressed: 0
  m_UseHighQualityCurve: 1
  m_RotationCurves: []
  m_CompressedRotationCurves: []
  m_EulerCurves: []
  m_PositionCurves: []
  m_ScaleCurves: []
  m_FloatCurves: []
  m_PPtrCurves:
  - curve:
    - time: 0
      value: {fileID: -8026036002346254530, guid: c18bf44c84e5d274782cf8f99a0265a7,
        type: 3}
    - time: 0.016666668
      value: {fileID: -7893955216534946844, guid: c18bf44c84e5d274782cf8f99a0265a7,
        type: 3}
    - time: 0.033333335
      value: {fileID: 528082923617580023, guid: c18bf44c84e5d274782cf8f99a0265a7,
        type: 3}
    - time: 0.05
      value: {fileID: -8079573370921718092, guid: c18bf44c84e5d274782cf8f99a0265a7,
        type: 3}
    - time: 0.06666667
      value: {fileID: 4349898118747042572, guid: c18bf44c84e5d274782cf8f99a0265a7,
        type: 3}
    - time: 0.083333336
      value: {fileID: 5912825029505799814, guid: c18bf44c84e5d274782cf8f99a0265a7,
        type: 3}
    - time: 0.1
      value: {fileID: -9156730762291304731, guid: c18bf44c84e5d274782cf8f99a0265a7,
        type: 3}
    - time: 0.11666667
      value: {fileID: 9130666536465326437, guid: c18bf44c84e5d274782cf8f99a0265a7,
        type: 3}
    - time: 0.13333334
      value: {fileID: -5001654996366192339, guid: c18bf44c84e5d274782cf8f99a0265a7,
        type: 3}
    - time: 0.15
      value: {fileID: 4105132364058345061, guid: c18bf44c84e5d274782cf8f99a0265a7,
        type: 3}
    - time: 0.16666667
      value: {fileID: 1595905987252257622, guid: c18bf44c84e5d274782cf8f99a0265a7,
        type: 3}
    - time: 0.18333334
      value: {fileID: -8565422258028756691, guid: c18bf44c84e5d274782cf8f99a0265a7,
        type: 3}
    - time: 0.2
      value: {fileID: -3701845011049098942, guid: c18bf44c84e5d274782cf8f99a0265a7,
        type: 3}
    - time: 0.21666667
      value: {fileID: 6853996546781437561, guid: c18bf44c84e5d274782cf8f99a0265a7,
        type: 3}
    - time: 0.23333333
      value: {fileID: 8710415941473021740, guid: c18bf44c84e5d274782cf8f99a0265a7,
        type: 3}
    - time: 0.25
      value: {fileID: 8446970218926611143, guid: c18bf44c84e5d274782cf8f99a0265a7,
        type: 3}
    - time: 0.26666668
      value: {fileID: -6897638374426761273, guid: c18bf44c84e5d274782cf8f99a0265a7,
        type: 3}
    - time: 0.28333333
      value: {fileID: 6274893671922066835, guid: c18bf44c84e5d274782cf8f99a0265a7,
        type: 3}
    - time: 0.3
      value: {fileID: 7722289292302952265, guid: c18bf44c84e5d274782cf8f99a0265a7,
        type: 3}
    - time: 0.31666666
      value: {fileID: -2951803780159240337, guid: c18bf44c84e5d274782cf8f99a0265a7,
        type: 3}
    attribute: m_Sprite
    path: 
    classID: 212
    script: {fileID: 0}
  m_SampleRate: 60
  m_WrapMode: 0
  m_Bounds:
    m_Center: {x: 0, y: 0, z: 0}
    m_Extent: {x: 0, y: 0, z: 0}
  m_ClipBindingConstant:
    genericBindings:
    - serializedVersion: 2
      path: 0
      attribute: 0
      script: {fileID: 0}
      typeID: 212
      customType: 23
      isPPtrCurve: 1
    pptrCurveMapping:
    - {fileID: -8026036002346254530, guid: c18bf44c84e5d274782cf8f99a0265a7, type: 3}
    - {fileID: -7893955216534946844, guid: c18bf44c84e5d274782cf8f99a0265a7, type: 3}
    - {fileID: 528082923617580023, guid: c18bf44c84e5d274782cf8f99a0265a7, type: 3}
    - {fileID: -8079573370921718092, guid: c18bf44c84e5d274782cf8f99a0265a7, type: 3}
    - {fileID: 4349898118747042572, guid: c18bf44c84e5d274782cf8f99a0265a7, type: 3}
    - {fileID: 5912825029505799814, guid: c18bf44c84e5d274782cf8f99a0265a7, type: 3}
    - {fileID: -9156730762291304731, guid: c18bf44c84e5d274782cf8f99a0265a7, type: 3}
    - {fileID: 9130666536465326437, guid: c18bf44c84e5d274782cf8f99a0265a7, type: 3}
    - {fileID: -5001654996366192339, guid: c18bf44c84e5d274782cf8f99a0265a7, type: 3}
    - {fileID: 4105132364058345061, guid: c18bf44c84e5d274782cf8f99a0265a7, type: 3}
    - {fileID: 1595905987252257622, guid: c18bf44c84e5d274782cf8f99a0265a7, type: 3}
    - {fileID: -8565422258028756691, guid: c18bf44c84e5d274782cf8f99a0265a7, type: 3}
    - {fileID: -3701845011049098942, guid: c18bf44c84e5d274782cf8f99a0265a7, type: 3}
    - {fileID: 6853996546781437561, guid: c18bf44c84e5d274782cf8f99a0265a7, type: 3}
    - {fileID: 8710415941473021740, guid: c18bf44c84e5d274782cf8f99a0265a7, type: 3}
    - {fileID: 8446970218926611143, guid: c18bf44c84e5d274782cf8f99a0265a7, type: 3}
    - {fileID: -6897638374426761273, guid: c18bf44c84e5d274782cf8f99a0265a7, type: 3}
    - {fileID: 6274893671922066835, guid: c18bf44c84e5d274782cf8f99a0265a7, type: 3}
    - {fileID: 7722289292302952265, guid: c18bf44c84e5d274782cf8f99a0265a7, type: 3}
    - {fileID: -2951803780159240337, guid: c18bf44c84e5d274782cf8f99a0265a7, type: 3}
  m_AnimationClipSettings:
    serializedVersion: 2
    m_AdditiveReferencePoseClip: {fileID: 0}
    m_AdditiveReferencePoseTime: 0
    m_StartTime: 0
    m_StopTime: 0.33333334
    m_OrientationOffsetY: 0
    m_Level: 0
    m_CycleOffset: 0
    m_HasAdditiveReferencePose: 0
    m_LoopTime: 0
    m_LoopBlend: 0
    m_LoopBlendOrientation: 0
    m_LoopBlendPositionY: 0
    m_LoopBlendPositionXZ: 0
    m_KeepOriginalOrientation: 0
    m_KeepOriginalPositionY: 1
    m_KeepOriginalPositionXZ: 0
    m_HeightFromFeet: 0
    m_Mirror: 0
  m_EditorCurves: []
  m_EulerEditorCurves: []
  m_HasGenericRootTransform: 0
  m_HasMotionFloatCurves: 0
  m_Events: []
