%YAML 1.1
%TAG !u! tag:unity3d.com,2011:
--- !u!74 &7400000
AnimationClip:
  m_ObjectHideFlags: 0
  m_CorrespondingSourceObject: {fileID: 0}
  m_PrefabInstance: {fileID: 0}
  m_PrefabAsset: {fileID: 0}
  m_Name: CoinFlip
  serializedVersion: 6
  m_Legacy: 0
  m_Compressed: 0
  m_UseHighQualityCurve: 1
  m_RotationCurves: []
  m_CompressedRotationCurves: []
  m_EulerCurves: []
  m_PositionCurves: []
  m_ScaleCurves: []
  m_FloatCurves: []
  m_PPtrCurves:
  - curve:
    - time: 0
      value: {fileID: -4292255348957191386, guid: 2a39668ae685b9e44a0ec3a5fc298379,
        type: 3}
    - time: 0.083333336
      value: {fileID: -456256640205237598, guid: 2a39668ae685b9e44a0ec3a5fc298379,
        type: 3}
    - time: 0.16666667
      value: {fileID: -4248304516061608202, guid: 2a39668ae685b9e44a0ec3a5fc298379,
        type: 3}
    - time: 0.25
      value: {fileID: -2964428200611000574, guid: 2a39668ae685b9e44a0ec3a5fc298379,
        type: 3}
    - time: 0.33333334
      value: {fileID: 2749532781509682542, guid: 2a39668ae685b9e44a0ec3a5fc298379,
        type: 3}
    - time: 0.41666666
      value: {fileID: 6563817221307991445, guid: 2a39668ae685b9e44a0ec3a5fc298379,
        type: 3}
    - time: 0.5
      value: {fileID: -2458616046986033917, guid: 2a39668ae685b9e44a0ec3a5fc298379,
        type: 3}
    - time: 0.5833333
      value: {fileID: -5455602019407824796, guid: 2a39668ae685b9e44a0ec3a5fc298379,
        type: 3}
    - time: 0.6666667
      value: {fileID: -1815028623620493103, guid: 2a39668ae685b9e44a0ec3a5fc298379,
        type: 3}
    - time: 0.75
      value: {fileID: 3491242531868112499, guid: 2a39668ae685b9e44a0ec3a5fc298379,
        type: 3}
    attribute: m_Sprite
    path: 
    classID: 114
    script: {fileID: 11500000, guid: fe87c0e1cc204ed48ad3b37840f39efc, type: 3}
  m_SampleRate: 12
  m_WrapMode: 0
  m_Bounds:
    m_Center: {x: 0, y: 0, z: 0}
    m_Extent: {x: 0, y: 0, z: 0}
  m_ClipBindingConstant:
    genericBindings:
    - serializedVersion: 2
      path: 0
      attribute: 2015549526
      script: {fileID: 11500000, guid: fe87c0e1cc204ed48ad3b37840f39efc, type: 3}
      typeID: 114
      customType: 0
      isPPtrCurve: 1
    pptrCurveMapping:
    - {fileID: -4292255348957191386, guid: 2a39668ae685b9e44a0ec3a5fc298379, type: 3}
    - {fileID: -456256640205237598, guid: 2a39668ae685b9e44a0ec3a5fc298379, type: 3}
    - {fileID: -4248304516061608202, guid: 2a39668ae685b9e44a0ec3a5fc298379, type: 3}
    - {fileID: -2964428200611000574, guid: 2a39668ae685b9e44a0ec3a5fc298379, type: 3}
    - {fileID: 2749532781509682542, guid: 2a39668ae685b9e44a0ec3a5fc298379, type: 3}
    - {fileID: 6563817221307991445, guid: 2a39668ae685b9e44a0ec3a5fc298379, type: 3}
    - {fileID: -2458616046986033917, guid: 2a39668ae685b9e44a0ec3a5fc298379, type: 3}
    - {fileID: -5455602019407824796, guid: 2a39668ae685b9e44a0ec3a5fc298379, type: 3}
    - {fileID: -1815028623620493103, guid: 2a39668ae685b9e44a0ec3a5fc298379, type: 3}
    - {fileID: 3491242531868112499, guid: 2a39668ae685b9e44a0ec3a5fc298379, type: 3}
  m_AnimationClipSettings:
    serializedVersion: 2
    m_AdditiveReferencePoseClip: {fileID: 0}
    m_AdditiveReferencePoseTime: 0
    m_StartTime: 0
    m_StopTime: 0.8333333
    m_OrientationOffsetY: 0
    m_Level: 0
    m_CycleOffset: 0
    m_HasAdditiveReferencePose: 0
    m_LoopTime: 1
    m_LoopBlend: 0
    m_LoopBlendOrientation: 0
    m_LoopBlendPositionY: 0
    m_LoopBlendPositionXZ: 0
    m_KeepOriginalOrientation: 0
    m_KeepOriginalPositionY: 1
    m_KeepOriginalPositionXZ: 0
    m_HeightFromFeet: 0
    m_Mirror: 0
  m_EditorCurves: []
  m_EulerEditorCurves: []
  m_HasGenericRootTransform: 0
  m_HasMotionFloatCurves: 0
  m_Events: []
