%YAML 1.1
%TAG !u! tag:unity3d.com,2011:
--- !u!74 &7400000
AnimationClip:
  m_ObjectHideFlags: 0
  m_CorrespondingSourceObject: {fileID: 0}
  m_PrefabInstance: {fileID: 0}
  m_PrefabAsset: {fileID: 0}
  m_Name: LevelChestOpen
  serializedVersion: 6
  m_Legacy: 0
  m_Compressed: 0
  m_UseHighQualityCurve: 1
  m_RotationCurves: []
  m_CompressedRotationCurves: []
  m_EulerCurves: []
  m_PositionCurves: []
  m_ScaleCurves: []
  m_FloatCurves: []
  m_PPtrCurves:
  - curve:
    - time: 0
      value: {fileID: 7248685537002415900, guid: e80a08dfdf97b1841a321a5790152313,
        type: 3}
    - time: 0.016666668
      value: {fileID: -898406869712604797, guid: e80a08dfdf97b1841a321a5790152313,
        type: 3}
    - time: 0.033333335
      value: {fileID: 7088552398054327717, guid: e80a08dfdf97b1841a321a5790152313,
        type: 3}
    - time: 0.05
      value: {fileID: 2291339211158827754, guid: e80a08dfdf97b1841a321a5790152313,
        type: 3}
    - time: 0.06666667
      value: {fileID: -4991896081249586274, guid: e80a08dfdf97b1841a321a5790152313,
        type: 3}
    - time: 0.083333336
      value: {fileID: 6967041149130024214, guid: e80a08dfdf97b1841a321a5790152313,
        type: 3}
    - time: 0.1
      value: {fileID: 4760059166786604635, guid: e80a08dfdf97b1841a321a5790152313,
        type: 3}
    - time: 0.11666667
      value: {fileID: 3284043031953324031, guid: e80a08dfdf97b1841a321a5790152313,
        type: 3}
    - time: 0.13333334
      value: {fileID: -7044897663228569521, guid: e80a08dfdf97b1841a321a5790152313,
        type: 3}
    - time: 0.15
      value: {fileID: -3746416849165172624, guid: e80a08dfdf97b1841a321a5790152313,
        type: 3}
    - time: 0.16666667
      value: {fileID: 4829862839023475037, guid: e80a08dfdf97b1841a321a5790152313,
        type: 3}
    - time: 0.18333334
      value: {fileID: 1524821645020244733, guid: e80a08dfdf97b1841a321a5790152313,
        type: 3}
    - time: 0.2
      value: {fileID: -8337630558933118657, guid: e80a08dfdf97b1841a321a5790152313,
        type: 3}
    - time: 0.21666667
      value: {fileID: 3238877386128033152, guid: e80a08dfdf97b1841a321a5790152313,
        type: 3}
    - time: 0.23333333
      value: {fileID: -2102872477935663624, guid: e80a08dfdf97b1841a321a5790152313,
        type: 3}
    - time: 0.25
      value: {fileID: -2162783624409131939, guid: e80a08dfdf97b1841a321a5790152313,
        type: 3}
    - time: 0.26666668
      value: {fileID: 8610986761050015182, guid: e80a08dfdf97b1841a321a5790152313,
        type: 3}
    - time: 0.28333333
      value: {fileID: -853268302654774317, guid: e80a08dfdf97b1841a321a5790152313,
        type: 3}
    - time: 0.3
      value: {fileID: -6615645535207780726, guid: e80a08dfdf97b1841a321a5790152313,
        type: 3}
    - time: 0.31666666
      value: {fileID: 9123886462602272399, guid: e80a08dfdf97b1841a321a5790152313,
        type: 3}
    - time: 0.33333334
      value: {fileID: -7977613427825123799, guid: e80a08dfdf97b1841a321a5790152313,
        type: 3}
    - time: 0.35
      value: {fileID: -1080225539441122688, guid: e80a08dfdf97b1841a321a5790152313,
        type: 3}
    - time: 0.36666667
      value: {fileID: -2837497947595122279, guid: e80a08dfdf97b1841a321a5790152313,
        type: 3}
    - time: 0.38333333
      value: {fileID: 6711380980780653311, guid: e80a08dfdf97b1841a321a5790152313,
        type: 3}
    - time: 0.4
      value: {fileID: 6210568985903193037, guid: db8b8f19a77ecef418ed206713528498,
        type: 3}
    - time: 0.41666666
      value: {fileID: 6891911084108353955, guid: db8b8f19a77ecef418ed206713528498,
        type: 3}
    - time: 0.43333334
      value: {fileID: 6758558010475163163, guid: db8b8f19a77ecef418ed206713528498,
        type: 3}
    - time: 0.45
      value: {fileID: -5008937980879313228, guid: db8b8f19a77ecef418ed206713528498,
        type: 3}
    - time: 0.46666667
      value: {fileID: 8355827549451017681, guid: db8b8f19a77ecef418ed206713528498,
        type: 3}
    - time: 0.48333332
      value: {fileID: -5875021418401956680, guid: db8b8f19a77ecef418ed206713528498,
        type: 3}
    - time: 0.5
      value: {fileID: -3661083723288737273, guid: db8b8f19a77ecef418ed206713528498,
        type: 3}
    - time: 0.51666665
      value: {fileID: 3673936391742326225, guid: db8b8f19a77ecef418ed206713528498,
        type: 3}
    - time: 0.53333336
      value: {fileID: -4162313755926959612, guid: db8b8f19a77ecef418ed206713528498,
        type: 3}
    - time: 0.55
      value: {fileID: 5288603881473870013, guid: db8b8f19a77ecef418ed206713528498,
        type: 3}
    - time: 0.56666666
      value: {fileID: -3166710476030039782, guid: db8b8f19a77ecef418ed206713528498,
        type: 3}
    - time: 0.5833333
      value: {fileID: -7737530503672690141, guid: db8b8f19a77ecef418ed206713528498,
        type: 3}
    - time: 0.6
      value: {fileID: -2572619966816909953, guid: db8b8f19a77ecef418ed206713528498,
        type: 3}
    - time: 0.6166667
      value: {fileID: -8455624859304552331, guid: db8b8f19a77ecef418ed206713528498,
        type: 3}
    - time: 0.6333333
      value: {fileID: 5703423682964977786, guid: db8b8f19a77ecef418ed206713528498,
        type: 3}
    - time: 0.65
      value: {fileID: -4994271301581753369, guid: db8b8f19a77ecef418ed206713528498,
        type: 3}
    - time: 0.6666667
      value: {fileID: 7555036267987584215, guid: db8b8f19a77ecef418ed206713528498,
        type: 3}
    - time: 0.68333334
      value: {fileID: 6744759883571376823, guid: db8b8f19a77ecef418ed206713528498,
        type: 3}
    - time: 0.7
      value: {fileID: -9080698217027741577, guid: db8b8f19a77ecef418ed206713528498,
        type: 3}
    - time: 0.71666664
      value: {fileID: -3221271235524485695, guid: db8b8f19a77ecef418ed206713528498,
        type: 3}
    - time: 0.73333335
      value: {fileID: -8132256544585775119, guid: db8b8f19a77ecef418ed206713528498,
        type: 3}
    - time: 0.75
      value: {fileID: -3313186712991696488, guid: db8b8f19a77ecef418ed206713528498,
        type: 3}
    - time: 0.76666665
      value: {fileID: -8879823090348616028, guid: db8b8f19a77ecef418ed206713528498,
        type: 3}
    - time: 0.78333336
      value: {fileID: -5876539419673515070, guid: db8b8f19a77ecef418ed206713528498,
        type: 3}
    - time: 0.8
      value: {fileID: -846914279498933517, guid: 3ee92ea321c3567498ed0fa534ab3d9d,
        type: 3}
    - time: 0.81666666
      value: {fileID: -1349750827583677250, guid: 3ee92ea321c3567498ed0fa534ab3d9d,
        type: 3}
    - time: 0.8333333
      value: {fileID: -8459160823800088484, guid: 3ee92ea321c3567498ed0fa534ab3d9d,
        type: 3}
    - time: 0.85
      value: {fileID: 8165340442026283275, guid: 3ee92ea321c3567498ed0fa534ab3d9d,
        type: 3}
    - time: 0.8666667
      value: {fileID: 5830289471989108141, guid: 3ee92ea321c3567498ed0fa534ab3d9d,
        type: 3}
    - time: 0.8833333
      value: {fileID: 4027793510766439538, guid: 3ee92ea321c3567498ed0fa534ab3d9d,
        type: 3}
    - time: 0.9
      value: {fileID: 7508015472898741594, guid: 3ee92ea321c3567498ed0fa534ab3d9d,
        type: 3}
    - time: 0.9166667
      value: {fileID: -4188228992309670619, guid: 3ee92ea321c3567498ed0fa534ab3d9d,
        type: 3}
    - time: 0.93333334
      value: {fileID: 3779727583633727774, guid: 3ee92ea321c3567498ed0fa534ab3d9d,
        type: 3}
    - time: 0.95
      value: {fileID: 1664072475491643027, guid: 3ee92ea321c3567498ed0fa534ab3d9d,
        type: 3}
    - time: 0.96666664
      value: {fileID: -6759512987546628483, guid: 3ee92ea321c3567498ed0fa534ab3d9d,
        type: 3}
    - time: 0.98333335
      value: {fileID: -1836076230171629497, guid: 3ee92ea321c3567498ed0fa534ab3d9d,
        type: 3}
    - time: 1
      value: {fileID: -1413665483264973388, guid: 3ee92ea321c3567498ed0fa534ab3d9d,
        type: 3}
    - time: 1.0166667
      value: {fileID: 364446759419689967, guid: 3ee92ea321c3567498ed0fa534ab3d9d,
        type: 3}
    - time: 1.0333333
      value: {fileID: 8118463496253910737, guid: 3ee92ea321c3567498ed0fa534ab3d9d,
        type: 3}
    - time: 1.05
      value: {fileID: 4239366810579245929, guid: 3ee92ea321c3567498ed0fa534ab3d9d,
        type: 3}
    - time: 1.0666667
      value: {fileID: -6341743032029612268, guid: 3ee92ea321c3567498ed0fa534ab3d9d,
        type: 3}
    - time: 1.0833334
      value: {fileID: 5252149398630568955, guid: 3ee92ea321c3567498ed0fa534ab3d9d,
        type: 3}
    - time: 1.1
      value: {fileID: 2334897659941413493, guid: 3ee92ea321c3567498ed0fa534ab3d9d,
        type: 3}
    - time: 1.1166667
      value: {fileID: -4102413026605473313, guid: 3ee92ea321c3567498ed0fa534ab3d9d,
        type: 3}
    - time: 1.1333333
      value: {fileID: 1946599689015604350, guid: 3ee92ea321c3567498ed0fa534ab3d9d,
        type: 3}
    - time: 1.15
      value: {fileID: 8236432559074809652, guid: 3ee92ea321c3567498ed0fa534ab3d9d,
        type: 3}
    - time: 1.1666666
      value: {fileID: -1403152420537534642, guid: 3ee92ea321c3567498ed0fa534ab3d9d,
        type: 3}
    - time: 1.1833333
      value: {fileID: -5063383897491584185, guid: 3ee92ea321c3567498ed0fa534ab3d9d,
        type: 3}
    - time: 1.2
      value: {fileID: 4606097940711087027, guid: 31f46a83cb6bd7642a1607f8d0b05a82,
        type: 3}
    - time: 1.2166667
      value: {fileID: -6645630931639567056, guid: 31f46a83cb6bd7642a1607f8d0b05a82,
        type: 3}
    - time: 1.2333333
      value: {fileID: 3248259747812299603, guid: 31f46a83cb6bd7642a1607f8d0b05a82,
        type: 3}
    - time: 1.25
      value: {fileID: 7513375124528524836, guid: 31f46a83cb6bd7642a1607f8d0b05a82,
        type: 3}
    - time: 1.2666667
      value: {fileID: 543000640783023030, guid: 31f46a83cb6bd7642a1607f8d0b05a82,
        type: 3}
    - time: 1.2833333
      value: {fileID: 2342099643068768419, guid: 31f46a83cb6bd7642a1607f8d0b05a82,
        type: 3}
    - time: 1.3
      value: {fileID: -8994641215678727222, guid: 31f46a83cb6bd7642a1607f8d0b05a82,
        type: 3}
    - time: 1.3166667
      value: {fileID: -8559601480445871494, guid: 31f46a83cb6bd7642a1607f8d0b05a82,
        type: 3}
    - time: 1.3333334
      value: {fileID: -6928108804078837234, guid: 31f46a83cb6bd7642a1607f8d0b05a82,
        type: 3}
    - time: 1.35
      value: {fileID: -3771980191198179418, guid: 31f46a83cb6bd7642a1607f8d0b05a82,
        type: 3}
    - time: 1.3666667
      value: {fileID: 4973217499529499803, guid: 31f46a83cb6bd7642a1607f8d0b05a82,
        type: 3}
    - time: 1.3833333
      value: {fileID: 5411781263523396866, guid: 31f46a83cb6bd7642a1607f8d0b05a82,
        type: 3}
    - time: 1.4
      value: {fileID: 6655672521530629016, guid: 31f46a83cb6bd7642a1607f8d0b05a82,
        type: 3}
    - time: 1.4166666
      value: {fileID: -6037566914196212155, guid: 31f46a83cb6bd7642a1607f8d0b05a82,
        type: 3}
    - time: 1.4333333
      value: {fileID: 5460750640564531987, guid: 31f46a83cb6bd7642a1607f8d0b05a82,
        type: 3}
    - time: 1.45
      value: {fileID: -1171081635445211968, guid: 31f46a83cb6bd7642a1607f8d0b05a82,
        type: 3}
    - time: 1.4666667
      value: {fileID: 9193439425659830559, guid: 31f46a83cb6bd7642a1607f8d0b05a82,
        type: 3}
    - time: 1.4833333
      value: {fileID: 3772525324484140582, guid: 31f46a83cb6bd7642a1607f8d0b05a82,
        type: 3}
    - time: 1.5
      value: {fileID: 4201330374401426780, guid: 31f46a83cb6bd7642a1607f8d0b05a82,
        type: 3}
    - time: 1.5166667
      value: {fileID: 4199850567856049934, guid: 31f46a83cb6bd7642a1607f8d0b05a82,
        type: 3}
    - time: 1.5333333
      value: {fileID: 1561394194596796676, guid: 31f46a83cb6bd7642a1607f8d0b05a82,
        type: 3}
    attribute: m_Sprite
    path: 
    classID: 114
    script: {fileID: 11500000, guid: fe87c0e1cc204ed48ad3b37840f39efc, type: 3}
  m_SampleRate: 60
  m_WrapMode: 0
  m_Bounds:
    m_Center: {x: 0, y: 0, z: 0}
    m_Extent: {x: 0, y: 0, z: 0}
  m_ClipBindingConstant:
    genericBindings:
    - serializedVersion: 2
      path: 0
      attribute: 2015549526
      script: {fileID: 11500000, guid: fe87c0e1cc204ed48ad3b37840f39efc, type: 3}
      typeID: 114
      customType: 0
      isPPtrCurve: 1
    pptrCurveMapping:
    - {fileID: 7248685537002415900, guid: e80a08dfdf97b1841a321a5790152313, type: 3}
    - {fileID: -898406869712604797, guid: e80a08dfdf97b1841a321a5790152313, type: 3}
    - {fileID: 7088552398054327717, guid: e80a08dfdf97b1841a321a5790152313, type: 3}
    - {fileID: 2291339211158827754, guid: e80a08dfdf97b1841a321a5790152313, type: 3}
    - {fileID: -4991896081249586274, guid: e80a08dfdf97b1841a321a5790152313, type: 3}
    - {fileID: 6967041149130024214, guid: e80a08dfdf97b1841a321a5790152313, type: 3}
    - {fileID: 4760059166786604635, guid: e80a08dfdf97b1841a321a5790152313, type: 3}
    - {fileID: 3284043031953324031, guid: e80a08dfdf97b1841a321a5790152313, type: 3}
    - {fileID: -7044897663228569521, guid: e80a08dfdf97b1841a321a5790152313, type: 3}
    - {fileID: -3746416849165172624, guid: e80a08dfdf97b1841a321a5790152313, type: 3}
    - {fileID: 4829862839023475037, guid: e80a08dfdf97b1841a321a5790152313, type: 3}
    - {fileID: 1524821645020244733, guid: e80a08dfdf97b1841a321a5790152313, type: 3}
    - {fileID: -8337630558933118657, guid: e80a08dfdf97b1841a321a5790152313, type: 3}
    - {fileID: 3238877386128033152, guid: e80a08dfdf97b1841a321a5790152313, type: 3}
    - {fileID: -2102872477935663624, guid: e80a08dfdf97b1841a321a5790152313, type: 3}
    - {fileID: -2162783624409131939, guid: e80a08dfdf97b1841a321a5790152313, type: 3}
    - {fileID: 8610986761050015182, guid: e80a08dfdf97b1841a321a5790152313, type: 3}
    - {fileID: -853268302654774317, guid: e80a08dfdf97b1841a321a5790152313, type: 3}
    - {fileID: -6615645535207780726, guid: e80a08dfdf97b1841a321a5790152313, type: 3}
    - {fileID: 9123886462602272399, guid: e80a08dfdf97b1841a321a5790152313, type: 3}
    - {fileID: -7977613427825123799, guid: e80a08dfdf97b1841a321a5790152313, type: 3}
    - {fileID: -1080225539441122688, guid: e80a08dfdf97b1841a321a5790152313, type: 3}
    - {fileID: -2837497947595122279, guid: e80a08dfdf97b1841a321a5790152313, type: 3}
    - {fileID: 6711380980780653311, guid: e80a08dfdf97b1841a321a5790152313, type: 3}
    - {fileID: 6210568985903193037, guid: db8b8f19a77ecef418ed206713528498, type: 3}
    - {fileID: 6891911084108353955, guid: db8b8f19a77ecef418ed206713528498, type: 3}
    - {fileID: 6758558010475163163, guid: db8b8f19a77ecef418ed206713528498, type: 3}
    - {fileID: -5008937980879313228, guid: db8b8f19a77ecef418ed206713528498, type: 3}
    - {fileID: 8355827549451017681, guid: db8b8f19a77ecef418ed206713528498, type: 3}
    - {fileID: -5875021418401956680, guid: db8b8f19a77ecef418ed206713528498, type: 3}
    - {fileID: -3661083723288737273, guid: db8b8f19a77ecef418ed206713528498, type: 3}
    - {fileID: 3673936391742326225, guid: db8b8f19a77ecef418ed206713528498, type: 3}
    - {fileID: -4162313755926959612, guid: db8b8f19a77ecef418ed206713528498, type: 3}
    - {fileID: 5288603881473870013, guid: db8b8f19a77ecef418ed206713528498, type: 3}
    - {fileID: -3166710476030039782, guid: db8b8f19a77ecef418ed206713528498, type: 3}
    - {fileID: -7737530503672690141, guid: db8b8f19a77ecef418ed206713528498, type: 3}
    - {fileID: -2572619966816909953, guid: db8b8f19a77ecef418ed206713528498, type: 3}
    - {fileID: -8455624859304552331, guid: db8b8f19a77ecef418ed206713528498, type: 3}
    - {fileID: 5703423682964977786, guid: db8b8f19a77ecef418ed206713528498, type: 3}
    - {fileID: -4994271301581753369, guid: db8b8f19a77ecef418ed206713528498, type: 3}
    - {fileID: 7555036267987584215, guid: db8b8f19a77ecef418ed206713528498, type: 3}
    - {fileID: 6744759883571376823, guid: db8b8f19a77ecef418ed206713528498, type: 3}
    - {fileID: -9080698217027741577, guid: db8b8f19a77ecef418ed206713528498, type: 3}
    - {fileID: -3221271235524485695, guid: db8b8f19a77ecef418ed206713528498, type: 3}
    - {fileID: -8132256544585775119, guid: db8b8f19a77ecef418ed206713528498, type: 3}
    - {fileID: -3313186712991696488, guid: db8b8f19a77ecef418ed206713528498, type: 3}
    - {fileID: -8879823090348616028, guid: db8b8f19a77ecef418ed206713528498, type: 3}
    - {fileID: -5876539419673515070, guid: db8b8f19a77ecef418ed206713528498, type: 3}
    - {fileID: -846914279498933517, guid: 3ee92ea321c3567498ed0fa534ab3d9d, type: 3}
    - {fileID: -1349750827583677250, guid: 3ee92ea321c3567498ed0fa534ab3d9d, type: 3}
    - {fileID: -8459160823800088484, guid: 3ee92ea321c3567498ed0fa534ab3d9d, type: 3}
    - {fileID: 8165340442026283275, guid: 3ee92ea321c3567498ed0fa534ab3d9d, type: 3}
    - {fileID: 5830289471989108141, guid: 3ee92ea321c3567498ed0fa534ab3d9d, type: 3}
    - {fileID: 4027793510766439538, guid: 3ee92ea321c3567498ed0fa534ab3d9d, type: 3}
    - {fileID: 7508015472898741594, guid: 3ee92ea321c3567498ed0fa534ab3d9d, type: 3}
    - {fileID: -4188228992309670619, guid: 3ee92ea321c3567498ed0fa534ab3d9d, type: 3}
    - {fileID: 3779727583633727774, guid: 3ee92ea321c3567498ed0fa534ab3d9d, type: 3}
    - {fileID: 1664072475491643027, guid: 3ee92ea321c3567498ed0fa534ab3d9d, type: 3}
    - {fileID: -6759512987546628483, guid: 3ee92ea321c3567498ed0fa534ab3d9d, type: 3}
    - {fileID: -1836076230171629497, guid: 3ee92ea321c3567498ed0fa534ab3d9d, type: 3}
    - {fileID: -1413665483264973388, guid: 3ee92ea321c3567498ed0fa534ab3d9d, type: 3}
    - {fileID: 364446759419689967, guid: 3ee92ea321c3567498ed0fa534ab3d9d, type: 3}
    - {fileID: 8118463496253910737, guid: 3ee92ea321c3567498ed0fa534ab3d9d, type: 3}
    - {fileID: 4239366810579245929, guid: 3ee92ea321c3567498ed0fa534ab3d9d, type: 3}
    - {fileID: -6341743032029612268, guid: 3ee92ea321c3567498ed0fa534ab3d9d, type: 3}
    - {fileID: 5252149398630568955, guid: 3ee92ea321c3567498ed0fa534ab3d9d, type: 3}
    - {fileID: 2334897659941413493, guid: 3ee92ea321c3567498ed0fa534ab3d9d, type: 3}
    - {fileID: -4102413026605473313, guid: 3ee92ea321c3567498ed0fa534ab3d9d, type: 3}
    - {fileID: 1946599689015604350, guid: 3ee92ea321c3567498ed0fa534ab3d9d, type: 3}
    - {fileID: 8236432559074809652, guid: 3ee92ea321c3567498ed0fa534ab3d9d, type: 3}
    - {fileID: -1403152420537534642, guid: 3ee92ea321c3567498ed0fa534ab3d9d, type: 3}
    - {fileID: -5063383897491584185, guid: 3ee92ea321c3567498ed0fa534ab3d9d, type: 3}
    - {fileID: 4606097940711087027, guid: 31f46a83cb6bd7642a1607f8d0b05a82, type: 3}
    - {fileID: -6645630931639567056, guid: 31f46a83cb6bd7642a1607f8d0b05a82, type: 3}
    - {fileID: 3248259747812299603, guid: 31f46a83cb6bd7642a1607f8d0b05a82, type: 3}
    - {fileID: 7513375124528524836, guid: 31f46a83cb6bd7642a1607f8d0b05a82, type: 3}
    - {fileID: 543000640783023030, guid: 31f46a83cb6bd7642a1607f8d0b05a82, type: 3}
    - {fileID: 2342099643068768419, guid: 31f46a83cb6bd7642a1607f8d0b05a82, type: 3}
    - {fileID: -8994641215678727222, guid: 31f46a83cb6bd7642a1607f8d0b05a82, type: 3}
    - {fileID: -8559601480445871494, guid: 31f46a83cb6bd7642a1607f8d0b05a82, type: 3}
    - {fileID: -6928108804078837234, guid: 31f46a83cb6bd7642a1607f8d0b05a82, type: 3}
    - {fileID: -3771980191198179418, guid: 31f46a83cb6bd7642a1607f8d0b05a82, type: 3}
    - {fileID: 4973217499529499803, guid: 31f46a83cb6bd7642a1607f8d0b05a82, type: 3}
    - {fileID: 5411781263523396866, guid: 31f46a83cb6bd7642a1607f8d0b05a82, type: 3}
    - {fileID: 6655672521530629016, guid: 31f46a83cb6bd7642a1607f8d0b05a82, type: 3}
    - {fileID: -6037566914196212155, guid: 31f46a83cb6bd7642a1607f8d0b05a82, type: 3}
    - {fileID: 5460750640564531987, guid: 31f46a83cb6bd7642a1607f8d0b05a82, type: 3}
    - {fileID: -1171081635445211968, guid: 31f46a83cb6bd7642a1607f8d0b05a82, type: 3}
    - {fileID: 9193439425659830559, guid: 31f46a83cb6bd7642a1607f8d0b05a82, type: 3}
    - {fileID: 3772525324484140582, guid: 31f46a83cb6bd7642a1607f8d0b05a82, type: 3}
    - {fileID: 4201330374401426780, guid: 31f46a83cb6bd7642a1607f8d0b05a82, type: 3}
    - {fileID: 4199850567856049934, guid: 31f46a83cb6bd7642a1607f8d0b05a82, type: 3}
    - {fileID: 1561394194596796676, guid: 31f46a83cb6bd7642a1607f8d0b05a82, type: 3}
  m_AnimationClipSettings:
    serializedVersion: 2
    m_AdditiveReferencePoseClip: {fileID: 0}
    m_AdditiveReferencePoseTime: 0
    m_StartTime: 0
    m_StopTime: 1.55
    m_OrientationOffsetY: 0
    m_Level: 0
    m_CycleOffset: 0
    m_HasAdditiveReferencePose: 0
    m_LoopTime: 0
    m_LoopBlend: 0
    m_LoopBlendOrientation: 0
    m_LoopBlendPositionY: 0
    m_LoopBlendPositionXZ: 0
    m_KeepOriginalOrientation: 0
    m_KeepOriginalPositionY: 1
    m_KeepOriginalPositionXZ: 0
    m_HeightFromFeet: 0
    m_Mirror: 0
  m_EditorCurves: []
  m_EulerEditorCurves: []
  m_HasGenericRootTransform: 0
  m_HasMotionFloatCurves: 0
  m_Events: []
