%YAML 1.1
%TAG !u! tag:unity3d.com,2011:
--- !u!74 &7400000
AnimationClip:
  m_ObjectHideFlags: 0
  m_CorrespondingSourceObject: {fileID: 0}
  m_PrefabInstance: {fileID: 0}
  m_PrefabAsset: {fileID: 0}
  m_Name: CoinRotation
  serializedVersion: 6
  m_Legacy: 0
  m_Compressed: 0
  m_UseHighQualityCurve: 1
  m_RotationCurves: []
  m_CompressedRotationCurves: []
  m_EulerCurves: []
  m_PositionCurves: []
  m_ScaleCurves: []
  m_FloatCurves: []
  m_PPtrCurves:
  - curve:
    - time: 0
      value: {fileID: 9215449919131587388, guid: 4d142baae1105204ab864e0165aa4836,
        type: 3}
    - time: 0.016666668
      value: {fileID: 211287917578559131, guid: 4d142baae1105204ab864e0165aa4836,
        type: 3}
    - time: 0.033333335
      value: {fileID: -3690578823146482978, guid: 4d142baae1105204ab864e0165aa4836,
        type: 3}
    - time: 0.05
      value: {fileID: 4654700834271393367, guid: 4d142baae1105204ab864e0165aa4836,
        type: 3}
    - time: 0.06666667
      value: {fileID: 8815866289591946354, guid: 4d142baae1105204ab864e0165aa4836,
        type: 3}
    - time: 0.083333336
      value: {fileID: 8327389045814836341, guid: 4d142baae1105204ab864e0165aa4836,
        type: 3}
    - time: 0.1
      value: {fileID: 3597637448691279054, guid: 4d142baae1105204ab864e0165aa4836,
        type: 3}
    - time: 0.11666667
      value: {fileID: -652735015623831443, guid: 4d142baae1105204ab864e0165aa4836,
        type: 3}
    - time: 0.13333334
      value: {fileID: 7110866391515915157, guid: 4d142baae1105204ab864e0165aa4836,
        type: 3}
    - time: 0.15
      value: {fileID: 3922218654737673649, guid: 4d142baae1105204ab864e0165aa4836,
        type: 3}
    attribute: m_Sprite
    path: 
    classID: 114
    script: {fileID: 11500000, guid: fe87c0e1cc204ed48ad3b37840f39efc, type: 3}
  m_SampleRate: 60
  m_WrapMode: 0
  m_Bounds:
    m_Center: {x: 0, y: 0, z: 0}
    m_Extent: {x: 0, y: 0, z: 0}
  m_ClipBindingConstant:
    genericBindings:
    - serializedVersion: 2
      path: 0
      attribute: 2015549526
      script: {fileID: 11500000, guid: fe87c0e1cc204ed48ad3b37840f39efc, type: 3}
      typeID: 114
      customType: 0
      isPPtrCurve: 1
    pptrCurveMapping:
    - {fileID: 9215449919131587388, guid: 4d142baae1105204ab864e0165aa4836, type: 3}
    - {fileID: 211287917578559131, guid: 4d142baae1105204ab864e0165aa4836, type: 3}
    - {fileID: -3690578823146482978, guid: 4d142baae1105204ab864e0165aa4836, type: 3}
    - {fileID: 4654700834271393367, guid: 4d142baae1105204ab864e0165aa4836, type: 3}
    - {fileID: 8815866289591946354, guid: 4d142baae1105204ab864e0165aa4836, type: 3}
    - {fileID: 8327389045814836341, guid: 4d142baae1105204ab864e0165aa4836, type: 3}
    - {fileID: 3597637448691279054, guid: 4d142baae1105204ab864e0165aa4836, type: 3}
    - {fileID: -652735015623831443, guid: 4d142baae1105204ab864e0165aa4836, type: 3}
    - {fileID: 7110866391515915157, guid: 4d142baae1105204ab864e0165aa4836, type: 3}
    - {fileID: 3922218654737673649, guid: 4d142baae1105204ab864e0165aa4836, type: 3}
  m_AnimationClipSettings:
    serializedVersion: 2
    m_AdditiveReferencePoseClip: {fileID: 0}
    m_AdditiveReferencePoseTime: 0
    m_StartTime: 0
    m_StopTime: 0.16666667
    m_OrientationOffsetY: 0
    m_Level: 0
    m_CycleOffset: 0
    m_HasAdditiveReferencePose: 0
    m_LoopTime: 1
    m_LoopBlend: 0
    m_LoopBlendOrientation: 0
    m_LoopBlendPositionY: 0
    m_LoopBlendPositionXZ: 0
    m_KeepOriginalOrientation: 0
    m_KeepOriginalPositionY: 1
    m_KeepOriginalPositionXZ: 0
    m_HeightFromFeet: 0
    m_Mirror: 0
  m_EditorCurves: []
  m_EulerEditorCurves: []
  m_HasGenericRootTransform: 0
  m_HasMotionFloatCurves: 0
  m_Events: []
