﻿booster/hintDescription,Revela la localización y conecta 3 artículos meta
boosters/shuffle,Intercambia la ubicación de todos los elementos
contactUs/findaBug,¿Ha encontrado un problema o un error?
contactUs/leaveEmail,"Por favor, indique su correo electrónico si desea ser contactado vuelta"
contactUs/letUsKnow,Háganos saber acerca de ella.
contactUs/messgageLengthText,El mensaje debe ser de al menos 5 caracteres.
contactUs/send,Enviar
contactUs/sendSuccesfully,Su mensaje enviado con éxito!
contactUs/tapToType,Toque para escribir ...
contactuUs/message,Mensaje:
dailyBonus/pickChest,Escoja un cofre para obtener su recompensa!
failed/Failed,Ha fallado
hearts/getMoreTitle,Obtener más vidas
leaderboard/country,País
leaderboard/world,Mundo
levelCompleted/Collect,Recoger
levelCompleted/Continue,Continuar
menu/dailyBonus,Bonus diario
menu/leaderboard,la tabla de posiciones
menu/leaderboardLoading,Tabla de clasificación se está cargando ...
menu/levelChest,la altura del pecho
menu/LevelTournament,Torneo de nivel
menu/selectBoosters,Seleccione Impulsores:
menu/settings,Ajustes
menu/StarTournament,Torneo de estrellas
menu/tournamentDescription,Completa los niveles y obtener recompensas increíbles!
other/buy,Comprar
other/casualOffer,Oferta informal
other/exclusiveOffer,Oferta exclusiva
other/getButton,¡Obtener!
other/getThePrize,para obtener el premio!
other/hardLevelTitle,Difícil
other/hint,Insinuación
other/hour,hora
other/hours,horas
other/LevelText,Nivel 1
other/levelUp,¡Elevar a mismo nivel!
other/loading,CARGANDO...
other/loadProgress,el progreso de carga
other/minutes,min
other/more,Más
other/noVideo,"Lo sentimos, pero no hay video disponible."
other/Play,Tocar
other/Players,jugadores
other/purchaseFailed,"Lo sentimos, la compra no se pudo completar."
other/rank,Rango
other/removeAds,Quitar anuncios
other/Reward,Recompensa
other/score,Puntaje
other/timeLeft,Tiempo restante:
pause/pause,Pausa
rateUs/notNow,Ahora no
rateUs/showLove,nos muestran un poco de amor
rateUs/submit,Enviar
revive/oomConfirmation,Perderá sus estrellas colectadas
revive/outofBox,Fuera de la caja
revive/timeisUp,¡El tiempo ha terminado!
settings/contactUs,Contáctenos
settings/login,Guardar el progreso
settings/rateUs,Nos califica
settings/restorePurchase,restaurar Compra
settings/saveProgress,Guardar el progreso
settings/signOut,desconectar
shop/epicBundle,EPIC PAQUETE
shop/megaBundle,PAQUETE MEGA
shop/premiumBundle,PAQUETE PREMIUM
shop/removeAds,QUITAR ANUNCIOS
shop/starterBundle,PAQUETE DE ARRANQUE
starClaim/Claim,Afirmar
starClaim/Claimx2,X2 reclamo
tt/10objective,Hit Combo x10
tt/4objective,x4 Hit Combo
tt/7objective,x7 Hit Combo
