﻿booster/hintDescription,場所を明らかにし、3つのゴール項目を接続します
boosters/shuffle,すべての項目の場所を入れ替え
contactUs/findaBug,あなたは、問題やバグを見つけましたか？
contactUs/leaveEmail,あなたが戻って連絡する場合は、電子メールを指定してください
contactUs/letUsKnow,私たちはそれについて知ってみましょう。
contactUs/messgageLengthText,メッセージには、少なくとも5文字の長さであるべきです。
contactUs/send,送信
contactUs/sendSuccesfully,あなたのメッセージが正常に送信しました！
contactUs/tapToType,型にタップ...
contactuUs/message,メッセージ：
dailyBonus/pickChest,あなたの報酬を得るために胸をピックアップ！
failed/Failed,失敗しました。
hearts/getMoreTitle,より多くの生命を取得
leaderboard/country,国
leaderboard/world,世界
levelCompleted/Collect,収集
levelCompleted/Continue,継続する
menu/dailyBonus,毎日のご褒美
menu/leaderboard,リーダーボード
menu/leaderboardLoading,リーダーボードはロードされ...
menu/levelChest,レベル・チェスト
menu/LevelTournament,レベルのトーナメント
menu/selectBoosters,ブースターを選択します。
menu/settings,設定
menu/StarTournament,スタートーナメント
menu/tournamentDescription,完全なレベルとは素晴らしい報酬を得ます！
other/buy,購入
other/casualOffer,カジュアルオファー
other/exclusiveOffer,独占オファー
other/getButton,取得する！
other/getThePrize,賞金を得るために！
other/hardLevelTitle,ハード
other/hint,ヒント
other/hour,時間
other/hours,時間
other/LevelText,レベル1
other/levelUp,レベルアップ！
other/loading,読み込んでいます...
other/loadProgress,ロードの進行状況
other/minutes,分
other/more,もっと
other/noVideo,申し訳ありませんが、使用可能なビデオがありません。
other/Play,演奏する
other/Players,プレーヤー
other/purchaseFailed,申し訳ありませんが、購入を完了できませんでした。
other/rank,順位
other/removeAds,広告を削除
other/Reward,褒賞
other/score,スコア
other/timeLeft,残り時間：
pause/pause,休止
rateUs/notNow,今はやめろ
rateUs/showLove,私たちにいくつかの愛を示します
rateUs/submit,参加する
revive/oomConfirmation,あなたの収集星を失うことになります
revive/outofBox,箱の外
revive/timeisUp,時間切れです！
settings/contactUs,お問い合わせ
settings/login,保存進展
settings/rateUs,私たちを評価してください
settings/restorePurchase,購入商品を復元する
settings/saveProgress,保存進展
settings/signOut,サインアウト
shop/epicBundle,EPIC BUNDLE
shop/megaBundle,MEGA BUNDLE
shop/premiumBundle,プレミアムBUNDLE
shop/removeAds,広告を削除
shop/starterBundle,STARTER BUNDLE
starClaim/Claim,請求
starClaim/Claimx2,請求X2
tt/10objective,X10コンボをヒット
tt/4objective,ヒットX4コンボ
tt/7objective,ヒットX7コンボ
