﻿booster/hintDescription,"die Position zeigt, und 3 verbindet Ziel Artikel"
boosters/shuffle,Tauscht die Lage aller Elemente
contactUs/findaBug,Haben Sie ein Problem oder einen Fehler finden?
contactUs/leaveEmail,"Bitte geben Sie Ihre E-Mail, wenn Sie kontaktiert werden möchten zurück"
contactUs/letUsKnow,Lassen Sie es uns wissen.
contactUs/messgageLengthText,Nachricht sollte aus mindestens 5 Zeichen lang sein.
contactUs/send,Senden
contactUs/sendSuccesfully,Ihre Nachricht erfolgreich gesendet!
contactUs/tapToType,Tippen Sie auf den Typ ...
contactuUs/message,Botschaft:
dailyBonus/pickChest,Wählen Sie eine Brust Ihre Belohnung zu erhalten!
failed/Failed,Gescheitert
hearts/getMoreTitle,Holen Sie mehr Leben
leaderboard/country,Land
leaderboard/world,Welt
levelCompleted/Collect,Sammeln
levelCompleted/Continue,Fortsetzen
menu/dailyBonus,Täglicher Bonus
menu/leaderboard,Bestenliste
menu/leaderboardLoading,Leader wird geladen ...
menu/levelChest,Level Chest
menu/LevelTournament,Level Turnier
menu/selectBoosters,Wählen Sie Boosters:
menu/settings,die Einstellungen
menu/StarTournament,Stern-Turnier
menu/tournamentDescription,Komplette Ebenen und bekommen erstaunliche Belohnungen!
other/buy,Kaufen
other/casualOffer,Casual Angebot
other/exclusiveOffer,Exclusives Angebot
other/getButton,Erhalten!
other/getThePrize,um den Preis zu erhalten!
other/hardLevelTitle,Schwer
other/hint,Hinweis
other/hour,hr
other/hours,hrs
other/LevelText,Level 1
other/levelUp,Aufleveln!
other/loading,WIRD GELADEN...
other/loadProgress,Last Fortschritt
other/minutes,Mindest
other/more,Mehr
other/noVideo,"Sorry, aber es gibt kein verfügbares Video."
other/Play,abspielen
other/Players,Spieler
other/purchaseFailed,Leider ist der Kauf kann nicht abgeschlossen werden.
other/rank,Rang
other/removeAds,Anzeigen entfernen
other/Reward,Belohnung
other/score,Ergebnis
other/timeLeft,Übrige Zeit:
pause/pause,Pause
rateUs/notNow,Nicht jetzt
rateUs/showLove,Zeigen Sie uns etwas Liebe
rateUs/submit,einreichen
revive/oomConfirmation,Sie werden Ihre gesammelten Sterne verlieren
revive/outofBox,Aus der Box
revive/timeisUp,Die Zeit ist um!
settings/contactUs,Kontaktiere uns
settings/login,Speichern Fortschritt
settings/rateUs,Bewerten Sie uns
settings/restorePurchase,wiederherstellen Kauf
settings/saveProgress,Speichern Fortschritt
settings/signOut,Ausloggen
shop/epicBundle,EPIC BUNDLE
shop/megaBundle,MEGA BUNDLE
shop/premiumBundle,PREMIUM PAKET
shop/removeAds,ANZEIGEN ENTFERNEN
shop/starterBundle,Starter Bundle
starClaim/Claim,Anspruch
starClaim/Claimx2,Anspruch X2
tt/10objective,Hit x10 Combo
tt/4objective,Hit x4 Combo
tt/7objective,Hit x7 Combo
