<svg width="18" height="14" viewBox="0 0 18 14" fill="none" xmlns="http://www.w3.org/2000/svg">
<path d="M11.7 7C11.7 8.65685 10.4912 10 9 10C7.50883 10 6.3 8.65685 6.3 7C6.3 5.34315 7.50883 4 9 4C10.4912 4 11.7 5.34315 11.7 7Z" fill="#9196A7"/>
<path d="M17.905 6.55279C15.9626 2.23635 12.5128 0 9 0C5.48719 0 2.03741 2.23635 0.0950155 6.55279C-0.0316718 6.83431 -0.0316718 7.16569 0.0950155 7.44721C2.03741 11.7637 5.48719 14 9 14C12.5128 14 15.9626 11.7637 17.905 7.44721C18.0317 7.16569 18.0317 6.83431 17.905 6.55279ZM9 12C6.32809 12 3.59825 10.3792 1.91669 7C3.59825 3.62078 6.32809 2 9 2C11.6719 2 14.4018 3.62078 16.0833 7C14.4018 10.3792 11.6719 12 9 12Z" fill="#9196A7"/>
</svg>
