<svg width="17" height="12" viewBox="0 0 17 12" fill="none" xmlns="http://www.w3.org/2000/svg">
<path d="M5.66895 8.47345C6.05921 8.86236 6.69052 8.86235 7.08076 8.47341L14.8769 0.703276C15.2671 0.314441 15.8983 0.314419 16.2886 0.703095C16.681 1.09386 16.6812 1.72921 16.289 2.12011L7.08076 11.2966C6.69052 11.6854 6.05923 11.6854 5.66899 11.2966L0.710655 6.35532C0.318569 5.96459 0.318569 5.32965 0.710656 4.93891C1.10083 4.55008 1.732 4.55009 2.12218 4.93891L5.66895 8.47345Z" fill="#FFD700"/>
</svg>
