{
    "config_version": "2.5.1",
    "debug": false,
    "desktop-environment": "kde",
    "gfx_driver": "AMD / ATI (open-source)",
    "hostname": "arch",
    "keyboard-layout": "ru",
    "mirror-region": {
        "Russia": {
            "http://mirror.kamtv.ru/archlinux/$repo/os/$arch": true,
            "http://mirror.nw-sys.ru/archlinux/$repo/os/$arch": true,
            "http://mirror.surf/archlinux/$repo/os/$arch": true,
            "http://mirror.truenetwork.ru/archlinux/$repo/os/$arch": true,
            "http://mirror.yandex.ru/archlinux/$repo/os/$arch": true,
            "http://mirrors.powernet.com.ru/archlinux/$repo/os/$arch": true,
            "https://mirror.kamtv.ru/archlinux/$repo/os/$arch": true,
            "https://mirror.nw-sys.ru/archlinux/$repo/os/$arch": true,
            "https://mirror.surf/archlinux/$repo/os/$arch": true,
            "https://mirror.truenetwork.ru/archlinux/$repo/os/$arch": true,
            "https://mirror.yal.sl-chat.ru/archlinux/$repo/os/$arch": true,
            "https://mirror.yandex.ru/archlinux/$repo/os/$arch": true
        }
    },
    "nic": {
        "dhcp": true,
        "dns": null,
        "gateway": null,
        "iface": null,
        "ip": null,
        "type": "nm"
    },
    "no_pkg_lookups": false,
    "offline": false,
    "packages": [
        "micro",
        "ufw",
        "htop",
        "neofetch",
        "git",
        "firefox",
        "wget",
        "xclip",
        "wl-clipboard",
        "exa",
        "starship",
        "zip",
        "unzip",
        "p7zip",
        "mc",
        "smartmontools",
        "gsmartcontrol",
        "lm_sensors",
        "vulkan-tools",
        "radeontop",
        "clinfo",
        "lshw",
        "inxi",
        "hwinfo",
        "duf",
        "parted",
        "qbittorrent",
        "filezilla",
        "qalculate-qt",
        "ark",
        "kdenlive",
        "kwave",
        "ktouch",
        "rawtherapee",
        "gimp",
        "inkscape",
        "mpd",
        "haruna",
        "cantata",
        "kid3",
        "ffmpeg",
        "gnome-sound-recorder"
    ],
    "profile": {
        "path": "/usr/lib/python3.10/site-packages/archinstall/profiles/desktop.py"
    },
    "script": "guided",
    "silent": false,
    "timezone": "Europe/Moscow",
    "version": "2.5.1"
}
