<?xml version="1.0" encoding="UTF-8" standalone="no"?>
<!-- Generator: Adobe Illustrator 22.1.0, SVG Export Plug-In . SVG Version: 6.00 Build 0)  -->

<svg
   xmlns:dc="http://purl.org/dc/elements/1.1/"
   xmlns:cc="http://creativecommons.org/ns#"
   xmlns:rdf="http://www.w3.org/1999/02/22-rdf-syntax-ns#"
   xmlns:svg="http://www.w3.org/2000/svg"
   xmlns="http://www.w3.org/2000/svg"
   xmlns:sodipodi="http://sodipodi.sourceforge.net/DTD/sodipodi-0.dtd"
   xmlns:inkscape="http://www.inkscape.org/namespaces/inkscape"
   version="1.1"
   id="Layer_1"
   x="0px"
   y="0px"
   viewBox="0 0 554.19999 233.99999"
   xml:space="preserve"
   sodipodi:docname="ignition_logo_black_horizontal.svg"
   width="554.20001"
   height="234"
   inkscape:version="0.92.3 (2405546, 2018-03-11)"
   inkscape:export-filename="/home/nkoenig/ignition_logo_white_horizontal.png"
   inkscape:export-xdpi="299.89743"
   inkscape:export-ydpi="299.89743"><metadata
   id="metadata22"><rdf:RDF><cc:Work
       rdf:about=""><dc:format>image/svg+xml</dc:format><dc:type
         rdf:resource="http://purl.org/dc/dcmitype/StillImage" /><dc:title /></cc:Work></rdf:RDF></metadata><defs
   id="defs20"><clipPath
   clipPathUnits="userSpaceOnUse"
   id="clipPath951"><path
     d="M 0,0 H 792 V 612 H 0 Z"
     id="path949"
     inkscape:connector-curvature="0" /></clipPath><clipPath
   clipPathUnits="userSpaceOnUse"
   id="clipPath1003"><path
     d="M 0,0 H 792 V 612 H 0 Z"
     id="path1001"
     inkscape:connector-curvature="0" /></clipPath><clipPath
   clipPathUnits="userSpaceOnUse"
   id="clipPath979"><path
     d="M 0,0 H 792 V 612 H 0 Z"
     id="path977"
     inkscape:connector-curvature="0" /></clipPath>
	
	<linearGradient
   y2="617.78442"
   x2="2503.7773"
   y1="4369.0649"
   x1="2503.7773"
   gradientUnits="userSpaceOnUse"
   id="SVGID_1_">
		<stop
   id="stop6"
   style="stop-color:#DE6921"
   offset="0" />
		<stop
   id="stop8"
   style="stop-color:#E5B734"
   offset="1" />
	</linearGradient>
	
	
</defs><sodipodi:namedview
   pagecolor="#ffffff"
   bordercolor="#666666"
   borderopacity="1"
   objecttolerance="10"
   gridtolerance="10"
   guidetolerance="10"
   inkscape:pageopacity="0"
   inkscape:pageshadow="2"
   inkscape:window-width="1600"
   inkscape:window-height="1421"
   id="namedview18"
   showgrid="false"
   inkscape:zoom="1.5104"
   inkscape:cx="303.19548"
   inkscape:cy="-38.00476"
   inkscape:window-x="1688"
   inkscape:window-y="631"
   inkscape:window-maximized="0"
   inkscape:current-layer="Layer_1"
   fit-margin-top="0"
   fit-margin-left="0"
   fit-margin-right="0"
   fit-margin-bottom="0"
   units="px" />
<style
   type="text/css"
   id="style2">
	.st0{display:none;}
	.st1{fill:url(#SVGID_1_);}
	.st2{fill:#DE6921;stroke:#E5B734;stroke-miterlimit:10;}
</style>

<path
   style="display:none;fill:#000000;stroke-width:0.02063491"
   inkscape:connector-curvature="0"
   id="path4"
   d="m 177.7611,168.5109 c -34.38395,0 -68.77203,0 -103.162167,0 0,-34.38808 0,-68.774091 0,-103.168359 34.381887,0 68.765837,0 103.162167,0 0,34.386014 0,68.776159 0,103.168359 z m -48.93981,-45.56601 c -2.71556,-1.77873 -5.42905,-3.55746 -8.1446,-5.33619 -0.90794,-0.59428 -1.82,-1.18857 -2.72587,-1.78698 -0.0722,-0.0475 -0.18985,-0.066 -0.17334,-0.22079 0.69746,0.0598 1.39492,0.11762 2.09032,0.17952 0.69952,0.0619 1.39698,0.13207 2.09444,0.19191 0.69127,0.0598 1.38254,0.13825 2.09857,0.17746 -0.0371,-0.17746 -0.14651,-0.26619 -0.23111,-0.36937 -2.00571,-2.48238 -4.01349,-4.96269 -6.0192,-7.44507 -1.13286,-1.40111 -2.26572,-2.80222 -3.39651,-4.2054 -0.0433,-0.0557 -0.14444,-0.0991 -0.0784,-0.21873 0.14238,0.0805 0.28476,0.15889 0.42301,0.24143 11.40698,6.78063 22.81396,13.56126 34.22094,20.34189 0.73048,0.43334 1.44444,0.88937 2.13778,1.38667 6.37412,4.5727 10.08634,12.26333 9.34142,20.43888 -0.16921,1.8592 -0.5654,3.66682 -1.18238,5.42698 -0.41064,1.17 -0.91825,2.29667 -1.51254,3.38619 -0.0413,0.0743 -0.12175,0.14444 -0.0743,0.27444 0.13207,-0.0825 0.24969,-0.15063 0.36318,-0.22492 3.10555,-2.0346 6.21111,-4.07127 9.31666,-6.10793 0.27651,-0.18159 0.55302,-0.36111 0.82746,-0.54476 0.0413,-0.0268 0.10318,-0.0516 0.066,-0.14857 -0.12381,-0.002 -0.25793,-0.0103 -0.39,-0.008 -1.14111,0.0165 -2.28222,0.0371 -3.42539,0.0516 -0.0887,0.002 -0.19397,0.0454 -0.26826,-0.0763 0.0763,-0.12794 0.20016,-0.21667 0.30953,-0.31778 1.29174,-1.19476 2.58762,-2.38952 3.87936,-3.58428 1.95,-1.80143 3.90206,-3.60286 5.85,-5.40428 0.0722,-0.066 0.17539,-0.11762 0.1919,-0.26413 -0.10317,0.0186 -0.18365,0.0268 -0.26,0.0475 -0.42508,0.11349 -0.84809,0.23111 -1.27317,0.34667 -2.13571,0.57777 -4.27349,1.15349 -6.4092,1.7292 -0.0702,0.0186 -0.14445,0.0165 -0.28683,0.031 0.25794,-0.31984 0.4973,-0.56333 0.72429,-0.81714 0.23936,-0.26619 0.48079,-0.53032 0.72015,-0.79444 0.23111,-0.25381 0.46635,-0.50556 0.69127,-0.76556 0.23111,-0.26619 0.50143,-0.4973 0.70778,-0.83778 -0.45603,0.0144 -0.85222,0.13826 -1.2546,0.20429 -0.40651,0.0681 -0.80889,0.15683 -1.2154,0.23111 -0.40032,0.0722 -0.79444,0.18984 -1.2319,0.21048 0.0165,-0.0949 0.0227,-0.16096 0.0371,-0.22492 0.2827,-1.23191 0.56746,-2.46381 0.85222,-3.69778 0.80889,-3.50793 1.61984,-7.01793 2.43079,-10.52587 0.16921,-0.73666 0.34254,-1.47333 0.51381,-2.20793 0.0248,-0.10524 0.0227,-0.10524 -0.0248,-0.32397 -0.31158,0.28889 -0.61285,0.56746 -0.91412,0.84603 -0.31159,0.29095 -0.62318,0.58191 -0.93477,0.87286 -0.30127,0.2827 -0.60253,0.56333 -0.9038,0.84603 -0.30127,0.2827 -0.60254,0.56333 -0.90588,0.84603 -0.30127,0.28064 -0.60254,0.56333 -0.90587,0.84397 -0.31159,0.29095 -0.62111,0.58397 -0.93476,0.87285 -0.30333,0.27651 -0.5881,0.57366 -0.93683,0.85016 -0.099,-0.18158 -0.18571,-0.33635 -0.26619,-0.49317 -3.14476,-6.03571 -6.28745,-12.07349 -9.43015,-18.1092 -0.58397,-1.12254 -1.16587,-2.24508 -1.75397,-3.36555 -0.0392,-0.0743 -0.0454,-0.20222 -0.19603,-0.18159 -0.0495,0.37762 -0.10317,0.75937 -0.15063,1.13905 -0.0495,0.39619 -0.0949,0.79238 -0.14445,1.18651 -0.0475,0.38174 -0.0846,0.76555 -0.14857,1.14523 -0.064,0.38381 -0.0516,0.78413 -0.19397,1.19889 -0.38174,-0.30746 -0.71397,-0.61286 -1.05444,-0.90794 -0.33222,-0.28888 -0.66238,-0.57984 -0.9946,-0.86872 -0.34254,-0.29921 -0.68302,-0.59635 -1.02556,-0.89556 -0.34254,-0.29921 -0.68302,-0.59841 -1.02555,-0.89556 -0.33223,-0.28888 -0.66239,-0.57984 -0.99461,-0.86872 -0.34254,-0.29921 -0.68301,-0.59842 -1.02555,-0.89762 -0.34254,-0.29921 -0.68508,-0.59635 -1.02556,-0.89556 -0.33222,-0.28889 -0.66238,-0.57984 -0.9946,-0.86873 -0.34254,-0.2992 -0.68302,-0.59635 -1.02556,-0.89555 -0.34253,-0.29921 -0.68301,-0.59842 -1.02555,-0.89556 -0.33222,-0.28889 -0.66238,-0.57984 -0.9946,-0.86873 -0.34254,-0.299204 -0.68302,-0.596347 -1.02556,-0.895553 -0.34254,-0.299206 -0.68301,-0.598413 -1.02555,-0.895555 -0.33222,-0.288889 -0.66238,-0.579841 -0.99461,-0.86873 -0.34253,-0.299206 -0.68301,-0.598412 -1.02555,-0.895555 -0.34254,-0.299206 -0.68508,-0.596349 -1.02556,-0.895555 -0.33222,-0.288889 -0.66238,-0.579841 -0.9946,-0.86873 -0.34254,-0.299206 -0.68508,-0.596349 -1.02555,-0.895555 -0.34254,-0.299206 -0.68302,-0.598412 -1.02556,-0.897619 -0.33222,-0.288888 -0.66238,-0.579841 -0.9946,-0.868729 -0.34254,-0.299206 -0.68302,-0.596349 -1.02556,-0.895555 -0.34254,-0.299207 -0.68301,-0.598413 -1.02555,-0.895555 -0.33222,-0.288889 -0.66238,-0.579841 -0.9946,-0.86873 -0.34254,-0.299206 -0.68302,-0.598413 -1.02556,-0.895555 -0.34254,-0.299206 -0.68301,-0.596349 -1.02555,-0.895555 -0.33223,-0.288889 -0.66238,-0.579841 -0.99461,-0.86873 -0.34254,-0.299206 -0.68508,-0.596349 -1.02555,-0.895555 -0.34048,-0.299206 -0.68302,-0.598413 -1.02556,-0.895555 -0.33222,-0.288889 -0.66238,-0.579841 -0.9946,-0.86873 -0.34254,-0.299206 -0.68301,-0.598412 -1.02555,-0.897619 -0.34254,-0.299206 -0.68302,-0.598412 -1.02556,-0.895555 -0.33222,-0.288888 -0.66238,-0.579841 -0.9946,-0.868729 -0.34254,-0.299207 -0.68302,-0.598413 -1.02556,-0.897619 -0.34254,-0.299206 -0.68301,-0.596349 -1.02555,-0.895555 -0.33222,-0.288889 -0.65826,-0.583968 -0.9946,-0.86873 -0.33842,-0.284762 -0.64794,-0.60873 -1.04413,-0.83365 0.2146,0.476666 0.48286,0.920317 0.73667,1.368094 0.25174,0.441587 0.50555,0.883175 0.75936,1.324762 0.26,0.453968 0.52206,0.905872 0.78206,1.357777 0.26,0.453968 0.52,0.905872 0.78,1.35984 0.26,0.453968 0.52207,0.905873 0.78207,1.357777 0.25381,0.441587 0.50761,0.883175 0.75936,1.322698 0.26,0.453968 0.52,0.905873 0.78,1.359841 0.26,0.453968 0.52206,0.905872 0.78206,1.357777 0.26,0.453968 0.52,0.905872 0.78,1.35984 0.25381,0.441587 0.50762,0.881111 0.76143,1.322698 0.26,0.453968 0.52,0.905873 0.78,1.359841 0.26,0.453968 0.52,0.905872 0.78206,1.35984 0.26,0.453968 0.52207,0.905873 0.78207,1.359841 0.25381,0.441587 0.50555,0.883174 0.75936,1.324761 0.26,0.453968 0.52619,0.903809 0.78206,1.359841 0.25381,0.449841 0.53032,0.885237 0.80477,1.446507 -8.10322,-3.452631 -16.1137,-6.873899 -24.12417,-10.288976 -8.02285,-3.425395 -16.04983,-6.852854 -24.078874,-10.276186 -0.01857,0.01857 -0.03714,0.03714 -0.05778,0.05572 0.09079,0.101111 0.179523,0.202222 0.274444,0.301269 8.699678,9.01952 17.399356,18.039039 26.1011,27.058556 1.72921,1.79111 3.45841,3.58429 5.18555,5.37745 0.0805,0.0825 0.19191,0.14858 0.21873,0.31778 -0.60873,-0.0722 -1.1865,-0.19603 -1.76634,-0.28889 -0.58397,-0.0928 -1.16381,-0.20428 -1.74778,-0.30333 -0.58191,-0.0991 -1.16587,-0.19397 -1.74984,-0.29302 -0.58191,-0.099 -1.16587,-0.20015 -1.74778,-0.30127 -0.5819,-0.10111 -1.16381,-0.21253 -1.74778,-0.30126 -0.57571,-0.0887 -1.1473,-0.22699 -1.747776,-0.23731 0.546825,0.46224 1.120476,0.877 1.690006,1.3 0.58603,0.43334 1.17206,0.86667 1.76015,1.3 0.57572,0.42508 1.15143,0.85016 1.72508,1.27524 0.58603,0.43333 1.17413,0.8646 1.76016,1.29794 0.57571,0.42507 1.15143,0.85015 1.72508,1.27523 0.58397,0.43334 1.17206,0.86048 1.76635,1.30826 -0.0598,0.14857 -0.1073,0.27444 -0.16302,0.39825 -1.8819,4.17444 -3.76381,8.34682 -5.64571,12.5192 -0.6273,1.39079 -1.2546,2.78159 -1.87778,4.17444 -0.0413,0.0908 -0.10936,0.17953 -0.0825,0.33635 0.13826,-0.13206 0.24969,-0.23524 0.35492,-0.34047 2.39159,-2.37302 4.78524,-4.7481 7.17683,-7.12318 0.0784,-0.0784 0.15476,-0.15682 0.23523,-0.23111 0.0475,-0.0433 0.0929,-0.10729 0.17127,-0.0598 0.004,0.0124 0.0144,0.0248 0.0144,0.0371 -0.0722,3.90619 -0.14238,7.81032 -0.21461,11.71651 0,0.0103 0.006,0.0268 0.0165,0.033 0.0103,0.006 0.0268,0.006 0.064,0.0124 0.17746,-0.33016 0.31778,-0.68714 0.47873,-1.03381 0.15683,-0.33634 0.30127,-0.67888 0.46016,-1.01317 0.16095,-0.34254 0.28476,-0.70365 0.49936,-1.04413 0.13619,0.15064 0.14032,0.32397 0.18159,0.47873 0.68714,2.49065 1.37016,4.98333 2.04905,7.47604 0.0516,0.19191 0.13,0.35491 0.26,0.50556 0.58809,0.67475 1.16793,1.35364 1.7519,2.03254 0.0516,0.0598 0.11349,0.10936 0.21667,0.20841 -0.006,-0.12587 -0.006,-0.18778 -0.0124,-0.24969 -0.0371,-0.34254 -0.0825,-0.68302 -0.10937,-1.02556 -0.18158,-2.26571 -0.0392,-4.50873 0.46841,-6.72492 1.2608,-5.48888 4.15381,-9.92126 8.66048,-13.293 1.12254,-0.83984 2.27809,-1.63841 3.41301,-2.46381 m 9.96254,32.3803 c 6.44428,0.0144 11.73094,-5.20825 11.7392,-11.72063 0.008,-6.47935 -5.23095,-11.73714 -11.71238,-11.74952 -6.53301,-0.0124 -11.76603,5.28873 -11.75983,11.74333 0.002,6.47111 5.25777,11.73507 11.73301,11.72682 z"
   class="st0" /><path
   inkscape:connector-curvature="0"
   style="fill:#000000;stroke-width:0.02063491"
   id="path11"
   d="m 128.01652,123.60727 c -1.13492,0.82334 -2.28841,1.62397 -3.41301,2.46381 -4.50873,3.37175 -7.40174,7.80412 -8.66047,13.29301 -0.50762,2.21413 -0.65206,4.4592 -0.46841,6.72492 0.0268,0.34254 0.0743,0.68301 0.10936,1.02555 0.006,0.0619 0.006,0.12381 0.0124,0.24968 -0.10317,-0.099 -0.16508,-0.14857 -0.21666,-0.20841 -0.58397,-0.67682 -1.16381,-1.35777 -1.75191,-2.03254 -0.13,-0.15063 -0.20841,-0.31365 -0.26,-0.50555 -0.67889,-2.4927 -1.3619,-4.9854 -2.04905,-7.47603 -0.0433,-0.1527 -0.0454,-0.32809 -0.18158,-0.47873 -0.21461,0.34048 -0.33841,0.70159 -0.49937,1.04413 -0.15889,0.33635 -0.30333,0.67682 -0.46016,1.01317 -0.16095,0.34667 -0.2992,0.70365 -0.47873,1.03381 -0.0371,-0.006 -0.0537,-0.006 -0.064,-0.0124 -0.008,-0.006 -0.0165,-0.0206 -0.0165,-0.033 0.0722,-3.90619 0.14238,-7.81031 0.2146,-11.7165 0,-0.0124 -0.008,-0.0248 -0.0144,-0.0371 -0.0805,-0.0475 -0.12588,0.0144 -0.17127,0.0598 -0.0805,0.0743 -0.15683,0.15476 -0.23524,0.23111 -2.39159,2.37508 -4.78317,4.74809 -7.17682,7.12317 -0.10524,0.10524 -0.21667,0.20635 -0.35492,0.34048 -0.0268,-0.15683 0.0413,-0.24556 0.0825,-0.33635 0.62523,-1.39286 1.25047,-2.78365 1.87777,-4.17444 1.88191,-4.17238 3.76381,-8.34682 5.64571,-12.5192 0.0557,-0.12381 0.10318,-0.24969 0.16302,-0.39826 -0.59428,-0.44777 -1.18238,-0.87492 -1.76635,-1.30825 -0.57571,-0.42508 -1.14936,-0.85016 -1.72508,-1.27524 -0.58603,-0.43333 -1.17412,-0.86666 -1.76015,-1.29793 -0.57572,-0.42508 -1.15143,-0.85016 -1.72508,-1.27524 -0.58603,-0.43333 -1.17413,-0.8646 -1.76016,-1.3 -0.56952,-0.42095 -1.143174,-0.83778 -1.689999,-1.3 0.602539,0.008 1.172059,0.14857 1.747779,0.2373 0.58397,0.0887 1.16587,0.20016 1.74777,0.30127 0.58191,0.10111 1.16381,0.20222 1.74778,0.30127 0.58191,0.099 1.16587,0.19397 1.74984,0.29302 0.58191,0.099 1.16381,0.21047 1.74778,0.30333 0.5819,0.0929 1.15762,0.21667 1.76635,0.28889 -0.0268,-0.16714 -0.13826,-0.23318 -0.21873,-0.31778 -1.72715,-1.79317 -3.45635,-3.58428 -5.18556,-5.37746 -8.699674,-9.019516 -17.401416,-18.039035 -26.101094,-27.058554 -0.09492,-0.09698 -0.18365,-0.200159 -0.274444,-0.30127 0.01857,-0.01857 0.03714,-0.03714 0.05778,-0.05571 8.02698,3.425395 16.05396,6.852854 24.082998,10.274122 8.01048,3.415077 16.02095,6.834282 24.12428,10.288566 -0.27445,-0.56127 -0.55096,-0.996666 -0.80476,-1.446507 -0.25588,-0.456032 -0.52207,-0.905873 -0.78207,-1.359841 -0.25381,-0.441587 -0.50555,-0.883174 -0.75936,-1.324761 -0.26,-0.453968 -0.52,-0.905873 -0.78207,-1.359841 -0.26,-0.453968 -0.52,-0.905872 -0.78206,-1.35984 -0.26,-0.453968 -0.52,-0.905873 -0.78,-1.359841 -0.25381,-0.441587 -0.50762,-0.881111 -0.76143,-1.322698 -0.26,-0.453968 -0.52,-0.905872 -0.78,-1.35984 -0.26,-0.453968 -0.52206,-0.905873 -0.78206,-1.357777 -0.26,-0.453968 -0.52,-0.905873 -0.78,-1.359841 -0.25381,-0.441587 -0.50762,-0.883174 -0.75936,-1.322698 -0.26,-0.453968 -0.52207,-0.905872 -0.78207,-1.357777 -0.26,-0.453968 -0.52,-0.905872 -0.78,-1.35984 -0.26,-0.453968 -0.52206,-0.905873 -0.78206,-1.357777 -0.25381,-0.441587 -0.50762,-0.881111 -0.75936,-1.324762 -0.25588,-0.449841 -0.52413,-0.891428 -0.73667,-1.368094 0.39825,0.22492 0.70571,0.546825 1.04413,0.83365 0.33635,0.284762 0.66444,0.577778 0.9946,0.86873 0.34254,0.299206 0.68301,0.596349 1.02555,0.895555 0.34254,0.299206 0.68302,0.598412 1.02556,0.897619 0.33222,0.288888 0.66238,0.579841 0.9946,0.868729 0.34254,0.299207 0.68302,0.596349 1.02556,0.895555 0.34254,0.299207 0.68301,0.598413 1.02555,0.897619 0.33222,0.288889 0.66238,0.579841 0.9946,0.86873 0.34254,0.299206 0.68302,0.598412 1.02556,0.895555 0.34254,0.297143 0.68508,0.596349 1.02555,0.895555 0.33223,0.288889 0.66238,0.579841 0.99461,0.86873 0.34254,0.299206 0.68301,0.596349 1.02555,0.895555 0.34254,0.299206 0.68302,0.598412 1.02556,0.895555 0.33222,0.288889 0.66238,0.579841 0.9946,0.86873 0.34254,0.299206 0.68302,0.598412 1.02555,0.895555 0.34254,0.299206 0.68302,0.598412 1.02556,0.895555 0.33222,0.288888 0.66238,0.579841 0.9946,0.868729 0.34254,0.299207 0.68302,0.598413 1.02556,0.897619 0.34254,0.299206 0.68508,0.596349 1.02555,0.895555 0.33222,0.288889 0.66238,0.579841 0.9946,0.86873 0.34254,0.299206 0.68302,0.596349 1.02556,0.895555 0.34254,0.299206 0.68302,0.598412 1.02556,0.895555 0.33222,0.288889 0.66238,0.579841 0.9946,0.86873 0.34254,0.299206 0.68301,0.598412 1.02555,0.895555 0.34254,0.299206 0.68302,0.596349 1.02556,0.895546 0.33222,0.28889 0.66238,0.57985 0.9946,0.86873 0.34254,0.29921 0.68302,0.59842 1.02556,0.89556 0.34253,0.29921 0.68507,0.59635 1.02555,0.89555 0.33222,0.28889 0.66238,0.57985 0.9946,0.86873 0.34254,0.29921 0.68508,0.59635 1.02556,0.89556 0.34254,0.29921 0.68301,0.59841 1.02555,0.89762 0.33223,0.28889 0.66238,0.57984 0.99461,0.86873 0.34254,0.2992 0.68301,0.59841 1.02555,0.89555 0.34254,0.29921 0.68302,0.59635 1.02556,0.89556 0.33222,0.28889 0.66238,0.5819 0.9946,0.86873 0.34047,0.29508 0.6727,0.60047 1.05444,0.90793 0.14032,-0.41682 0.13,-0.81508 0.19397,-1.19888 0.064,-0.37969 0.10111,-0.7635 0.14857,-1.14524 0.0495,-0.39619 0.0949,-0.79238 0.14445,-1.18651 0.0475,-0.37968 0.10111,-0.76143 0.15063,-1.13905 0.1527,-0.0206 0.15889,0.10731 0.19603,0.18159 0.5881,1.12048 1.17,2.24302 1.75397,3.36555 3.1427,6.03572 6.28746,12.07349 9.43015,18.1092 0.0825,0.15683 0.16715,0.31159 0.26619,0.49318 0.34873,-0.27651 0.6335,-0.57365 0.93683,-0.85016 0.31365,-0.28889 0.62317,-0.58191 0.93476,-0.87286 0.30127,-0.28063 0.60254,-0.56333 0.90587,-0.84397 0.30127,-0.28063 0.60254,-0.56333 0.90588,-0.84603 0.30127,-0.2827 0.60254,-0.56333 0.9038,-0.84603 0.31159,-0.29095 0.62318,-0.5819 0.93477,-0.87286 0.2992,-0.27857 0.60047,-0.55714 0.91412,-0.84603 0.0495,0.21873 0.0495,0.21873 0.0248,0.32397 -0.17127,0.73667 -0.3446,1.47127 -0.5138,2.20794 -0.81096,3.50793 -1.61984,7.01793 -2.4308,10.52586 -0.28476,1.23191 -0.56746,2.46381 -0.85222,3.69778 -0.0144,0.064 -0.0206,0.12794 -0.0371,0.22492 0.43746,-0.0206 0.83159,-0.13619 1.2319,-0.21048 0.40651,-0.0743 0.80889,-0.16301 1.2154,-0.23111 0.40238,-0.066 0.79857,-0.1919 1.2546,-0.20428 -0.20635,0.34047 -0.47667,0.57158 -0.70778,0.83777 -0.22492,0.26 -0.46015,0.50969 -0.69127,0.76556 -0.23936,0.26413 -0.48079,0.52825 -0.72015,0.79444 -0.22699,0.25381 -0.46842,0.49731 -0.72429,0.81715 0.14238,-0.0145 0.21667,-0.0124 0.28683,-0.031 2.13777,-0.57571 4.27349,-1.15142 6.4092,-1.7292 0.42508,-0.11556 0.84809,-0.23318 1.27317,-0.34667 0.0784,-0.0206 0.15889,-0.0289 0.26,-0.0475 -0.0165,0.14651 -0.11968,0.1981 -0.1919,0.26413 -1.95,1.80349 -3.9,3.60492 -5.85,5.40428 -1.29381,1.19476 -2.58762,2.38952 -3.87936,3.58429 -0.10937,0.10111 -0.23318,0.18984 -0.30953,0.31777 0.0722,0.12175 0.17953,0.0763 0.26826,0.0763 1.14111,-0.0144 2.28428,-0.0351 3.42539,-0.0516 0.13413,-0.002 0.26619,0.006 0.39,0.008 0.0371,0.0949 -0.0248,0.12174 -0.066,0.14857 -0.27444,0.18365 -0.55095,0.36317 -0.82746,0.54476 -3.10555,2.03667 -6.21111,4.07127 -9.31666,6.10794 -0.11349,0.0743 -0.23111,0.14238 -0.36317,0.22492 -0.0495,-0.13 0.033,-0.20016 0.0743,-0.27445 0.59429,-1.08952 1.10191,-2.21619 1.51254,-3.38619 0.61698,-1.76016 1.01317,-3.56777 1.18238,-5.42698 0.74698,-8.17555 -2.9673,-15.86618 -9.34142,-20.43888 -0.69334,-0.4973 -1.4073,-0.95127 -2.13778,-1.38666 -11.40698,-6.78063 -22.81396,-13.56127 -34.22094,-20.3419 -0.14031,-0.0825 -0.28269,-0.16095 -0.42301,-0.24143 -0.066,0.11969 0.0351,0.16302 0.0784,0.21873 1.1308,1.40318 2.26365,2.80429 3.39651,4.2054 2.00571,2.48238 4.01349,4.96269 6.0192,7.44507 0.0846,0.10318 0.19397,0.19397 0.23111,0.36937 -0.71603,-0.0392 -1.4073,-0.11762 -2.09857,-0.17746 -0.69952,-0.0619 -1.39698,-0.13 -2.09444,-0.19191 -0.6954,-0.0619 -1.39286,-0.11968 -2.09032,-0.17952 -0.0165,0.15476 0.10318,0.1754 0.17334,0.22079 0.90587,0.59842 1.81793,1.1927 2.72587,1.78699 2.71555,1.77873 5.43111,3.55746 8.1446,5.33619"
   class="st1" /><path
   style="fill:#000000;stroke:none;stroke-width:0.02063491;stroke-miterlimit:10"
   inkscape:connector-curvature="0"
   id="path13"
   d="m 137.977,155.98964 c -6.47524,0.008 -11.72889,-5.25365 -11.73301,-11.72682 -0.004,-6.4546 5.22682,-11.75571 11.75983,-11.74333 6.48143,0.0124 11.72063,5.27016 11.71238,11.74952 -0.008,6.51031 -5.29699,11.73301 -11.7392,11.72063 z"
   class="st2" /><g
   aria-label="IGNITION"
   style="font-style:normal;font-weight:normal;font-size:40px;line-height:1.25;font-family:sans-serif;letter-spacing:0px;word-spacing:0px;fill:#000000;fill-opacity:1;stroke:none"
   id="text824"><path
     d="m 188.68498,110.81601 h 4.736 v 44.8 h -4.736 z"
     style="font-style:normal;font-variant:normal;font-weight:normal;font-stretch:normal;font-size:64px;font-family:Montserrat;-inkscape-font-specification:Montserrat;fill:#000000"
     id="path2770" /><path
     d="m 239.61198,133.21601 h 4.544 v 17.088 q -3.136,2.752 -7.424,4.224 -4.288,1.472 -9.024,1.472 -6.72,0 -12.096,-2.944 -5.376,-2.944 -8.448,-8.128 -3.072,-5.248 -3.072,-11.712 0,-6.464 3.072,-11.648 3.072,-5.248 8.448,-8.192 5.376,-2.944 12.16,-2.944 5.12,0 9.408,1.664 4.288,1.6 7.232,4.8 l -2.944,3.008 q -5.312,-5.248 -13.504,-5.248 -5.44,0 -9.856,2.432 -4.352,2.368 -6.848,6.656 -2.496,4.224 -2.496,9.472 0,5.248 2.496,9.472 2.496,4.224 6.848,6.656 4.352,2.432 9.792,2.432 6.912,0 11.712,-3.456 z"
     style="font-style:normal;font-variant:normal;font-weight:normal;font-stretch:normal;font-size:64px;font-family:Montserrat;-inkscape-font-specification:Montserrat;fill:#000000"
     id="path2772" /><path
     d="m 294.99998,110.81601 v 44.8 h -3.904 l -28.8,-36.352 v 36.352 h -4.736 v -44.8 h 3.904 l 28.864,36.352 v -36.352 z"
     style="font-style:normal;font-variant:normal;font-weight:normal;font-stretch:normal;font-size:64px;font-family:Montserrat;-inkscape-font-specification:Montserrat;fill:#000000"
     id="path2774" /><path
     d="m 309.55998,110.81601 h 4.736 v 44.8 h -4.736 z"
     style="font-style:normal;font-variant:normal;font-weight:normal;font-stretch:normal;font-size:64px;font-family:Montserrat;-inkscape-font-specification:Montserrat;fill:#000000"
     id="path2776" /><path
     d="m 337.63898,114.91201 h -15.744 v -4.096 h 36.224 v 4.096 h -15.744 v 40.704 h -4.736 z"
     style="font-style:normal;font-variant:normal;font-weight:normal;font-stretch:normal;font-size:64px;font-family:Montserrat;-inkscape-font-specification:Montserrat;fill:#000000"
     id="path2778" /><path
     d="m 365.68498,110.81601 h 4.736 v 44.8 h -4.736 z"
     style="font-style:normal;font-variant:normal;font-weight:normal;font-stretch:normal;font-size:64px;font-family:Montserrat;-inkscape-font-specification:Montserrat;fill:#000000"
     id="path2780" /><path
     d="m 404.64398,156.00001 q -6.656,0 -12.096,-2.944 -5.376,-3.008 -8.448,-8.192 -3.008,-5.184 -3.008,-11.648 0,-6.464 3.008,-11.648 3.072,-5.184 8.448,-8.128 5.44,-3.008 12.096,-3.008 6.656,0 11.968,2.944 5.376,2.944 8.448,8.192 3.072,5.184 3.072,11.648 0,6.464 -3.072,11.712 -3.072,5.184 -8.448,8.128 -5.312,2.944 -11.968,2.944 z m 0,-4.224 q 5.312,0 9.6,-2.368 4.288,-2.432 6.72,-6.656 2.432,-4.288 2.432,-9.536 0,-5.248 -2.432,-9.472 -2.432,-4.288 -6.72,-6.656 -4.288,-2.432 -9.6,-2.432 -5.312,0 -9.664,2.432 -4.288,2.368 -6.784,6.656 -2.432,4.224 -2.432,9.472 0,5.248 2.432,9.536 2.496,4.224 6.784,6.656 4.352,2.368 9.664,2.368 z"
     style="font-style:normal;font-variant:normal;font-weight:normal;font-stretch:normal;font-size:64px;font-family:Montserrat;-inkscape-font-specification:Montserrat;fill:#000000"
     id="path2782" /><path
     d="m 476.24998,110.81601 v 44.8 h -3.904 l -28.8,-36.352 v 36.352 h -4.736 v -44.8 h 3.904 l 28.864,36.352 v -36.352 z"
     style="font-style:normal;font-variant:normal;font-weight:normal;font-stretch:normal;font-size:64px;font-family:Montserrat;-inkscape-font-specification:Montserrat;fill:#000000"
     id="path2784" /></g>
<g
   transform="matrix(1.3333333,0,0,-1.3333333,-532.0244,323.55814)"
   id="g945"
   style="fill:#000000"><g
     id="g947"
     clip-path="url(#clipPath951)"
     style="fill:#000000" /></g></svg>