<?xml version="1.0" encoding="UTF-8" standalone="no"?>
<!-- Generator: Adobe Illustrator 22.1.0, SVG Export Plug-In . SVG Version: 6.00 Build 0)  -->

<svg
   xmlns:dc="http://purl.org/dc/elements/1.1/"
   xmlns:cc="http://creativecommons.org/ns#"
   xmlns:rdf="http://www.w3.org/1999/02/22-rdf-syntax-ns#"
   xmlns:svg="http://www.w3.org/2000/svg"
   xmlns="http://www.w3.org/2000/svg"
   xmlns:sodipodi="http://sodipodi.sourceforge.net/DTD/sodipodi-0.dtd"
   xmlns:inkscape="http://www.inkscape.org/namespaces/inkscape"
   version="1.1"
   id="Layer_1"
   x="0px"
   y="0px"
   viewBox="0 0 429.342 431.99998"
   xml:space="preserve"
   sodipodi:docname="ignition_logo_white_vertical.svg"
   width="429.34201"
   height="432"
   inkscape:version="0.92.3 (2405546, 2018-03-11)"
   inkscape:export-filename="/home/nkoenig/ignition_logo_white_vertical.png"
   inkscape:export-xdpi="300"
   inkscape:export-ydpi="300"><metadata
   id="metadata22"><rdf:RDF><cc:Work
       rdf:about=""><dc:format>image/svg+xml</dc:format><dc:type
         rdf:resource="http://purl.org/dc/dcmitype/StillImage" /><dc:title /></cc:Work></rdf:RDF></metadata><defs
   id="defs20"><clipPath
     clipPathUnits="userSpaceOnUse"
     id="clipPath951"><path
       d="M 0,0 H 792 V 612 H 0 Z"
       id="path949"
       inkscape:connector-curvature="0" /></clipPath><clipPath
     clipPathUnits="userSpaceOnUse"
     id="clipPath1003"><path
       d="M 0,0 H 792 V 612 H 0 Z"
       id="path1001"
       inkscape:connector-curvature="0" /></clipPath><clipPath
     clipPathUnits="userSpaceOnUse"
     id="clipPath979"><path
       d="M 0,0 H 792 V 612 H 0 Z"
       id="path977"
       inkscape:connector-curvature="0" /></clipPath><linearGradient
     id="SVGID_1_-3"
     gradientUnits="userSpaceOnUse"
     x1="2503.7773"
     y1="4369.0649"
     x2="2503.7773"
     y2="617.78442"><stop
       offset="0"
       style="stop-color:#DE6921"
       id="stop6-8" /><stop
       offset="1"
       style="stop-color:#E5B734"
       id="stop8-5" /></linearGradient><linearGradient
     y2="617.78442"
     x2="2503.7773"
     y1="4369.0649"
     x1="2503.7773"
     gradientUnits="userSpaceOnUse"
     id="linearGradient1848"><stop
       id="stop1844"
       style="stop-color:#DE6921"
       offset="0" /><stop
       id="stop1846"
       style="stop-color:#E5B734"
       offset="1" /></linearGradient></defs><sodipodi:namedview
   pagecolor="#ffffff"
   bordercolor="#666666"
   borderopacity="1"
   objecttolerance="10"
   gridtolerance="10"
   guidetolerance="10"
   inkscape:pageopacity="0"
   inkscape:pageshadow="2"
   inkscape:window-width="2352"
   inkscape:window-height="1625"
   id="namedview18"
   showgrid="false"
   inkscape:zoom="2.1360282"
   inkscape:cx="81.336158"
   inkscape:cy="192.90995"
   inkscape:window-x="171"
   inkscape:window-y="256"
   inkscape:window-maximized="0"
   inkscape:current-layer="Layer_1"
   fit-margin-top="0"
   fit-margin-left="0"
   fit-margin-right="0"
   fit-margin-bottom="0"
   units="px"
   showguides="true"
   inkscape:guide-bbox="true" />
<style
   type="text/css"
   id="style2">
	.st0{display:none;}
	.st1{fill:url(#SVGID_1_);}
	.st2{fill:#DE6921;stroke:#E5B734;stroke-miterlimit:10;}
</style>

<g
   transform="matrix(1.3333333,0,0,-1.3333333,-626.55637,521.68615)"
   id="g945"
   style="fill:#ffffff"><g
     id="g947"
     clip-path="url(#clipPath951)"
     style="fill:#ffffff" /></g><g
   aria-label="IGNITION"
   style="font-style:normal;font-weight:normal;font-size:40px;line-height:1.25;font-family:sans-serif;letter-spacing:0px;word-spacing:0px;fill:#ffffff;fill-opacity:1;stroke:none"
   id="text824"><path
     d="m 121.77079,293.87781 h 3.15734 v 29.86667 h -3.15734 z"
     style="font-style:normal;font-variant:normal;font-weight:normal;font-stretch:normal;font-size:42.66666794px;font-family:Montserrat;-inkscape-font-specification:Montserrat;fill:#ffffff"
     id="path2725" /><path
     d="m 155.72213,308.81114 h 3.02933 v 11.392 q -2.09067,1.83467 -4.94933,2.816 -2.85867,0.98134 -6.016,0.98134 -4.48,0 -8.064,-1.96267 -3.584,-1.96267 -5.632,-5.41867 -2.048,-3.49866 -2.048,-7.808 0,-4.30933 2.048,-7.76533 2.048,-3.49867 5.632,-5.46133 3.584,-1.96267 8.10666,-1.96267 3.41334,0 6.272,1.10933 2.85867,1.06667 4.82134,3.2 l -1.96267,2.00534 q -3.54133,-3.49867 -9.00267,-3.49867 -3.62666,0 -6.57066,1.62133 -2.90134,1.57867 -4.56534,4.43734 -1.664,2.816 -1.664,6.31466 0,3.49867 1.664,6.31467 1.664,2.816 4.56534,4.43733 2.90133,1.62134 6.528,1.62134 4.608,0 7.808,-2.304 z"
     style="font-style:normal;font-variant:normal;font-weight:normal;font-stretch:normal;font-size:42.66666794px;font-family:Montserrat;-inkscape-font-specification:Montserrat;fill:#ffffff"
     id="path2727" /><path
     d="m 192.64746,293.87781 v 29.86667 h -2.60267 l -19.2,-24.23467 v 24.23467 h -3.15733 v -29.86667 h 2.60267 l 19.24266,24.23467 v -24.23467 z"
     style="font-style:normal;font-variant:normal;font-weight:normal;font-stretch:normal;font-size:42.66666794px;font-family:Montserrat;-inkscape-font-specification:Montserrat;fill:#ffffff"
     id="path2729" /><path
     d="m 202.35413,293.87781 h 3.15733 v 29.86667 h -3.15733 z"
     style="font-style:normal;font-variant:normal;font-weight:normal;font-stretch:normal;font-size:42.66666794px;font-family:Montserrat;-inkscape-font-specification:Montserrat;fill:#ffffff"
     id="path2731" /><path
     d="m 221.07346,296.60848 h -10.496 v -2.73067 h 24.14933 v 2.73067 h -10.496 v 27.136 h -3.15733 z"
     style="font-style:normal;font-variant:normal;font-weight:normal;font-stretch:normal;font-size:42.66666794px;font-family:Montserrat;-inkscape-font-specification:Montserrat;fill:#ffffff"
     id="path2733" /><path
     d="m 239.77079,293.87781 h 3.15734 v 29.86667 h -3.15734 z"
     style="font-style:normal;font-variant:normal;font-weight:normal;font-stretch:normal;font-size:42.66666794px;font-family:Montserrat;-inkscape-font-specification:Montserrat;fill:#ffffff"
     id="path2735" /><path
     d="m 265.74346,324.00048 q -4.43733,0 -8.064,-1.96267 -3.584,-2.00533 -5.632,-5.46133 -2.00533,-3.456 -2.00533,-7.76534 0,-4.30933 2.00533,-7.76533 2.048,-3.456 5.632,-5.41867 3.62667,-2.00533 8.064,-2.00533 4.43734,0 7.97867,1.96267 3.584,1.96266 5.632,5.46133 2.048,3.456 2.048,7.76533 0,4.30934 -2.048,7.808 -2.048,3.456 -5.632,5.41867 -3.54133,1.96267 -7.97867,1.96267 z m 0,-2.816 q 3.54134,0 6.4,-1.57867 2.85867,-1.62133 4.48,-4.43733 1.62134,-2.85867 1.62134,-6.35734 0,-3.49866 -1.62134,-6.31466 -1.62133,-2.85867 -4.48,-4.43734 -2.85866,-1.62133 -6.4,-1.62133 -3.54133,0 -6.44266,1.62133 -2.85867,1.57867 -4.52267,4.43734 -1.62133,2.816 -1.62133,6.31466 0,3.49867 1.62133,6.35734 1.664,2.816 4.52267,4.43733 2.90133,1.57867 6.44266,1.57867 z"
     style="font-style:normal;font-variant:normal;font-weight:normal;font-stretch:normal;font-size:42.66666794px;font-family:Montserrat;-inkscape-font-specification:Montserrat;fill:#ffffff"
     id="path2737" /><path
     d="m 313.48079,293.87781 v 29.86667 h -2.60266 l -19.2,-24.23467 v 24.23467 h -3.15734 v -29.86667 h 2.60267 l 19.24267,24.23467 v -24.23467 z"
     style="font-style:normal;font-variant:normal;font-weight:normal;font-stretch:normal;font-size:42.66666794px;font-family:Montserrat;-inkscape-font-specification:Montserrat;fill:#ffffff"
     id="path2739" /></g><path
   style="display:none;fill:#ffffff;stroke-width:0.0456357"
   inkscape:connector-curvature="0"
   id="path4-5"
   d="m 328.73972,308.17139 c -76.04277,0 -152.09466,0 -228.15112,0 0,-76.05189 0,-152.09922 0,-228.164806 76.03821,0 152.08097,0 228.15112,0 0,76.047326 0,152.103786 0,228.164806 z M 220.50553,207.39864 c -6.00566,-3.9338 -12.00675,-7.86759 -18.01241,-11.80139 -2.00797,-1.31431 -4.02507,-2.62862 -6.02848,-3.95205 -0.15972,-0.10497 -0.41984,-0.14604 -0.38333,-0.48831 1.54248,0.13235 3.08497,0.26013 4.62289,0.39704 1.54705,0.1369 3.08954,0.29206 4.63203,0.42441 1.52879,0.13234 3.05759,0.30576 4.64115,0.39246 -0.0822,-0.39246 -0.32402,-0.5887 -0.51112,-0.81687 -4.43579,-5.48998 -8.87615,-10.97539 -13.31194,-16.46537 -2.5054,-3.09866 -5.0108,-6.19732 -7.51163,-9.30055 -0.0958,-0.12322 -0.31945,-0.21905 -0.17342,-0.48374 0.31489,0.17798 0.62977,0.3514 0.93553,0.53394 25.22742,14.99589 50.45483,29.99178 75.68225,44.98767 1.6155,0.95835 3.1945,1.9669 4.72786,3.06672 14.09686,10.11287 22.30673,27.1213 20.65928,45.20216 -0.37422,4.11178 -1.25042,8.10946 -2.61493,12.00219 -0.90815,2.58754 -2.03079,5.07925 -3.3451,7.48882 -0.0913,0.16429 -0.26925,0.31945 -0.16428,0.60695 0.29206,-0.18254 0.55219,-0.33314 0.80318,-0.49743 6.86818,-4.49968 13.73635,-9.00392 20.60452,-13.50816 0.61152,-0.4016 1.22304,-0.79863 1.82999,-1.20479 0.0913,-0.0593 0.22818,-0.11408 0.14604,-0.32857 -0.27382,-0.005 -0.57045,-0.0228 -0.86252,-0.0183 -2.52365,0.0365 -5.0473,0.0822 -7.57552,0.11409 -0.19624,0.005 -0.42898,0.1004 -0.59327,-0.16885 0.16886,-0.28294 0.44267,-0.47917 0.68454,-0.70279 2.85679,-2.64231 5.72272,-5.28461 8.57951,-7.92692 4.31257,-3.984 8.62971,-7.96799 12.93772,-11.95199 0.15973,-0.14603 0.38791,-0.26012 0.42441,-0.58414 -0.22817,0.0411 -0.40615,0.0593 -0.57501,0.10496 -0.94009,0.251 -1.87562,0.51112 -2.81572,0.76668 -4.72329,1.2778 -9.45115,2.55104 -14.17445,3.82428 -0.15516,0.0411 -0.31945,0.0365 -0.63433,0.0685 0.57044,-0.70735 1.09982,-1.24585 1.60181,-1.80717 0.52937,-0.5887 1.06331,-1.17284 1.59269,-1.75698 0.51112,-0.56132 1.03136,-1.11807 1.52879,-1.69308 0.51112,-0.5887 1.10895,-1.09982 1.56531,-1.85281 -1.00855,0.0319 -1.88476,0.30576 -2.77465,0.45179 -0.89903,0.1506 -1.78892,0.34683 -2.68795,0.51112 -0.88533,0.15973 -1.75697,0.41985 -2.72445,0.46549 0.0365,-0.20993 0.0502,-0.35596 0.0822,-0.49743 0.6252,-2.72446 1.25498,-5.44891 1.88475,-8.17792 1.78892,-7.75807 3.5824,-15.5207 5.37589,-23.27877 0.37421,-1.6292 0.75755,-3.25839 1.13632,-4.88302 0.0548,-0.23274 0.0502,-0.23274 -0.0548,-0.71648 -0.6891,0.6389 -1.35538,1.25498 -2.02166,1.87106 -0.6891,0.64346 -1.3782,1.28693 -2.0673,1.93039 -0.66628,0.62521 -1.33256,1.24586 -1.99884,1.87107 -0.66628,0.6252 -1.33256,1.24585 -2.00341,1.87106 -0.66628,0.62064 -1.33256,1.24585 -2.00341,1.8665 -0.68909,0.64346 -1.37363,1.29149 -2.06729,1.93039 -0.67085,0.61152 -1.30062,1.26867 -2.07186,1.88019 -0.21905,-0.40159 -0.41072,-0.74386 -0.5887,-1.09069 -6.95488,-13.34845 -13.9052,-26.70145 -20.85552,-40.04989 -1.29149,-2.48259 -2.57842,-4.96517 -3.87903,-7.44319 -0.0867,-0.16428 -0.1004,-0.44723 -0.43354,-0.40159 -0.10953,0.83513 -0.22818,1.67939 -0.33314,2.51909 -0.10953,0.87621 -0.20993,1.75241 -0.31945,2.62405 -0.10496,0.84426 -0.18711,1.69309 -0.32858,2.53278 -0.14147,0.84883 -0.11409,1.73416 -0.42898,2.65144 -0.84426,-0.67997 -1.57899,-1.35538 -2.33198,-2.00797 -0.73473,-0.6389 -1.46491,-1.28237 -2.19964,-1.92127 -0.75755,-0.66171 -1.51054,-1.31887 -2.26809,-1.98058 -0.75756,-0.66172 -1.51055,-1.32344 -2.2681,-1.98059 -0.73473,-0.6389 -1.4649,-1.28237 -2.19964,-1.92127 -0.75755,-0.66171 -1.51054,-1.32343 -2.26809,-1.98515 -0.75756,-0.66172 -1.51511,-1.31887 -2.2681,-1.98059 -0.73473,-0.6389 -1.4649,-1.28236 -2.19964,-1.92126 -0.75755,-0.66172 -1.51054,-1.31887 -2.26809,-1.98059 -0.75756,-0.66172 -1.51055,-1.32344 -2.2681,-1.98059 -0.73473,-0.6389 -1.4649,-1.28236 -2.19964,-1.92126 -0.75755,-0.66172 -1.51054,-1.31888 -2.26809,-1.98059 -0.75756,-0.66172 -1.51054,-1.32344 -2.2681,-1.98059 -0.73473,-0.6389 -1.4649,-1.28237 -2.19964,-1.92127 -0.75755,-0.66171 -1.51054,-1.32343 -2.26809,-1.98059 -0.75755,-0.66171 -1.51511,-1.31887 -2.2681,-1.98058 -0.73473,-0.6389 -1.4649,-1.28237 -2.19964,-1.92127 -0.75755,-0.66172 -1.5151,-1.31887 -2.26809,-1.98059 -0.75755,-0.66171 -1.51054,-1.32343 -2.2681,-1.98515 -0.73473,-0.6389 -1.4649,-1.28236 -2.19964,-1.92126 -0.75755,-0.66172 -1.51054,-1.31887 -2.26809,-1.98059 -0.75755,-0.66172 -1.51054,-1.32344 -2.26809,-1.98059 -0.73474,-0.6389 -1.46491,-1.28236 -2.19965,-1.92126 -0.75755,-0.66172 -1.51054,-1.32344 -2.26809,-1.98059 -0.75755,-0.66172 -1.51054,-1.31888 -2.26809,-1.98059 -0.73474,-0.6389 -1.46491,-1.28237 -2.19964,-1.92127 -0.75756,-0.66171 -1.51511,-1.31887 -2.2681,-1.98059 -0.75299,-0.66171 -1.51054,-1.32343 -2.26809,-1.98059 -0.73474,-0.63889 -1.46491,-1.28236 -2.19964,-1.92126 -0.75756,-0.66172 -1.51055,-1.32343 -2.2681,-1.98515 -0.75755,-0.66172 -1.51054,-1.32344 -2.26809,-1.98059 -0.73474,-0.6389 -1.46491,-1.28236 -2.19964,-1.92126 -0.75756,-0.66172 -1.51055,-1.32344 -2.2681,-1.98516 -0.75755,-0.66171 -1.51054,-1.31887 -2.26809,-1.98059 -0.73474,-0.6389 -1.45578,-1.29149 -2.19964,-1.92126 -0.74843,-0.62977 -1.43296,-1.34625 -2.30917,-1.84368 0.47461,1.05418 1.06788,2.03535 1.6292,3.02565 0.55675,0.9766 1.11807,1.9532 1.67939,2.92981 0.57501,1.00398 1.15458,2.00341 1.72959,3.00283 0.57501,1.00398 1.15002,2.0034 1.72503,3.00739 0.57501,1.00398 1.15458,2.00341 1.72959,3.00283 0.56132,0.9766 1.12264,1.95321 1.6794,2.92525 0.57501,1.00398 1.15002,2.0034 1.72503,3.00739 0.57501,1.00399 1.15458,2.00341 1.72959,3.00283 0.57501,1.00398 1.15002,2.00341 1.72503,3.00739 0.56132,0.97661 1.12264,1.94865 1.68396,2.92525 0.57501,1.00399 1.15002,2.00341 1.72503,3.00739 0.57501,1.00399 1.15002,2.00341 1.72959,3.00739 0.57501,1.00399 1.15458,2.00341 1.72959,3.0074 0.56132,0.9766 1.11808,1.95321 1.6794,2.92981 0.57501,1.00398 1.16371,1.99884 1.72959,3.00739 0.56132,0.99486 1.17284,1.95777 1.77979,3.19906 -17.92114,-7.63485 -35.63692,-15.20125 -53.35269,-22.75396 -17.74316,-7.57552 -35.49545,-15.15561 -53.2523,-22.72657 -0.0411,0.0411 -0.0821,0.0821 -0.12778,0.12321 0.20079,0.22362 0.39703,0.44723 0.60695,0.66628 19.24001,19.94737 38.48002,39.89473 57.7246,59.8421 3.82427,3.96118 7.64854,7.92692 11.46825,11.89266 0.17798,0.18254 0.42441,0.32858 0.48374,0.70279 -1.34625,-0.15972 -2.62405,-0.43354 -3.90642,-0.6389 -1.29149,-0.20536 -2.57385,-0.45179 -3.86534,-0.67084 -1.28693,-0.21906 -2.57842,-0.42898 -3.86991,-0.64803 -1.28693,-0.21905 -2.57842,-0.44267 -3.86534,-0.66628 -1.28693,-0.22362 -2.57386,-0.47005 -3.86535,-0.66628 -1.27323,-0.19624 -2.53734,-0.502 -3.86534,-0.52481 1.20935,1.02224 2.47802,1.93951 3.73756,2.87504 1.29606,0.95835 2.59211,1.9167 3.89273,2.87505 1.27324,0.9401 2.54647,1.88019 3.81514,2.82029 1.29606,0.95835 2.59667,1.91214 3.89273,2.87049 1.27323,0.94009 2.54647,1.88019 3.81514,2.82028 1.29149,0.95835 2.59211,1.90301 3.90642,2.89331 -0.13234,0.32857 -0.23731,0.60695 -0.36052,0.88076 -4.16198,9.23211 -8.32395,18.45965 -12.48593,27.68718 -1.38733,3.07585 -2.77465,6.1517 -4.15285,9.23211 -0.0913,0.20079 -0.24187,0.39703 -0.18254,0.74386 0.30576,-0.29207 0.55219,-0.52025 0.78493,-0.75299 5.28918,-5.24811 10.58292,-10.50078 15.8721,-15.75345 0.17341,-0.17341 0.34227,-0.34683 0.52025,-0.51111 0.10496,-0.0958 0.20536,-0.23731 0.37877,-0.13235 0.009,0.0274 0.0319,0.0548 0.0319,0.0821 -0.15973,8.63883 -0.31489,17.27311 -0.47461,25.91195 0,0.0228 0.0137,0.0593 0.0365,0.073 0.0228,0.0137 0.0593,0.0137 0.14147,0.0274 0.39247,-0.73017 0.70279,-1.51966 1.05875,-2.28634 0.34683,-0.74387 0.66628,-1.50142 1.01768,-2.24072 0.35596,-0.75755 0.62977,-1.55617 1.10438,-2.30916 0.3012,0.33314 0.31033,0.71648 0.4016,1.05875 1.51967,5.50822 3.03021,11.02102 4.53162,16.53381 0.11409,0.42441 0.28751,0.78493 0.57501,1.11807 1.30062,1.49229 2.58298,2.99371 3.87447,4.49512 0.11409,0.13234 0.251,0.24187 0.47918,0.46092 -0.0137,-0.27838 -0.0137,-0.41528 -0.0274,-0.55219 -0.0822,-0.75755 -0.18255,-1.51054 -0.24187,-2.2681 -0.4016,-5.0108 -0.0867,-9.9714 1.03593,-14.87267 2.78834,-12.1391 9.18646,-21.94164 19.1533,-29.39852 2.48258,-1.85737 5.03818,-3.62347 7.54815,-5.4489 m 22.03291,71.61154 c 14.25203,0.0319 25.9439,-11.51845 25.96215,-25.92108 0.0183,-14.32961 -11.56865,-25.95758 -25.90282,-25.98497 -14.44826,-0.0274 -26.02148,11.69643 -26.00779,25.97128 0.005,14.31136 11.62798,25.95302 25.94846,25.93477 z"
   class="st0" /><path
   inkscape:connector-curvature="0"
   style="fill:#ffffff;stroke-width:0.0456357"
   id="path11-9"
   d="m 218.72574,208.86355 c -2.50996,1.82086 -5.061,3.59153 -7.54815,5.4489 -9.9714,7.45687 -16.36952,17.25942 -19.1533,29.39852 -1.12264,4.89671 -1.44209,9.86187 -1.03593,14.87267 0.0593,0.75755 0.16429,1.51054 0.24187,2.2681 0.0137,0.1369 0.0137,0.27381 0.0274,0.55219 -0.22818,-0.21905 -0.36508,-0.32858 -0.47917,-0.46092 -1.29149,-1.49685 -2.57386,-3.00283 -3.87447,-4.49512 -0.28751,-0.33314 -0.46092,-0.69366 -0.57501,-1.11807 -1.50142,-5.5128 -3.01196,-11.02559 -4.53163,-16.53382 -0.0958,-0.3377 -0.1004,-0.72561 -0.40159,-1.05875 -0.47461,0.75299 -0.74843,1.55162 -1.10439,2.30917 -0.35139,0.74386 -0.67084,1.49685 -1.01767,2.24071 -0.35596,0.76668 -0.66172,1.55618 -1.05875,2.28635 -0.0822,-0.0137 -0.11865,-0.0137 -0.14147,-0.0274 -0.0183,-0.0137 -0.0365,-0.0456 -0.0365,-0.073 0.15972,-8.63884 0.31489,-17.27311 0.47461,-25.91195 0,-0.0274 -0.0182,-0.0548 -0.0319,-0.0821 -0.17798,-0.10496 -0.27838,0.0319 -0.37878,0.13234 -0.17798,0.16429 -0.34683,0.34227 -0.52025,0.51112 -5.28918,5.25267 -10.57835,10.50078 -15.87209,15.75345 -0.23275,0.23274 -0.47918,0.45635 -0.78494,0.75298 -0.0593,-0.34683 0.0913,-0.54306 0.18254,-0.74386 1.38277,-3.08041 2.76553,-6.15625 4.15285,-9.2321 4.16198,-9.22754 8.32395,-18.45964 12.48593,-27.68718 0.12322,-0.27381 0.22818,-0.55219 0.36052,-0.88077 -1.31431,-0.99029 -2.61492,-1.93495 -3.90641,-2.8933 -1.27324,-0.9401 -2.54191,-1.88019 -3.81515,-2.82029 -1.29605,-0.95835 -2.59667,-1.9167 -3.89272,-2.87048 -1.27324,-0.9401 -2.54647,-1.88019 -3.81515,-2.82029 -1.29605,-0.95835 -2.59667,-1.91214 -3.89272,-2.87505 -1.25955,-0.93097 -2.52822,-1.85281 -3.73757,-2.87505 1.33257,0.0183 2.59211,0.32858 3.86535,0.52481 1.29149,0.19624 2.57841,0.44267 3.86534,0.66628 1.28693,0.22362 2.57385,0.44723 3.86534,0.66629 1.28693,0.21905 2.57842,0.42897 3.86991,0.64802 1.28693,0.21905 2.57386,0.46549 3.86535,0.67085 1.28692,0.20536 2.56016,0.47917 3.90641,0.6389 -0.0593,-0.36965 -0.30576,-0.51569 -0.48374,-0.70279 -3.8197,-3.96575 -7.64398,-7.92692 -11.46825,-11.89267 -19.24001,-19.94736 -38.48458,-39.89473 -57.72459,-59.84209 -0.20993,-0.21449 -0.40616,-0.44267 -0.60696,-0.66628 0.0411,-0.0411 0.0821,-0.0821 0.12778,-0.12322 17.75229,7.57553 35.50458,15.15562 53.26143,22.72202 17.71577,7.55271 35.43155,15.11454 53.35269,22.75396 -0.60695,-1.24129 -1.21847,-2.20421 -1.77979,-3.19906 -0.56588,-1.00855 -1.15458,-2.00341 -1.72959,-3.0074 -0.56132,-0.9766 -1.11808,-1.95321 -1.6794,-2.92981 -0.57501,-1.00398 -1.15002,-2.00341 -1.72959,-3.00739 -0.57501,-1.00399 -1.15002,-2.00341 -1.72959,-3.00739 -0.57501,-1.00399 -1.15002,-2.00341 -1.72503,-3.0074 -0.56132,-0.9766 -1.12264,-1.94864 -1.68396,-2.92525 -0.57501,-1.00398 -1.15002,-2.0034 -1.72503,-3.00739 -0.57501,-1.00398 -1.15458,-2.00341 -1.72959,-3.00283 -0.57501,-1.00398 -1.15002,-2.0034 -1.72503,-3.00739 -0.56132,-0.9766 -1.12264,-1.95321 -1.67939,-2.92525 -0.57501,-1.00398 -1.15459,-2.00341 -1.7296,-3.00283 -0.57501,-1.00398 -1.15002,-2.0034 -1.72503,-3.00739 -0.57501,-1.00399 -1.15458,-2.00341 -1.72959,-3.00283 -0.56132,-0.9766 -1.12264,-1.94864 -1.67939,-2.92981 -0.56589,-0.99486 -1.15915,-1.97146 -1.6292,-3.02565 0.88077,0.49743 1.56074,1.20935 2.30917,1.84368 0.74386,0.62978 1.46947,1.2778 2.19964,1.92127 0.75755,0.66171 1.51054,1.31887 2.26809,1.98059 0.75756,0.66171 1.51054,1.32343 2.2681,1.98515 0.73473,0.6389 1.4649,1.28236 2.19964,1.92126 0.75755,0.66172 1.51054,1.31887 2.26809,1.98059 0.75755,0.66172 1.51054,1.32344 2.2681,1.98515 0.73473,0.6389 1.4649,1.28237 2.19964,1.92127 0.75755,0.66172 1.51054,1.32343 2.26809,1.98059 0.75755,0.65715 1.51511,1.31887 2.2681,1.98059 0.73473,0.6389 1.4649,1.28236 2.19964,1.92126 0.75755,0.66172 1.51054,1.31887 2.26809,1.98059 0.75755,0.66172 1.51054,1.32343 2.2681,1.98059 0.73473,0.6389 1.4649,1.28236 2.19964,1.92126 0.75755,0.66172 1.51054,1.32344 2.26809,1.98059 0.75755,0.66172 1.51054,1.32344 2.26809,1.98059 0.73474,0.6389 1.46491,1.28236 2.19965,1.92126 0.75755,0.66172 1.51054,1.32344 2.26809,1.98516 0.75755,0.66171 1.5151,1.31887 2.26809,1.98059 0.73474,0.6389 1.46491,1.28236 2.19964,1.92126 0.75756,0.66172 1.51055,1.31887 2.2681,1.98059 0.75755,0.66172 1.51054,1.32343 2.26809,1.98059 0.73474,0.6389 1.46491,1.28236 2.19964,1.92126 0.75756,0.66172 1.51055,1.32344 2.2681,1.98059 0.75755,0.66172 1.51054,1.31887 2.26809,1.98059 0.73474,0.6389 1.46491,1.28236 2.19964,1.92126 0.75756,0.66172 1.51054,1.32344 2.2681,1.98059 0.75755,0.66172 1.5151,1.31887 2.26809,1.98059 0.73474,0.6389 1.46491,1.28236 2.19964,1.92126 0.75756,0.66172 1.51511,1.31888 2.2681,1.98059 0.75755,0.66172 1.51054,1.32344 2.26809,1.98516 0.73474,0.6389 1.46491,1.28236 2.19964,1.92126 0.75755,0.66172 1.51054,1.32343 2.2681,1.98059 0.75755,0.66172 1.51054,1.31887 2.26809,1.98059 0.73474,0.6389 1.46491,1.28692 2.19964,1.92126 0.75299,0.65259 1.48772,1.328 2.33199,2.00797 0.31032,-0.92184 0.2875,-1.80261 0.42897,-2.65143 0.14147,-0.8397 0.22362,-1.68852 0.32858,-2.53278 0.10952,-0.87621 0.20992,-1.75242 0.31945,-2.62406 0.10496,-0.83969 0.22361,-1.68395 0.33314,-2.51909 0.3377,-0.0456 0.35139,0.23731 0.43354,0.4016 1.30062,2.47802 2.58754,4.9606 3.87903,7.44318 6.95032,13.34844 13.9052,26.70145 20.85552,40.04989 0.18254,0.34683 0.36965,0.6891 0.5887,1.09069 0.77124,-0.61152 1.40101,-1.26867 2.07186,-1.88019 0.69366,-0.6389 1.3782,-1.28692 2.0673,-1.93039 0.66628,-0.62064 1.33256,-1.24585 2.0034,-1.8665 0.66628,-0.62064 1.33257,-1.24585 2.00341,-1.87106 0.66628,-0.62521 1.33256,-1.24586 1.99884,-1.87107 0.6891,-0.64346 1.3782,-1.28692 2.0673,-1.93039 0.66172,-0.61608 1.328,-1.23216 2.02166,-1.87106 0.10953,0.48374 0.10953,0.48374 0.0548,0.71648 -0.37878,1.6292 -0.76212,3.25383 -1.13633,4.88302 -1.79349,7.75807 -3.58241,15.5207 -5.37589,23.27877 -0.62977,2.72445 -1.25498,5.4489 -1.88475,8.17792 -0.0319,0.14147 -0.0456,0.28294 -0.0822,0.49743 0.96748,-0.0456 1.83912,-0.3012 2.72445,-0.46549 0.89903,-0.16428 1.78892,-0.36052 2.68795,-0.51112 0.88989,-0.14603 1.7661,-0.42441 2.77465,-0.45179 -0.45636,0.75299 -1.05419,1.26411 -1.56531,1.85281 -0.49743,0.57501 -1.01767,1.1272 -1.52879,1.69308 -0.52938,0.58414 -1.06332,1.16828 -1.59269,1.75698 -0.50199,0.56132 -1.03593,1.09982 -1.60181,1.80717 0.31488,-0.0319 0.47917,-0.0274 0.63433,-0.0685 4.72786,-1.27324 9.45116,-2.54647 14.17445,-3.82427 0.9401,-0.25556 1.87563,-0.51569 2.81572,-0.76668 0.17342,-0.0456 0.3514,-0.0639 0.57501,-0.10496 -0.0365,0.32401 -0.26468,0.4381 -0.42441,0.58413 -4.31257,3.98856 -8.62514,7.97256 -12.93772,11.95199 -2.86136,2.64231 -5.72272,5.28462 -8.57951,7.92692 -0.24187,0.22362 -0.51568,0.41985 -0.68454,0.70279 0.15973,0.26925 0.39703,0.16886 0.59327,0.16886 2.52365,-0.0319 5.05187,-0.0776 7.57552,-0.11409 0.29664,-0.005 0.58871,0.0137 0.86252,0.0182 0.0821,0.20992 -0.0548,0.26925 -0.14603,0.32858 -0.60696,0.40616 -1.21848,0.80319 -1.83,1.20478 -6.86817,4.50424 -13.73634,9.00392 -20.60451,13.50817 -0.251,0.16429 -0.51112,0.31488 -0.80319,0.49743 -0.10953,-0.28751 0.073,-0.44267 0.16429,-0.60696 1.3143,-2.40956 2.43694,-4.90127 3.34509,-7.48882 1.36451,-3.89272 2.24071,-7.89041 2.61493,-12.00219 1.65201,-18.08086 -6.56242,-35.08929 -20.65928,-45.20216 -1.53336,-1.09982 -3.11236,-2.1038 -4.72786,-3.06672 -25.22742,-14.99589 -50.45483,-29.99178 -75.68225,-44.98767 -0.31032,-0.18254 -0.62521,-0.35596 -0.93553,-0.53394 -0.14603,0.26469 0.0776,0.36053 0.17342,0.48374 2.50083,3.10323 5.00623,6.20189 7.51163,9.30056 4.43579,5.48997 8.87615,10.97538 13.31194,16.46536 0.1871,0.22818 0.42897,0.42897 0.51112,0.81688 -1.58356,-0.0867 -3.11236,-0.26013 -4.64115,-0.39247 -1.54705,-0.13691 -3.08954,-0.28751 -4.63203,-0.42441 -1.53792,-0.13691 -3.08041,-0.26469 -4.62289,-0.39703 -0.0365,0.34227 0.22817,0.3879 0.38334,0.4883 2.0034,1.32343 4.0205,2.63774 6.02847,3.95205 6.00566,3.9338 12.01132,7.8676 18.01241,11.80139"
   class="st1" /><path
   style="fill:#ffffff;stroke:none;stroke-width:0.0456357;stroke-miterlimit:10"
   inkscape:connector-curvature="0"
   id="path13-2"
   d="m 240.75409,280.47965 c -14.32048,0.0183 -25.93933,-11.61885 -25.94846,-25.93477 -0.009,-14.27485 11.55953,-25.99866 26.00779,-25.97128 14.33417,0.0274 25.92108,11.65536 25.90282,25.98497 -0.0183,14.39807 -11.71468,25.94846 -25.96215,25.92108 z"
   class="st2" /></svg>