﻿# @eldiosx POWERED BY IGNISUS
#-------------------------------
[002] # Galicia
Land,15
    20,ALCOHOLICO,1,5
    20,ARCE,1,5
    20,XOKAS,1,5
    20,RAJOY,5
#-------------------------------
[053] # Alcantarillas
Cave,5
    50,NACIONAL,5
    25,ANTIDISTURBIO,5,9
    25,TIOSCABALLO,5,9
