com/finki/soa/controller/LoginController$LoginForm.class
com/finki/soa/controller/OfferController.class
com/finki/soa/repository/PersonRepository.class
com/finki/soa/model/Book.class
com/finki/soa/controller/AuctionController.class
com/finki/soa/repository/NotificationRepository.class
com/finki/soa/model/Person.class
com/finki/soa/controller/LoginController$RegisterForm.class
com/finki/soa/service/PersonService.class
com/finki/soa/repository/BookRepository.class
com/finki/soa/controller/LoginController.class
com/finki/soa/service/OfferService.class
com/finki/soa/model/Notification.class
com/finki/soa/model/Offer.class
com/finki/soa/service/BookService.class
com/finki/soa/controller/NotificationController.class
com/finki/soa/controller/NotificationController$NotificationModel.class
com/finki/soa/service/NotificationService.class
com/finki/soa/controller/OfferController$OfferModel.class
com/finki/soa/repository/OfferRepository.class
com/finki/soa/BookAuctionApplication.class
