module approve-credit-application

go 1.22

require (
	git.curve.tools/tech/schemas v1.313.0
	github.com/google/uuid v1.6.0
	github.com/joho/godotenv v1.5.1
	go.curve.tools/driver/v9 v9.1.2
	google.golang.org/protobuf v1.34.1
	gopkg.in/urfave/cli.v1 v1.20.0
)

require (
	github.com/DataDog/appsec-internal-go v1.6.0 // indirect
	github.com/DataDog/datadog-agent/pkg/obfuscate v0.54.0 // indirect
	github.com/DataDog/datadog-agent/pkg/remoteconfig/state v0.54.0 // indirect
	github.com/DataDog/datadog-go/v5 v5.5.0 // indirect
	github.com/DataDog/go-libddwaf/v2 v2.4.2 // indirect
	github.com/DataDog/go-sqllexer v0.0.12 // indirect
	github.com/DataDog/go-tuf v1.1.0-0.5.2 // indirect
	github.com/DataDog/gostackparse v0.7.0 // indirect
	github.com/DataDog/sketches-go v1.4.5 // indirect
	github.com/Microsoft/go-winio v0.6.2 // indirect
	github.com/beorn7/perks v1.0.1 // indirect
	github.com/bufbuild/protocompile v0.13.0 // indirect
	github.com/cespare/xxhash/v2 v2.3.0 // indirect
	github.com/dustin/go-humanize v1.0.1 // indirect
	github.com/ebitengine/purego v0.7.1 // indirect
	github.com/felixge/httpsnoop v1.0.4 // indirect
	github.com/gabriel-vasile/mimetype v1.4.4 // indirect
	github.com/go-logr/logr v1.4.2 // indirect
	github.com/go-logr/stdr v1.2.2 // indirect
	github.com/go-playground/locales v0.14.1 // indirect
	github.com/go-playground/universal-translator v0.18.1 // indirect
	github.com/go-playground/validator/v10 v10.21.0 // indirect
	github.com/golang/protobuf v1.5.4 // indirect
	github.com/google/pprof v0.0.0-20240528025155-186aa0362fba // indirect
	github.com/gorilla/mux v1.8.1 // indirect
	github.com/hashicorp/errwrap v1.1.0 // indirect
	github.com/hashicorp/go-multierror v1.1.1 // indirect
	github.com/jhump/protoreflect v1.16.0 // indirect
	github.com/kelseyhightower/envconfig v1.4.0 // indirect
	github.com/klauspost/compress v1.17.8 // indirect
	github.com/leodido/go-urn v1.4.0 // indirect
	github.com/outcaste-io/ristretto v0.2.3 // indirect
	github.com/pelletier/go-toml v1.9.5 // indirect
	github.com/philhofer/fwd v1.1.2 // indirect
	github.com/pierrec/lz4/v4 v4.1.21 // indirect
	github.com/pkg/errors v0.9.1 // indirect
	github.com/prometheus/client_golang v1.19.1 // indirect
	github.com/prometheus/client_model v0.6.1 // indirect
	github.com/prometheus/common v0.54.0 // indirect
	github.com/prometheus/procfs v0.15.1 // indirect
	github.com/richardartoul/molecule v1.0.1-0.20221107223329-32cfee06a052 // indirect
	github.com/rs/cors v1.11.0 // indirect
	github.com/secure-systems-lab/go-securesystemslib v0.8.0 // indirect
	github.com/segmentio/kafka-go v0.4.47 // indirect
	github.com/spaolacci/murmur3 v1.1.0 // indirect
	github.com/tinylib/msgp v1.1.9 // indirect
	go.curve.tools/app/v3 v3.0.0 // indirect
	go.curve.tools/go-curve/v3 v3.5.2 // indirect
	go.curve.tools/zapctx/v2 v2.1.1 // indirect
	go.opentelemetry.io/contrib v1.27.0 // indirect
	go.opentelemetry.io/contrib/instrumentation/net/http/otelhttp v0.52.0 // indirect
	go.opentelemetry.io/contrib/propagators v0.22.0 // indirect
	go.opentelemetry.io/otel v1.27.0 // indirect
	go.opentelemetry.io/otel/exporters/jaeger v1.17.0 // indirect
	go.opentelemetry.io/otel/metric v1.27.0 // indirect
	go.opentelemetry.io/otel/sdk v1.27.0 // indirect
	go.opentelemetry.io/otel/trace v1.27.0 // indirect
	go.uber.org/atomic v1.11.0 // indirect
	go.uber.org/automaxprocs v1.5.3 // indirect
	go.uber.org/multierr v1.11.0 // indirect
	go.uber.org/zap v1.27.0 // indirect
	golang.org/x/crypto v0.24.0 // indirect
	golang.org/x/net v0.26.0 // indirect
	golang.org/x/sys v0.21.0 // indirect
	golang.org/x/text v0.16.0 // indirect
	golang.org/x/time v0.5.0 // indirect
	golang.org/x/xerrors v0.0.0-20231012003039-104605ab7028 // indirect
	google.golang.org/genproto/googleapis/rpc v0.0.0-20240604185151-ef581f913117 // indirect
	google.golang.org/grpc v1.64.0 // indirect
	gopkg.in/DataDog/dd-trace-go.v1 v1.64.0 // indirect
	gopkg.in/yaml.v2 v2.4.0 // indirect
)
