{
    "image": "https://catagolue.hatsya.com/autogen/nfts/8.gif",
    "external_url": "https://catagolue.hatsya.com/nfts/8",
    "name": "Simkin's p60",
    "attributes": [
        {
            "display_type": "date",
            "trait_type": "discovery date",
            "value": 1430222400
        },
        {
            "trait_type": "object type",
            "value": "oscillator"
        },
        {
            "trait_type": "period",
            "value": 60
        },
        {
            "trait_type": "bounding area",
            "value": 1023
        }
    ],
    "background_color": "000000",
    "description": "A period-60 oscillator formed of two Herschels circulating in a loop. The first natural glider of each Herschel is suppressed using an eater5 to prevent it from crashing into the following Herschel.\n\nDiscovered by Michael Simkin on 2015-04-28.\n\nSee the [LifeWiki page](https://www.conwaylife.com/wiki/Simkin%27s_p60) and [Catagolue page](https://catagolue.hatsya.com/nfts/8) for further information."
}