$MeshFormat
4.1 0 8
$EndMeshFormat
$PhysicalNames
3
2 29 "base"
2 31 "top"
3 30 "vol"
$EndPhysicalNames
$Entities
8 12 6 1
1 0 0 0 0 
2 1 0 0 0 
3 1 3 0 0 
4 0 3 0 0 
5 0 0 0.1 0 
6 1 0 0.1 0 
10 1 3 0.1 0 
14 0 3 0.1 0 
1 0 0 0 1 0 0 0 2 1 -2 
2 1 0 0 1 3 0 0 2 2 -3 
3 0 3 0 1 3 0 0 2 3 -4 
4 0 0 0 0 3 0 0 2 4 -1 
8 0 0 0.1 1 0 0.1 0 2 5 -6 
9 1 0 0.1 1 3 0.1 0 2 6 -10 
10 0 3 0.1 1 3 0.1 0 2 10 -14 
11 0 0 0.1 0 3 0.1 0 2 14 -5 
13 0 0 0 0 0 0.1 0 2 1 -5 
14 1 0 0 1 0 0.1 0 2 2 -6 
18 1 3 0 1 3 0.1 0 2 3 -10 
22 0 3 0 0 3 0.1 0 2 4 -14 
6 0 0 0 1 3 0 0 4 1 2 3 4 
15 0 0 0 1 0 0.1 1 29 4 1 14 -8 -13 
19 1 0 0 1 3 0.1 0 4 2 18 -9 -14 
23 0 3 0 1 3 0.1 1 31 4 3 22 -10 -18 
27 0 0 0 0 3 0.1 0 4 4 13 -11 -22 
28 0 0 0.1 1 3 0.1 0 4 8 9 10 11 
1 0 0 0 1 3 0.1 1 30 6 -6 28 15 19 23 27 
$EndEntities
$Nodes
21 30 1 30
0 1 0 1
1
0 0 0
0 2 0 1
2
1 0 0
0 3 0 1
3
1 3 0
0 4 0 1
4
0 3 0
0 5 0 1
5
0 0 0.1
0 6 0 1
6
1 0 0.1
0 10 0 1
7
1 3 0.1
0 14 0 1
8
0 3 0.1
1 1 0 1
9
0.499999999998694 0 0
1 2 0 3
10
11
12
1 0.7499999999969159 0
1 1.499999999994285 0
1 2.249999999997118 0
1 3 0 1
13
0.5000000000020591 3 0
1 4 0 3
14
15
16
0 2.250000000002583 0
0 1.500000000004168 0
0 0.7500000000021076 0
1 8 0 1
17
0.499999999998694 0 0.1
1 9 0 3
18
19
20
1 0.7499999999969159 0.1
1 1.499999999994285 0.1
1 2.249999999997118 0.1
1 10 0 1
21
0.5000000000020591 3 0.1
1 11 0 3
22
23
24
0 2.250000000002583 0.1
0 1.500000000004168 0.1
0 0.7500000000021076 0.1
2 6 0 3
25
26
27
0.4999999999995353 0.7499999999995117 0
0.5000000000003766 1.499999999999226 0
0.5000000000012179 2.249999999999851 0
2 15 0 0
2 23 0 0
2 28 0 3
28
29
30
0.4999999999995353 0.7499999999995117 0.1
0.5000000000003766 1.499999999999226 0.1
0.5000000000012179 2.249999999999851 0.1
3 1 0 0
$EndNodes
$Elements
3 12 1 12
2 15 3 2
1 1 9 17 5 
2 9 2 6 17 
2 23 3 2
3 3 13 21 7 
4 13 4 8 21 
3 1 5 8
5 1 9 25 16 5 17 28 24 
6 16 25 26 15 24 28 29 23 
7 15 26 27 14 23 29 30 22 
8 14 27 13 4 22 30 21 8 
9 9 2 10 25 17 6 18 28 
10 25 10 11 26 28 18 19 29 
11 26 11 12 27 29 19 20 30 
12 27 12 3 13 30 20 7 21 
$EndElements
