<?xml version="1.0" encoding="UTF-8"?>
<svg width="500px" height="498px" viewBox="0 0 500 498" version="1.1" xmlns="http://www.w3.org/2000/svg" xmlns:xlink="http://www.w3.org/1999/xlink">
    <!-- Generator: Sketch 42 (36781) - http://www.bohemiancoding.com/sketch -->
    <title>pinterest</title>
    <desc>Created with Sketch.</desc>
    <defs></defs>
    <g id="Page-1" stroke="none" stroke-width="1" fill="none" fill-rule="evenodd">
        <g id="pinterest" fill-rule="nonzero" fill="#000000">
            <g id="Layer_1">
                <g id="Symbols_2_">
                    <g id="Footer_2_">
                        <g id="Shape_2_">
                            <path d="M250,0.531914894 C112.234043,0.531914894 0.531914894,112.234043 0.531914894,250 C0.531914894,355.851064 66.4893617,445.744681 159.042553,481.914894 C156.914894,462.234043 154.787234,431.914894 160.106383,410.638298 C164.893617,390.957447 189.361702,286.702128 189.361702,286.702128 C189.361702,286.702128 181.914894,271.808511 181.914894,249.468085 C181.914894,214.893617 202.12766,188.829787 227.12766,188.829787 C248.404255,188.829787 258.510638,204.787234 258.510638,223.93617 C258.510638,245.212766 244.680851,277.12766 237.765957,306.914894 C231.914894,331.914894 250,352.12766 274.468085,352.12766 C318.617021,352.12766 352.659574,305.319149 352.659574,237.765957 C352.659574,178.191489 309.574468,136.170213 248.404255,136.170213 C177.659574,136.170213 135.638298,189.361702 135.638298,244.148936 C135.638298,265.425532 144.148936,288.829787 154.255319,301.06383 C156.382979,303.723404 156.382979,305.851064 155.851064,307.978723 L148.93617,336.170213 C147.87234,340.957447 145.212766,341.489362 140.425532,339.361702 C109.042553,325 89.893617,279.255319 89.893617,242.553191 C89.893617,163.829787 146.808511,91.4893617 254.787234,91.4893617 C341.489362,91.4893617 408.510638,153.191489 408.510638,235.638298 C408.510638,321.808511 354.255319,390.957447 279.255319,390.957447 C253.723404,390.957447 230.319149,377.659574 222.340426,362.234043 L206.914894,421.276596 C201.06383,443.085106 186.170213,470.212766 176.06383,486.702128 C199.468085,494.148936 224.468085,497.87234 250,497.87234 C387.765957,497.87234 499.468085,386.170213 499.468085,248.404255 C499.468085,112.234043 387.765957,0.531914894 250,0.531914894 L250,0.531914894 Z" id="Shape"></path>
                        </g>
                    </g>
                </g>
            </g>
        </g>
    </g>
</svg>