 ,Label,Area,Mean,Perim.
1,blobs.tif,433,190.855,92.912
2,blobs.tif,185,179.286,55.213
3,blobs.tif,658,205.617,97.355
4,blobs.tif,434,217.327,78.527
5,blobs.tif,477,212.143,85.456
6,blobs.tif,285,204.295,62.184
7,blobs.tif,81,161.481,32.385
8,blobs.tif,278,174.849,63.941
9,blobs.tif,231,188.468,55.698
10,blobs.tif,30,147.200,30.485
11,blobs.tif,501,189.142,82.669
12,blobs.tif,660,171.697,98.326
13,blobs.tif,99,165.253,35.799
14,blobs.tif,228,195.895,55.698
15,blobs.tif,448,209.036,78.426
16,blobs.tif,401,179.571,87.497
17,blobs.tif,520,193.985,84.669
18,blobs.tif,425,195.953,77.841
19,blobs.tif,271,199.970,62.184
20,blobs.tif,350,190.491,68.770
21,blobs.tif,159,183.346,46.284
22,blobs.tif,412,186.350,75.598
23,blobs.tif,426,201.840,87.497
24,blobs.tif,260,179.385,59.941
25,blobs.tif,506,198.277,87.941
26,blobs.tif,289,187.875,62.770
27,blobs.tif,676,198.994,104.326
28,blobs.tif,175,195.749,53.213
29,blobs.tif,361,197.208,70.184
30,blobs.tif,545,198.385,86.912
31,blobs.tif,610,189.718,112.569
32,blobs.tif,641,192.624,106.569
33,blobs.tif,195,181.005,51.113
34,blobs.tif,593,210.604,89.255
35,blobs.tif,22,147.636,17.314
36,blobs.tif,268,189.045,59.941
37,blobs.tif,902,198.137,132.225
38,blobs.tif,473,205.564,87.255
39,blobs.tif,239,191.598,57.113
40,blobs.tif,167,183.856,48.042
41,blobs.tif,413,179.177,76.770
42,blobs.tif,415,199.634,77.598
43,blobs.tif,244,187.016,57.941
44,blobs.tif,377,195.247,72.527
45,blobs.tif,652,200.160,94.426
46,blobs.tif,379,208.042,72.184
47,blobs.tif,578,200.886,89.012
48,blobs.tif,69,185.739,38.971
49,blobs.tif,170,181.224,47.698
50,blobs.tif,472,167.169,89.255
51,blobs.tif,613,219.915,94.225
52,blobs.tif,543,189.068,86.669
53,blobs.tif,204,199.608,62.870
54,blobs.tif,555,217.139,87.255
55,blobs.tif,858,197.277,113.740
56,blobs.tif,281,189.779,62.770
57,blobs.tif,215,184.037,54.527
58,blobs.tif,81,183.407,42.385
59,blobs.tif,90,181.511,49.556
60,blobs.tif,53,188.377,35.556
61,blobs.tif,49,172.898,36.728
