label,area,perimeter,eccentricity,feret_diameter_max,centroid-0,centroid-1,equivalent_diameter_area,axis_minor_length,axis_major_length,filename
1,8131,334.8772003600252,0.2537269367086643,105.01904589168576,119.19923748616407,1201.932972574099,101.74827142630782,100.08121218667199,103.4670806238897,mdck_3_cp_masks.tif
2,6686,302.73506473629425,0.28977082035518476,96.56603957913983,199.2669757702662,171.06461262339215,92.26526755014206,90.27703406761354,94.32390087371579,mdck_3_cp_masks.tif
3,7260,316.14927829866735,0.2556477326854078,99.40321926376429,450.6633608815427,868.329476584022,96.14426189210296,94.53821341051328,97.78769843359649,mdck_3_cp_masks.tif
4,6992,313.22034611053283,0.5302289194880814,104.546640309481,469.441647597254,387.4525171624714,94.35301212355787,86.90433491845447,102.49911100857055,mdck_3_cp_masks.tif
5,9421,363.26197667087547,0.28401173259453216,114.28473213863697,900.770937267806,1118.3225772211017,109.5225536177365,107.29941582798166,111.90768419812788,mdck_3_cp_masks.tif
6,8037,332.04877323527904,0.22456001861967714,103.94229168149026,927.2692546970262,526.7820082120194,101.1584214044313,99.8736603004387,102.49126045966709,mdck_3_cp_masks.tif
