label,area,perimeter,eccentricity,feret_diameter_max,centroid-0,centroid-1,equivalent_diameter_area,axis_minor_length,axis_major_length,filename
1,2080,176.22539674441617,0.7704069235180552,64.76109943476871,17.1625,449.89326923076925,51.46200786064549,41.60516811385151,65.25763609768889,hct116_4_cp_masks.tif
2,7010,310.8772003600252,0.41036038401654273,101.11874208078342,135.94607703281028,471.70542082738945,94.47438387517269,90.26552879498965,98.98367024840353,hct116_4_cp_masks.tif
3,6252,292.8355697996826,0.20889671655972614,92.17917335276988,134.26679462571977,791.6991362763915,89.22047765891101,88.24047128189689,90.2311778246391,hct116_4_cp_masks.tif
4,5779,283.1787155501902,0.309975822001576,89.69392398596462,293.3661533137221,104.47741823844956,85.77908444967517,83.66786930708338,88.00248079952777,hct116_4_cp_masks.tif
5,5679,285.4213562373095,0.6839595017811305,100.43903623591775,414.108293713682,116.26201796090861,85.0336837644412,72.73274788030564,99.69945986792149,hct116_4_cp_masks.tif
6,5966,286.49242404917493,0.2548807649759555,90.4267659490264,595.581126382836,608.1163258464633,87.15587830944038,85.71374342358916,88.64134641405543,hct116_4_cp_masks.tif
7,6492,300.14927829866735,0.428440795515338,96.77293009927931,974.2087184226741,652.5072396796056,90.91683630890748,86.45780710991868,95.68469613311996,hct116_4_cp_masks.tif
