label,area,perimeter,eccentricity,feret_diameter_max,centroid-0,centroid-1,equivalent_diameter_area,axis_minor_length,axis_major_length,filename
1,12765,429.88939366884495,0.2972579066548676,132.43866504914644,86.51860556208382,220.95377986682334,127.48687300480921,124.59622159446664,130.4949559980922,mcf7_5_cp_masks.tif
2,8080,337.4629867976521,0.22110827415677137,108.63240768757728,188.25717821782177,1032.478589108911,101.4286720876307,100.3047918810222,102.85041513376797,mcf7_5_cp_masks.tif
3,12081,411.5462479183374,0.4968332806067404,135.5949851580065,424.7851999006705,1246.7087161658803,124.02421916684459,115.63382881699363,133.24233554012088,mcf7_5_cp_masks.tif
4,9339,360.5340546095176,0.49306345553406483,119.00420160649792,566.013705964236,90.46932219723739,109.04487199443028,101.782177785906,116.99190321534844,mcf7_5_cp_masks.tif
5,12009,409.1614716074871,0.1550765196416453,128.6001555209013,585.5978016487634,817.5545840619535,123.65408886375157,123.01323841952308,124.51961933247276,mcf7_5_cp_masks.tif
6,16213,475.2031021678297,0.4629277073948394,155.42522317822161,651.1398877444026,541.7783260346636,143.67683438463973,135.3726184762442,152.7224993566888,mcf7_5_cp_masks.tif
7,7185,315.7056274847714,0.4642782863630159,102.47438704378767,871.5621433542102,359.0727905358386,95.6463597264535,90.09835234005675,101.72680700889735,mcf7_5_cp_masks.tif
