label,area,perimeter,eccentricity,feret_diameter_max,centroid-0,centroid-1,equivalent_diameter_area,axis_minor_length,axis_major_length,filename
1,9040,355.84776310850236,0.24722482501865875,111.5437134042076,113.81404867256637,548.737168141593,107.28506645570887,105.8600838637541,109.25145163277557,mdck_2_cp_masks.tif
2,6337,297.8061325481598,0.5624603815635806,102.39140588936164,253.03739940034717,81.2101940981537,89.8249352629142,81.81476216600733,98.95060943793997,mdck_2_cp_masks.tif
3,6394,296.5929291125633,0.35870126405133046,94.89467845985885,408.30247106662495,173.7632155145449,90.22800922682839,87.18518082750471,93.40077739560778,mdck_2_cp_masks.tif
4,6127,290.0071426749364,0.32866987784151197,93.1074647920348,459.27517545291334,78.7421250204015,88.32405499405212,85.87434038101624,90.92573125258984,mdck_2_cp_masks.tif
5,6698,303.07821048680194,0.30486041339888087,95.90099061010788,587.4386383995222,229.28814571513885,92.34802905658637,90.13062301192555,94.63555523747243,mdck_2_cp_masks.tif
6,7107,312.3919189857867,0.1836475814985246,97.49358953285082,786.3151822147179,1200.3537357534824,95.12577697150653,94.33951729326647,95.971791178085,mdck_2_cp_masks.tif
7,7015,316.22034611053283,0.31648965752120783,102.55242561733974,849.4540270848182,770.7492516037064,94.50807058826864,92.17223527075446,97.16701218231901,mdck_2_cp_masks.tif
8,5247,272.9360748630709,0.43997396961697205,87.09190547921202,893.7907375643225,839.7192681532305,81.7354751085806,77.54728525526207,86.35453922845397,mdck_2_cp_masks.tif
