label,area,perimeter,eccentricity,feret_diameter_max,centroid-0,centroid-1,equivalent_diameter_area,axis_minor_length,axis_major_length,filename
1,6241,299.0782104868019,0.2522837389587087,93.81364506296512,142.92148694119533,654.961544624259,89.1419542005455,87.75808475582792,90.69166040360525,mdck_4_cp_masks.tif
2,5735,284.73506473629425,0.4765218496113282,92.35799911215054,164.4153443766347,732.0188317349607,85.4519092183209,80.25555508797726,91.28635876081542,mdck_4_cp_masks.tif
3,5593,281.0782104868019,0.30546727950222247,90.07774419910837,237.96728052923297,625.7811550151976,84.38737330728908,82.4208446825285,86.55809905206395,mdck_4_cp_masks.tif
4,5063,262.9360748630709,0.3078925925603044,83.43260753446461,292.89038119691884,683.087497531108,80.28954984924333,78.34048079542798,82.34048938098464,mdck_4_cp_masks.tif
5,6290,293.4213562373095,0.31725297718053824,94.02127418834527,404.79793322734497,522.6397456279809,89.4912103861836,87.18367321366362,91.9328366541307,mdck_4_cp_masks.tif
6,5829,287.32085117392114,0.21308954768260174,91.54780172128658,465.7304855035169,939.5575570423744,86.14936625571464,85.26665341477326,87.27103580681596,mdck_4_cp_masks.tif
7,5609,285.21424945612296,0.3727029734313721,91.92388155425118,500.653414155821,869.4548047780353,84.5079913760795,81.60891954954154,87.94531857166386,mdck_4_cp_masks.tif
8,8967,351.84776310850236,0.2506804668388813,110.81967334368028,636.7059217129474,292.5625069700011,106.85101308663481,105.14550275240288,108.61354568362574,mdck_4_cp_masks.tif
9,2876,201.23759005323595,0.5630393275908514,67.26812023536856,678.0034770514603,574.460709318498,60.513113708173435,55.044035543271825,66.60458679526447,mdck_4_cp_masks.tif
10,8099,335.1198410471445,0.3643529104995947,107.44766167767449,927.5820471663168,1198.8846771206322,101.547856071953,98.01910200116743,105.25417394865757,mdck_4_cp_masks.tif
