label,area,perimeter,eccentricity,feret_diameter_max,centroid-0,centroid-1,equivalent_diameter_area,axis_minor_length,axis_major_length,filename
1,16066,477.8305191657993,0.5562231445486632,157.15597347857954,139.43059878003237,89.65840906261671,143.02400681604163,130.47046338094003,156.99793697329193,mcf7_3_cp_masks.tif
2,10062,377.3624817342638,0.4050103976342214,120.10412149464314,144.8499304313258,1293.9209898628503,113.18717373945339,108.34580515621383,118.49980728082232,mcf7_3_cp_masks.tif
3,12839,425.2031021678297,0.3732680460921967,134.80726983364065,213.2615468494431,1204.0021808552067,127.85586617302609,123.2552940210748,132.8577844276514,mcf7_3_cp_masks.tif
4,12834,423.30360723121805,0.5227796973335067,139.18692467326088,261.4273024777934,284.35717625058436,127.83096775480924,118.07128819779923,138.5052727026338,mcf7_3_cp_masks.tif
5,14762,453.58787847867995,0.3445456190196123,145.67086187704115,280.30686898794204,140.17599241295218,137.09690791327304,132.88151392134742,141.54859440413856,mcf7_3_cp_masks.tif
6,11767,406.6467529817257,0.49823840356887716,132.7742444904131,385.1604487125011,1290.1198266338065,122.40183708955786,114.02516805936037,131.51083926723055,mcf7_3_cp_masks.tif
7,11031,394.4751801064719,0.5199198835581592,132.9812016790343,441.9927477109963,178.6788142507479,118.51204756468256,109.7740931790634,128.50873554572914,mcf7_3_cp_masks.tif
8,7599,328.49242404917493,0.33800935577677277,104.12012293500234,510.67640479010396,1034.2659560468483,98.36334327605229,95.64745332770991,101.62906036634365,mcf7_3_cp_masks.tif
9,8245,336.19090885900994,0.2179598695749186,107.28000745712129,544.7114614918132,814.3883565797453,102.45906522285578,101.29882240992535,103.7942720841022,mcf7_3_cp_masks.tif
10,11632,405.747258045114,0.2925999197845764,127.1416532848303,608.8040749656121,436.95813273727646,121.69766794955198,119.09973011435831,124.55069712344266,mcf7_3_cp_masks.tif
11,12724,424.5756851698602,0.2010875456381588,134.23859355639868,638.4295818924867,325.59525306507385,127.28197031477086,126.29615741389051,128.92977051912635,mcf7_3_cp_masks.tif
12,9585,363.3624817342638,0.4138804148843745,117.63077828527702,647.5784037558685,1176.8989045383412,110.4717205274116,105.41968447034985,115.80365208876356,mcf7_3_cp_masks.tif
13,12609,417.6467529817257,0.40250245123448275,135.2479205015737,680.5799825521453,715.1968435244667,126.70547509703623,121.27700793096702,132.48252455585842,mcf7_3_cp_masks.tif
14,8885,350.77669529663683,0.28822647194563844,111.40017953306898,690.7967360720315,1280.8495216657288,106.36133392813349,104.2214299340556,108.84036809150753,mcf7_3_cp_masks.tif
15,13258,428.47518010647184,0.31718742281849777,136.82105101189657,844.1178156584704,1221.4959269874792,129.92540122739197,126.65391180496734,133.5500528504279,mcf7_3_cp_masks.tif
