 ,Label,Area,Circ.,Feret,FeretX,FeretY,FeretAngle,MinFeret,AR,Round,Solidity
1,img4:0001 - ID 0001,5.203,0.950,2.728,184.000,379.148,118.939,2.530,1.015,0.985,0.956
2,img4:0001 - ID 0002,7.127,0.956,3.166,530.561,623.000,69.716,2.930,1.065,0.939,0.962
3,img4:0001 - ID 0003,5.905,0.927,3.109,555.562,258.000,62.177,2.530,1.218,0.821,0.952
4,img4:0001 - ID 0004,3.086,0.927,2.317,185.000,44.597,154.417,1.760,1.264,0.791,0.948
5,img4:0001 - ID 0005,5.699,0.940,2.860,356.000,402.178,178.941,2.659,1.026,0.974,0.943
6,img4:0001 - ID 0006,5.796,0.955,2.971,519.564,329.000,91.431,2.547,1.137,0.879,0.964
7,img4:0001 - ID 0007,3.207,0.953,2.189,589.209,253.000,33.564,1.969,1.095,0.913,0.953
8,img4:0001 - ID 0008,3.872,0.947,2.341,404.000,389.200,124.319,2.200,1.009,0.991,0.961
9,img4:0001 - ID 0009,6.691,0.941,3.127,219.131,175.000,29.508,2.895,1.059,0.945,0.947
10,img4:0001 - ID 0010,4.913,0.938,2.632,581.000,401.148,120.096,2.497,1.030,0.971,0.953
11,img4:0001 - ID 0011,7.175,0.949,3.256,409.104,348.000,39.938,2.970,1.080,0.926,0.963
12,img4:0001 - ID 0012,2.928,0.950,2.074,108.216,909.000,28.510,1.917,1.036,0.965,0.936
13,img4:0001 - ID 0013,4.489,0.940,2.719,278.000,658.133,106.450,2.090,1.243,0.804,0.959
14,img4:0001 - ID 0014,7.599,0.948,3.347,552.000,853.115,128.637,2.979,1.100,0.909,0.954
15,img4:0001 - ID 0015,3.037,0.944,2.146,590.105,52.000,24.212,1.870,1.087,0.920,0.949
16,img4:0001 - ID 0016,6.304,0.939,3.024,431.000,541.156,139.801,2.750,1.012,0.988,0.953
17,img4:0001 - ID 0017,4.671,0.947,2.586,181.200,746.000,33.564,2.380,1.059,0.944,0.961
18,img4:0001 - ID 0018,7.042,0.941,3.212,196.000,227.207,6.716,2.922,1.089,0.919,0.956
19,img4:0001 - ID 0019,7.042,0.949,3.212,596.131,286.000,35.609,2.935,1.064,0.940,0.955
20,img4:0001 - ID 0020,5.385,0.943,2.801,27.000,290.095,128.929,2.530,1.046,0.956,0.948
21,img4:0001 - ID 0021,3.098,0.942,2.101,609.255,149.000,35.165,1.980,1.035,0.966,0.952
22,img4:0001 - ID 0022,3.473,0.949,2.261,243.000,236.187,106.971,2.090,1.084,0.922,0.943
23,img4:0001 - ID 0023,3.848,0.946,2.350,521.163,508.000,34.174,2.090,1.076,0.930,0.954
24,img4:0001 - ID 0024,4.017,0.943,2.402,371.000,582.206,156.316,2.209,1.042,0.960,0.951
25,img4:0001 - ID 0025,8.652,0.948,3.565,312.045,342.000,80.852,3.190,1.093,0.915,0.961
26,img4:0001 - ID 0026,4.187,0.935,2.575,18.124,870.000,36.734,2.213,1.160,0.862,0.954
27,img4:0001 - ID 0027,5.808,0.934,3.040,528.000,281.104,127.958,2.551,1.173,0.852,0.964
28,img4:0001 - ID 0028,3.896,0.934,2.481,277.000,780.422,147.379,2.062,1.178,0.849,0.953
29,img4:0001 - ID 0029,3.424,0.945,2.236,640.151,330.000,29.466,2.076,1.032,0.969,0.950
30,img4:0001 - ID 0030,7.502,0.941,3.335,540.127,88.000,38.805,3.014,1.082,0.924,0.955
31,img4:0001 - ID 0031,6.026,0.938,3.001,338.000,261.169,137.153,2.707,1.085,0.921,0.950
32,img4:0001 - ID 0032,3.715,0.921,2.360,32.104,279.000,34.001,2.183,1.028,0.973,0.937
33,img4:0001 - ID 0033,5.917,0.934,2.887,481.123,895.000,61.187,2.750,1.020,0.981,0.949
34,img4:0001 - ID 0034,1.549,0.722,2.201,546.000,2.154,178.411,0.880,2.264,0.442,0.941
35,img4:0001 - ID 0035,4.392,0.947,2.557,530.000,707.349,144.818,2.296,1.060,0.944,0.955
36,img4:0001 - ID 0036,5.118,0.942,2.745,502.171,104.000,34.126,2.514,1.059,0.944,0.953
37,img4:0001 - ID 0037,2.880,0.916,2.248,373.120,112.000,39.512,1.774,1.246,0.802,0.941
38,img4:0001 - ID 0038,6.026,0.947,2.913,22.000,201.099,155.007,2.750,1.031,0.970,0.955
39,img4:0001 - ID 0039,6.643,0.953,3.098,639.172,243.000,39.720,2.860,1.050,0.953,0.959
40,img4:0001 - ID 0040,3.836,0.951,2.404,565.000,154.211,126.504,2.098,1.146,0.872,0.956
41,img4:0001 - ID 0041,2.795,0.780,2.646,470.000,1.335,176.236,1.320,1.845,0.542,0.949
42,img4:0001 - ID 0042,5.748,0.959,2.812,269.555,284.000,59.391,2.640,1.022,0.978,0.962
43,img4:0001 - ID 0043,6.365,0.947,3.029,244.000,282.189,111.293,2.814,1.061,0.942,0.949
44,img4:0001 - ID 0044,3.376,0.932,2.389,455.000,21.137,120.424,1.980,1.159,0.863,0.954
45,img4:0001 - ID 0045,2.384,0.795,2.365,669.000,520.044,111.845,1.320,1.681,0.595,0.963
46,img4:0001 - ID 0046,6.970,0.956,3.140,92.000,397.181,124.093,2.970,1.028,0.973,0.963
47,img4:0001 - ID 0047,5.554,0.954,2.795,197.000,484.212,169.723,2.636,1.035,0.966,0.953
48,img4:0001 - ID 0048,2.105,0.904,1.973,537.000,399.235,120.112,1.363,1.418,0.705,0.935
49,img4:0001 - ID 0049,6.449,0.942,3.028,574.000,127.475,155.275,2.804,1.047,0.955,0.955
50,img4:0001 - ID 0050,5.518,0.931,2.933,454.000,387.095,116.747,2.530,1.113,0.898,0.948
51,img4:0001 - ID 0051,4.271,0.875,3.022,382.000,59.561,161.147,1.907,1.618,0.618,0.940
52,img4:0001 - ID 0052,6.921,0.955,3.173,399.000,242.236,158.087,2.860,1.074,0.931,0.957
53,img4:0001 - ID 0053,3.207,0.895,2.373,397.500,129.000,60.873,1.817,1.324,0.755,0.930
54,img4:0001 - ID 0054,3.763,0.927,2.344,548.148,648.000,158.690,2.200,1.051,0.952,0.953
55,img4:0001 - ID 0055,5.106,0.952,2.745,442.171,167.000,34.125,2.522,1.086,0.921,0.959
56,img4:0001 - ID 0056,4.937,0.950,2.660,118.000,687.486,155.474,2.489,1.030,0.971,0.951
57,img4:0001 - ID 0057,5.554,0.949,2.787,112.172,876.000,39.160,2.640,1.038,0.963,0.951
58,img4:0001 - ID 0058,3.715,0.699,3.407,192.225,106.000,60.653,1.604,2.376,0.421,0.895
59,img4:0001 - ID 0059,4.816,0.940,2.649,8.000,237.195,146.141,2.420,1.042,0.960,0.946
60,img4:0001 - ID 0060,6.328,0.951,2.993,225.000,789.820,70.682,2.828,1.051,0.951,0.951
61,img4:0001 - ID 0061,5.796,0.906,3.253,23.000,915.117,129.982,2.382,1.382,0.724,0.950
62,img4:0001 - ID 0062,4.610,0.944,2.602,61.116,103.000,33.331,2.420,1.056,0.947,0.953
63,img4:0001 - ID 0063,7.139,0.880,3.532,293.527,48.000,85.221,2.909,1.181,0.847,0.938
64,img4:0001 - ID 0064,4.138,0.937,2.538,405.000,43.149,121.345,2.232,1.109,0.902,0.947
65,img4:0001 - ID 0065,3.763,0.944,2.371,405.243,199.000,43.023,2.143,1.083,0.923,0.958
66,img4:0001 - ID 0066,3.146,0.864,2.553,298.000,287.637,172.311,1.650,1.550,0.645,0.935
67,img4:0001 - ID 0067,4.852,0.944,2.659,267.000,188.149,125.397,2.405,1.045,0.957,0.950
68,img4:0001 - ID 0068,6.643,0.890,3.289,602.162,378.000,74.802,2.649,1.220,0.820,0.942
69,img4:0001 - ID 0069,5.167,0.950,2.730,497.115,738.000,37.190,2.530,1.054,0.949,0.946
70,img4:0001 - ID 0070,2.868,0.927,2.141,203.000,524.151,120.918,1.843,1.154,0.867,0.948
71,img4:0001 - ID 0071,4.150,0.947,2.442,540.000,753.158,111.121,2.273,1.057,0.946,0.948
72,img4:0001 - ID 0072,2.105,0.798,2.091,311.000,945.362,1.536,1.320,1.398,0.715,0.943
73,img4:0001 - ID 0073,4.864,0.941,2.706,607.323,330.000,54.391,2.413,1.107,0.903,0.946
74,img4:0001 - ID 0074,8.131,0.950,3.379,474.000,836.342,147.835,3.157,1.068,0.936,0.961
75,img4:0001 - ID 0075,5.929,0.944,2.932,238.380,433.000,68.844,2.603,1.099,0.910,0.955
76,img4:0001 - ID 0076,6.945,0.940,3.158,157.200,599.000,26.927,2.904,1.070,0.935,0.956
77,img4:0001 - ID 0077,5.421,0.946,2.752,525.000,438.461,2.030,2.611,1.023,0.977,0.953
78,img4:0001 - ID 0078,6.377,0.957,2.980,572.000,480.223,123.624,2.827,1.030,0.971,0.961
79,img4:0001 - ID 0079,8.289,0.950,3.435,191.403,684.000,83.135,3.080,1.088,0.919,0.958
80,img4:0001 - ID 0080,5.566,0.942,2.787,19.000,699.170,129.156,2.630,1.045,0.957,0.952
81,img4:0001 - ID 0081,7.115,0.945,3.207,654.144,303.000,84.112,2.923,1.064,0.940,0.949
82,img4:0001 - ID 0082,7.357,0.951,3.199,591.000,214.515,175.704,3.054,1.032,0.969,0.957
83,img4:0001 - ID 0083,7.030,0.909,3.652,159.627,438.000,83.721,2.530,1.440,0.694,0.958
84,img4:0001 - ID 0084,4.610,0.939,2.662,438.000,572.131,125.348,2.336,1.141,0.876,0.948
85,img4:0001 - ID 0085,5.820,0.954,2.901,25.000,111.003,161.447,2.686,1.031,0.970,0.961
86,img4:0001 - ID 0086,6.171,0.944,3.190,154.000,253.252,125.888,2.640,1.177,0.849,0.953
87,img4:0001 - ID 0087,5.251,0.947,2.731,494.130,800.000,28.899,2.530,1.035,0.966,0.956
88,img4:0001 - ID 0088,4.417,0.923,2.578,365.000,302.191,168.884,2.309,1.046,0.956,0.940
89,img4:0001 - ID 0089,4.610,0.896,2.821,663.409,574.000,59.074,2.200,1.182,0.846,0.961
90,img4:0001 - ID 0090,5.421,0.949,2.767,447.000,325.497,156.113,2.530,1.028,0.973,0.949
91,img4:0001 - ID 0091,4.598,0.957,2.567,143.268,572.000,80.284,2.310,1.072,0.933,0.957
92,img4:0001 - ID 0092,6.413,0.931,3.073,615.148,83.000,32.477,2.750,1.102,0.907,0.952
93,img4:0001 - ID 0093,5.735,0.948,2.947,64.217,294.000,17.376,2.593,1.136,0.880,0.950
94,img4:0001 - ID 0094,4.840,0.930,2.713,112.199,547.000,37.452,2.360,1.112,0.899,0.949
95,img4:0001 - ID 0095,3.279,0.925,2.316,391.000,663.132,131.673,1.924,1.191,0.840,0.938
96,img4:0001 - ID 0096,4.792,0.939,2.683,504.000,63.834,68.346,2.395,1.112,0.899,0.951
97,img4:0001 - ID 0097,6.098,0.951,2.934,69.000,865.150,121.664,2.750,1.041,0.961,0.959
98,img4:0001 - ID 0098,6.461,0.951,3.051,268.174,751.000,35.235,2.860,1.027,0.973,0.957
99,img4:0001 - ID 0099,4.090,0.937,2.474,254.000,918.443,152.787,2.200,1.110,0.901,0.951
100,img4:0001 - ID 0100,5.348,0.952,2.755,624.115,431.000,33.983,2.530,1.029,0.972,0.954
101,img4:0001 - ID 0101,5.614,0.942,2.901,610.268,117.000,43.045,2.623,1.076,0.929,0.953
102,img4:0001 - ID 0102,3.122,0.877,2.378,620.000,362.376,166.296,1.852,1.296,0.772,0.926
103,img4:0001 - ID 0103,5.711,0.945,2.899,364.122,544.000,19.965,2.530,1.103,0.907,0.953
104,img4:0001 - ID 0104,3.231,0.876,2.570,433.000,684.364,148.880,1.802,1.448,0.691,0.942
105,img4:0001 - ID 0105,3.073,0.949,2.213,189.538,435.000,61.941,1.870,1.116,0.896,0.948
106,img4:0001 - ID 0106,6.050,0.949,3.016,514.211,906.000,30.703,2.750,1.083,0.924,0.953
107,img4:0001 - ID 0107,4.973,0.916,2.996,155.252,12.000,150.676,2.175,1.385,0.722,0.943
108,img4:0001 - ID 0108,6.111,0.953,2.959,593.181,630.000,36.498,2.750,1.030,0.971,0.965
109,img4:0001 - ID 0109,3.618,0.943,2.278,578.411,600.000,65.493,2.090,1.057,0.946,0.945
110,img4:0001 - ID 0110,4.755,0.965,2.641,192.231,144.000,35.668,2.374,1.087,0.920,0.956
111,img4:0001 - ID 0111,2.420,0.816,2.276,2.128,374.000,73.516,1.540,1.410,0.709,0.932
112,img4:0001 - ID 0112,6.002,0.941,3.006,526.164,808.000,160.996,2.691,1.103,0.907,0.951
113,img4:0001 - ID 0113,5.566,0.945,2.886,270.104,310.000,29.702,2.530,1.062,0.941,0.960
114,img4:0001 - ID 0114,6.909,0.941,3.258,229.106,653.000,65.733,2.754,1.155,0.866,0.964
115,img4:0001 - ID 0115,6.365,0.950,3.041,590.000,163.291,146.306,2.841,1.027,0.974,0.956
116,img4:0001 - ID 0116,5.578,0.949,2.819,624.176,188.000,27.916,2.640,1.028,0.973,0.959
117,img4:0001 - ID 0117,3.630,0.938,2.325,38.053,752.000,61.926,2.090,1.083,0.923,0.949
118,img4:0001 - ID 0118,4.175,0.943,2.505,211.150,944.000,34.803,2.200,1.127,0.887,0.949
119,img4:0001 - ID 0119,3.860,0.949,2.411,395.171,299.000,36.379,2.146,1.105,0.905,0.945
120,img4:0001 - ID 0120,5.675,0.953,2.842,627.000,647.242,144.358,2.530,1.083,0.923,0.963
121,img4:0001 - ID 0135,5.808,0.952,2.860,438.187,866.000,89.600,2.717,1.014,0.986,0.949
122,img4:0001 - ID 0136,4.211,0.931,2.503,477.000,385.229,157.343,2.280,1.085,0.922,0.943
123,img4:0001 - ID 0137,6.365,0.948,3.112,243.000,361.086,129.511,2.750,1.066,0.938,0.964
124,img4:0001 - ID 0140,5.675,0.955,2.893,463.000,912.198,124.771,2.626,1.084,0.922,0.961
125,img4:0001 - ID 0141,7.647,0.944,3.265,273.198,248.000,37.327,3.137,1.020,0.980,0.952
126,img4:0001 - ID 0143,5.929,0.944,3.031,219.000,355.131,120.531,2.629,1.124,0.889,0.955
127,img4:0001 - ID 0144,6.764,0.949,3.160,272.134,346.000,44.131,2.852,1.080,0.926,0.952
128,img4:0001 - ID 0146,8.047,0.934,3.604,30.230,379.000,77.637,2.945,1.229,0.814,0.960
129,img4:0001 - ID 0148,1.440,0.690,2.203,1.477,927.000,86.897,0.880,2.541,0.394,0.941
130,img4:0001 - ID 0152,6.607,0.944,3.098,297.076,389.000,67.401,2.860,1.053,0.949,0.952
131,img4:0001 - ID 0154,3.461,0.854,2.533,143.000,945.147,18.081,1.650,1.403,0.713,0.961
132,img4:0001 - ID 0155,7.599,0.947,3.430,98.843,315.000,96.202,2.860,1.161,0.862,0.957
133,img4:0001 - ID 0156,2.747,0.932,2.127,279.693,698.000,100.638,1.746,1.213,0.824,0.948
134,img4:0001 - ID 0157,3.461,0.939,2.274,407.000,372.152,148.342,2.073,1.089,0.919,0.949
