{
  "project_info": {
    "project_number": "145579376975",
    "firebase_url": "https://whatsapp-6e578.firebaseio.com",
    "project_id": "whatsapp-6e578",
    "storage_bucket": "whatsapp-6e578.appspot.com"
  },
  "client": [
    {
      "client_info": {
        "mobilesdk_app_id": "1:145579376975:android:fe802eef8548fd7f79053a",
        "android_client_info": {
          "package_name": "com.example.whatsapp"
        }
      },
      "oauth_client": [
        {
          "client_id": "145579376975-3ue44c69qg3b2kgftn0jte7gaunl52bd.apps.googleusercontent.com",
          "client_type": 3
        }
      ],
      "api_key": [
        {
          "current_key": "AIzaSyBDdtYwfWcrrSyDfA3Ue8G55pvxjkbAFN8"
        }
      ],
      "services": {
        "appinvite_service": {
          "other_platform_oauth_client": [
            {
              "client_id": "145579376975-3ue44c69qg3b2kgftn0jte7gaunl52bd.apps.googleusercontent.com",
              "client_type": 3
            }
          ]
        }
      }
    }
  ],
  "configuration_version": "1"
}