{
    "machine_info": {
        "node": "runner--azerasq-project-39604133-concurrent-0",
        "processor": "",
        "machine": "x86_64",
        "python_compiler": "GCC 12.2.0",
        "python_implementation": "CPython",
        "python_implementation_version": "3.12.1",
        "python_version": "3.12.1",
        "python_build": [
            "main",
            "Jan 17 2024 06:18:08"
        ],
        "release": "5.4.109+",
        "system": "Linux",
        "cpu": {
            "python_version": "3.12.1.final.0 (64 bit)",
            "cpuinfo_version": [
                9,
                0,
                0
            ],
            "cpuinfo_version_string": "9.0.0",
            "arch": "X86_64",
            "bits": 64,
            "count": 2,
            "arch_string_raw": "x86_64",
            "vendor_id_raw": "AuthenticAMD",
            "brand_raw": "AMD EPYC 7B12",
            "hz_advertised_friendly": "2.2500 GHz",
            "hz_actual_friendly": "2.2500 GHz",
            "hz_advertised": [
                2249998000,
                0
            ],
            "hz_actual": [
                2249998000,
                0
            ],
            "model": 49,
            "family": 23,
            "flags": [
                "3dnowext",
                "3dnowprefetch",
                "abm",
                "adx",
                "aes",
                "apic",
                "arat",
                "avx",
                "avx2",
                "bmi1",
                "bmi2",
                "clflush",
                "clflushopt",
                "clwb",
                "clzero",
                "cmov",
                "cmp_legacy",
                "constant_tsc",
                "cpuid",
                "cr8_legacy",
                "cx16",
                "cx8",
                "de",
                "extd_apicid",
                "f16c",
                "fma",
                "fpu",
                "fsgsbase",
                "fxsr",
                "fxsr_opt",
                "ht",
                "hypervisor",
                "ibpb",
                "ibrs",
                "lahf_lm",
                "lm",
                "mca",
                "mce",
                "misalignsse",
                "mmx",
                "mmxext",
                "movbe",
                "msr",
                "mtrr",
                "nonstop_tsc",
                "nopl",
                "npt",
                "nrip_save",
                "nx",
                "osvw",
                "osxsave",
                "pae",
                "pat",
                "pclmulqdq",
                "pdpe1gb",
                "pge",
                "pni",
                "popcnt",
                "pse",
                "pse36",
                "rdpid",
                "rdrand",
                "rdrnd",
                "rdseed",
                "rdtscp",
                "rep_good",
                "sep",
                "sha",
                "sha_ni",
                "smap",
                "smep",
                "ssbd",
                "sse",
                "sse2",
                "sse4_1",
                "sse4_2",
                "sse4a",
                "ssse3",
                "stibp",
                "syscall",
                "topoext",
                "tsc",
                "tsc_adjust",
                "tsc_known_freq",
                "umip",
                "vme",
                "vmmcall",
                "x2apic",
                "xgetbv1",
                "xsave",
                "xsavec",
                "xsaveerptr",
                "xsaveopt"
            ],
            "l3_cache_size": 524288,
            "l2_cache_size": 524288,
            "l1_data_cache_size": 32768,
            "l1_instruction_cache_size": 32768,
            "l2_cache_line_size": 512,
            "l2_cache_associativity": 6
        }
    },
    "commit_info": {
        "id": "c87952dda63a312aae072952a03797329a9eff13",
        "time": "2024-01-18T11:44:16+01:00",
        "author_time": "2024-01-18T11:44:16+01:00",
        "dirty": false,
        "project": "finesse3",
        "branch": "(detached head)"
    },
    "benchmarks": [
        {
            "group": null,
            "name": "test_01_simple_cav",
            "fullname": "tests/benchmarks/test_benchmarks.py::test_01_simple_cav",
            "params": null,
            "param": null,
            "extra_info": {},
            "options": {
                "disable_gc": false,
                "timer": "perf_counter",
                "min_rounds": 5,
                "max_time": 1.0,
                "min_time": 5e-06,
                "warmup": false
            },
            "stats": {
                "min": 0.3575061630000107,
                "max": 0.5557153339999985,
                "mean": 0.4291376722000024,
                "stddev": 0.09408515166309467,
                "rounds": 5,
                "median": 0.3641192359999934,
                "iqr": 0.1554960672499881,
                "q1": 0.3620350140000106,
                "q3": 0.5175310812499987,
                "iqr_outliers": 0,
                "stddev_outliers": 1,
                "outliers": "1;0",
                "ld15iqr": 0.3575061630000107,
                "hd15iqr": 0.5557153339999985,
                "ops": 2.330254519192954,
                "total": 2.145688361000012,
                "iterations": 1
            }
        },
        {
            "group": null,
            "name": "test_02_pdh_lock",
            "fullname": "tests/benchmarks/test_benchmarks.py::test_02_pdh_lock",
            "params": null,
            "param": null,
            "extra_info": {},
            "options": {
                "disable_gc": false,
                "timer": "perf_counter",
                "min_rounds": 5,
                "max_time": 1.0,
                "min_time": 5e-06,
                "warmup": false
            },
            "stats": {
                "min": 1.3006289810000027,
                "max": 1.5885164880000104,
                "mean": 1.412334942000001,
                "stddev": 0.14127700353139877,
                "rounds": 5,
                "median": 1.3151467699999984,
                "iqr": 0.24410630649999732,
                "q1": 1.3106084570000007,
                "q3": 1.554714763499998,
                "iqr_outliers": 0,
                "stddev_outliers": 1,
                "outliers": "1;0",
                "ld15iqr": 1.3006289810000027,
                "hd15iqr": 1.5885164880000104,
                "ops": 0.7080473407985676,
                "total": 7.0616747100000055,
                "iterations": 1
            }
        },
        {
            "group": null,
            "name": "test_03_near_unstable",
            "fullname": "tests/benchmarks/test_benchmarks.py::test_03_near_unstable",
            "params": null,
            "param": null,
            "extra_info": {},
            "options": {
                "disable_gc": false,
                "timer": "perf_counter",
                "min_rounds": 5,
                "max_time": 1.0,
                "min_time": 5e-06,
                "warmup": false
            },
            "stats": {
                "min": 1.7490000061570754e-06,
                "max": 3.779000000747601e-05,
                "mean": 2.6198946660665573e-06,
                "stddev": 1.0546499481974944e-06,
                "rounds": 50582,
                "median": 3.1300000102874037e-06,
                "iqr": 1.3610000024755209e-06,
                "q1": 1.8300000022009044e-06,
                "q3": 3.1910000046764253e-06,
                "iqr_outliers": 317,
                "stddev_outliers": 427,
                "outliers": "427;317",
                "ld15iqr": 1.7490000061570754e-06,
                "hd15iqr": 5.368999993038415e-06,
                "ops": 381694.73488847335,
                "total": 0.1325195119989786,
                "iterations": 1
            }
        },
        {
            "group": null,
            "name": "test_04_geometrical_params",
            "fullname": "tests/benchmarks/test_benchmarks.py::test_04_geometrical_params",
            "params": null,
            "param": null,
            "extra_info": {},
            "options": {
                "disable_gc": false,
                "timer": "perf_counter",
                "min_rounds": 5,
                "max_time": 1.0,
                "min_time": 5e-06,
                "warmup": false
            },
            "stats": {
                "min": 0.49396865299999604,
                "max": 0.8010275769999993,
                "mean": 0.560615441600001,
                "stddev": 0.13448944399594234,
                "rounds": 5,
                "median": 0.5033687580000077,
                "iqr": 0.08382992899998953,
                "q1": 0.49672664675000533,
                "q3": 0.5805565757499949,
                "iqr_outliers": 1,
                "stddev_outliers": 1,
                "outliers": "1;1",
                "ld15iqr": 0.49396865299999604,
                "hd15iqr": 0.8010275769999993,
                "ops": 1.7837539350432303,
                "total": 2.803077208000005,
                "iterations": 1
            }
        },
        {
            "group": null,
            "name": "test_05_modulation",
            "fullname": "tests/benchmarks/test_benchmarks.py::test_05_modulation",
            "params": null,
            "param": null,
            "extra_info": {},
            "options": {
                "disable_gc": false,
                "timer": "perf_counter",
                "min_rounds": 5,
                "max_time": 1.0,
                "min_time": 5e-06,
                "warmup": false
            },
            "stats": {
                "min": 0.17270649900001445,
                "max": 0.1809072909999827,
                "mean": 0.17477991399999268,
                "stddev": 0.0034809021195753025,
                "rounds": 5,
                "median": 0.17317342499998745,
                "iqr": 0.0031355237499894884,
                "q1": 0.17280109499999696,
                "q3": 0.17593661874998645,
                "iqr_outliers": 1,
                "stddev_outliers": 1,
                "outliers": "1;1",
                "ld15iqr": 0.17270649900001445,
                "hd15iqr": 0.1809072909999827,
                "ops": 5.72148124526507,
                "total": 0.8738995699999634,
                "iterations": 1
            }
        },
        {
            "group": null,
            "name": "test_06_radiation_pressure",
            "fullname": "tests/benchmarks/test_benchmarks.py::test_06_radiation_pressure",
            "params": null,
            "param": null,
            "extra_info": {},
            "options": {
                "disable_gc": false,
                "timer": "perf_counter",
                "min_rounds": 5,
                "max_time": 1.0,
                "min_time": 5e-06,
                "warmup": false
            },
            "stats": {
                "min": 0.23184761699999967,
                "max": 0.23620328600000562,
                "mean": 0.2346106116000044,
                "stddev": 0.0016596194573488608,
                "rounds": 5,
                "median": 0.23510050400000182,
                "iqr": 0.001738531999983195,
                "q1": 0.23385021600001465,
                "q3": 0.23558874799999785,
                "iqr_outliers": 0,
                "stddev_outliers": 1,
                "outliers": "1;0",
                "ld15iqr": 0.23184761699999967,
                "hd15iqr": 0.23620328600000562,
                "ops": 4.262381795862388,
                "total": 1.173053058000022,
                "iterations": 1
            }
        },
        {
            "group": null,
            "name": "test_07_homodyne",
            "fullname": "tests/benchmarks/test_benchmarks.py::test_07_homodyne",
            "params": null,
            "param": null,
            "extra_info": {},
            "options": {
                "disable_gc": false,
                "timer": "perf_counter",
                "min_rounds": 5,
                "max_time": 1.0,
                "min_time": 5e-06,
                "warmup": false
            },
            "stats": {
                "min": 0.11090781800001537,
                "max": 0.5531150510000202,
                "mean": 0.1595913665000012,
                "stddev": 0.13832972423636822,
                "rounds": 10,
                "median": 0.1153785520000099,
                "iqr": 0.006396244999990586,
                "q1": 0.11331312199999388,
                "q3": 0.11970936699998447,
                "iqr_outliers": 1,
                "stddev_outliers": 1,
                "outliers": "1;1",
                "ld15iqr": 0.11090781800001537,
                "hd15iqr": 0.5531150510000202,
                "ops": 6.266003117405431,
                "total": 1.5959136650000119,
                "iterations": 1
            }
        },
        {
            "group": null,
            "name": "test_08_optical_spring",
            "fullname": "tests/benchmarks/test_benchmarks.py::test_08_optical_spring",
            "params": null,
            "param": null,
            "extra_info": {},
            "options": {
                "disable_gc": false,
                "timer": "perf_counter",
                "min_rounds": 5,
                "max_time": 1.0,
                "min_time": 5e-06,
                "warmup": false
            },
            "stats": {
                "min": 0.2922711370000002,
                "max": 0.30003871200000276,
                "mean": 0.29461557439999525,
                "stddev": 0.0031351844058827997,
                "rounds": 5,
                "median": 0.29320782099998155,
                "iqr": 0.003019868749994714,
                "q1": 0.2928638724999999,
                "q3": 0.2958837412499946,
                "iqr_outliers": 0,
                "stddev_outliers": 1,
                "outliers": "1;0",
                "ld15iqr": 0.2922711370000002,
                "hd15iqr": 0.30003871200000276,
                "ops": 3.394253688171674,
                "total": 1.4730778719999762,
                "iterations": 1
            }
        },
        {
            "group": null,
            "name": "test_09_aligo_sensitivity",
            "fullname": "tests/benchmarks/test_benchmarks.py::test_09_aligo_sensitivity",
            "params": null,
            "param": null,
            "extra_info": {},
            "options": {
                "disable_gc": false,
                "timer": "perf_counter",
                "min_rounds": 5,
                "max_time": 1.0,
                "min_time": 5e-06,
                "warmup": false
            },
            "stats": {
                "min": 0.31716176300000143,
                "max": 0.8509199800000147,
                "mean": 0.42876784260000705,
                "stddev": 0.23603412325429218,
                "rounds": 5,
                "median": 0.3258792420000134,
                "iqr": 0.13955206325001512,
                "q1": 0.3199385217499966,
                "q3": 0.4594905850000117,
                "iqr_outliers": 1,
                "stddev_outliers": 1,
                "outliers": "1;1",
                "ld15iqr": 0.31716176300000143,
                "hd15iqr": 0.8509199800000147,
                "ops": 2.3322644579315837,
                "total": 2.143839213000035,
                "iterations": 1
            }
        },
        {
            "group": null,
            "name": "test_10_shifted_beam",
            "fullname": "tests/benchmarks/test_benchmarks.py::test_10_shifted_beam",
            "params": null,
            "param": null,
            "extra_info": {},
            "options": {
                "disable_gc": false,
                "timer": "perf_counter",
                "min_rounds": 5,
                "max_time": 1.0,
                "min_time": 5e-06,
                "warmup": false
            },
            "stats": {
                "min": 0.7104052200000126,
                "max": 0.720644319999991,
                "mean": 0.7161540957999989,
                "stddev": 0.004202897927619169,
                "rounds": 5,
                "median": 0.7152592779999907,
                "iqr": 0.006574384749995943,
                "q1": 0.7135171230000026,
                "q3": 0.7200915077499985,
                "iqr_outliers": 0,
                "stddev_outliers": 2,
                "outliers": "2;0",
                "ld15iqr": 0.7104052200000126,
                "hd15iqr": 0.720644319999991,
                "ops": 1.3963475261325198,
                "total": 3.5807704789999946,
                "iterations": 1
            }
        },
        {
            "group": null,
            "name": "test_angular_radiation_pressure",
            "fullname": "tests/benchmarks/test_benchmarks.py::test_angular_radiation_pressure",
            "params": null,
            "param": null,
            "extra_info": {},
            "options": {
                "disable_gc": false,
                "timer": "perf_counter",
                "min_rounds": 5,
                "max_time": 1.0,
                "min_time": 5e-06,
                "warmup": false
            },
            "stats": {
                "min": 0.33233905700001287,
                "max": 0.33487653500000647,
                "mean": 0.33385167199999727,
                "stddev": 0.0010236779287273806,
                "rounds": 5,
                "median": 0.33373636499999293,
                "iqr": 0.0014948662499918441,
                "q1": 0.3332694169999968,
                "q3": 0.33476428324998864,
                "iqr_outliers": 0,
                "stddev_outliers": 2,
                "outliers": "2;0",
                "ld15iqr": 0.33233905700001287,
                "hd15iqr": 0.33487653500000647,
                "ops": 2.9953421949613843,
                "total": 1.6692583599999864,
                "iterations": 1
            }
        },
        {
            "group": null,
            "name": "test_cavity_eigenmodes",
            "fullname": "tests/benchmarks/test_benchmarks.py::test_cavity_eigenmodes",
            "params": null,
            "param": null,
            "extra_info": {},
            "options": {
                "disable_gc": false,
                "timer": "perf_counter",
                "min_rounds": 5,
                "max_time": 1.0,
                "min_time": 5e-06,
                "warmup": false
            },
            "stats": {
                "min": 0.2640877899999907,
                "max": 1.0641270389999988,
                "mean": 0.4275522287999934,
                "stddev": 0.3558676884832668,
                "rounds": 5,
                "median": 0.2708839990000058,
                "iqr": 0.20269023574999068,
                "q1": 0.26668010424999267,
                "q3": 0.46937033999998334,
                "iqr_outliers": 1,
                "stddev_outliers": 1,
                "outliers": "1;1",
                "ld15iqr": 0.2640877899999907,
                "hd15iqr": 1.0641270389999988,
                "ops": 2.338895537526936,
                "total": 2.137761143999967,
                "iterations": 1
            }
        },
        {
            "group": null,
            "name": "test_coupled_cavity_commands",
            "fullname": "tests/benchmarks/test_benchmarks.py::test_coupled_cavity_commands",
            "params": null,
            "param": null,
            "extra_info": {},
            "options": {
                "disable_gc": false,
                "timer": "perf_counter",
                "min_rounds": 5,
                "max_time": 1.0,
                "min_time": 5e-06,
                "warmup": false
            },
            "stats": {
                "min": 4.2041049279999925,
                "max": 5.177910933999982,
                "mean": 4.5989718529999895,
                "stddev": 0.5051431792513831,
                "rounds": 5,
                "median": 4.282281458,
                "iqr": 0.9312481792500051,
                "q1": 4.206088622499983,
                "q3": 5.1373368017499885,
                "iqr_outliers": 0,
                "stddev_outliers": 2,
                "outliers": "2;0",
                "ld15iqr": 4.2041049279999925,
                "hd15iqr": 5.177910933999982,
                "ops": 0.21743990438812594,
                "total": 22.994859264999945,
                "iterations": 1
            }
        },
        {
            "group": null,
            "name": "test_frequency_dependant_squeezing",
            "fullname": "tests/benchmarks/test_benchmarks.py::test_frequency_dependant_squeezing",
            "params": null,
            "param": null,
            "extra_info": {},
            "options": {
                "disable_gc": false,
                "timer": "perf_counter",
                "min_rounds": 5,
                "max_time": 1.0,
                "min_time": 5e-06,
                "warmup": false
            },
            "stats": {
                "min": 1.48735059400002,
                "max": 2.683654746000002,
                "mean": 1.7377620842000112,
                "stddev": 0.5290242939956669,
                "rounds": 5,
                "median": 1.5028005580000183,
                "iqr": 0.32911130075000017,
                "q1": 1.4874467132500087,
                "q3": 1.8165580140000088,
                "iqr_outliers": 1,
                "stddev_outliers": 1,
                "outliers": "1;1",
                "ld15iqr": 1.48735059400002,
                "hd15iqr": 2.683654746000002,
                "ops": 0.575452767149282,
                "total": 8.688810421000056,
                "iterations": 1
            }
        },
        {
            "group": null,
            "name": "test_lock_actions",
            "fullname": "tests/benchmarks/test_benchmarks.py::test_lock_actions",
            "params": null,
            "param": null,
            "extra_info": {},
            "options": {
                "disable_gc": false,
                "timer": "perf_counter",
                "min_rounds": 5,
                "max_time": 1.0,
                "min_time": 5e-06,
                "warmup": false
            },
            "stats": {
                "min": 4.990064708999995,
                "max": 6.56387515900002,
                "mean": 5.36590780840001,
                "stddev": 0.6769387564296777,
                "rounds": 5,
                "median": 5.035051511000006,
                "iqr": 0.5659934357499949,
                "q1": 5.001451139250015,
                "q3": 5.56744457500001,
                "iqr_outliers": 1,
                "stddev_outliers": 1,
                "outliers": "1;1",
                "ld15iqr": 4.990064708999995,
                "hd15iqr": 6.56387515900002,
                "ops": 0.18636175568178032,
                "total": 26.82953904200005,
                "iterations": 1
            }
        }
    ],
    "datetime": "2024-01-18T10:55:50.680352",
    "version": "4.0.0"
}