{
    "machine_info": {
        "node": "runner-xs6vzpvo-project-39604133-concurrent-0",
        "processor": "",
        "machine": "x86_64",
        "python_compiler": "GCC 12.2.0",
        "python_implementation": "CPython",
        "python_implementation_version": "3.12.3",
        "python_version": "3.12.3",
        "python_build": [
            "main",
            "May 14 2024 07:23:41"
        ],
        "release": "5.15.154+",
        "system": "Linux",
        "cpu": {
            "python_version": "3.12.3.final.0 (64 bit)",
            "cpuinfo_version": [
                9,
                0,
                0
            ],
            "cpuinfo_version_string": "9.0.0",
            "arch": "X86_64",
            "bits": 64,
            "count": 2,
            "arch_string_raw": "x86_64",
            "vendor_id_raw": "AuthenticAMD",
            "brand_raw": "AMD EPYC 7B13",
            "hz_advertised_friendly": "2.4500 GHz",
            "hz_actual_friendly": "2.4500 GHz",
            "hz_advertised": [
                2449998000,
                0
            ],
            "hz_actual": [
                2449998000,
                0
            ],
            "model": 1,
            "family": 25,
            "flags": [
                "3dnowext",
                "3dnowprefetch",
                "abm",
                "adx",
                "aes",
                "apic",
                "arat",
                "avx",
                "avx2",
                "bmi1",
                "bmi2",
                "clflush",
                "clflushopt",
                "clwb",
                "clzero",
                "cmov",
                "cmp_legacy",
                "constant_tsc",
                "cpuid",
                "cr8_legacy",
                "cx16",
                "cx8",
                "de",
                "erms",
                "extd_apicid",
                "f16c",
                "fma",
                "fpu",
                "fsgsbase",
                "fsrm",
                "fxsr",
                "fxsr_opt",
                "ht",
                "hypervisor",
                "ibpb",
                "ibrs",
                "invpcid",
                "invpcid_single",
                "lahf_lm",
                "lm",
                "mca",
                "mce",
                "misalignsse",
                "mmx",
                "mmxext",
                "movbe",
                "msr",
                "mtrr",
                "nonstop_tsc",
                "nopl",
                "npt",
                "nrip_save",
                "nx",
                "osvw",
                "osxsave",
                "pae",
                "pat",
                "pcid",
                "pclmulqdq",
                "pdpe1gb",
                "pge",
                "pni",
                "popcnt",
                "pse",
                "pse36",
                "rdpid",
                "rdrand",
                "rdrnd",
                "rdseed",
                "rdtscp",
                "rep_good",
                "sep",
                "sha",
                "sha_ni",
                "smap",
                "smep",
                "ssbd",
                "sse",
                "sse2",
                "sse4_1",
                "sse4_2",
                "sse4a",
                "ssse3",
                "stibp",
                "syscall",
                "topoext",
                "tsc",
                "tsc_adjust",
                "tsc_known_freq",
                "umip",
                "vaes",
                "vme",
                "vmmcall",
                "vpclmulqdq",
                "x2apic",
                "xgetbv1",
                "xsave",
                "xsavec",
                "xsaveerptr",
                "xsaveopt"
            ],
            "l3_cache_size": 524288,
            "l2_cache_size": 524288,
            "l1_data_cache_size": 32768,
            "l1_instruction_cache_size": 32768,
            "l2_cache_line_size": 512,
            "l2_cache_associativity": 6
        }
    },
    "commit_info": {
        "id": "9e855fc9813ce8e3a68233af3f194145d41314b0",
        "time": "2024-05-22T13:29:33+02:00",
        "author_time": "2024-05-22T13:29:33+02:00",
        "dirty": false,
        "project": "finesse3",
        "branch": "(detached head)"
    },
    "benchmarks": [
        {
            "group": null,
            "name": "test_01_simple_cav",
            "fullname": "tests/benchmarks/test_benchmarks.py::test_01_simple_cav",
            "params": null,
            "param": null,
            "extra_info": {},
            "options": {
                "disable_gc": false,
                "timer": "perf_counter",
                "min_rounds": 5,
                "max_time": 1.0,
                "min_time": 5e-06,
                "warmup": false
            },
            "stats": {
                "min": 0.36317550500000095,
                "max": 0.5216347599999978,
                "mean": 0.39683443459999806,
                "stddev": 0.06978303465446131,
                "rounds": 5,
                "median": 0.36670555599999943,
                "iqr": 0.04096896874999345,
                "q1": 0.3648629307500002,
                "q3": 0.40583189949999365,
                "iqr_outliers": 1,
                "stddev_outliers": 1,
                "outliers": "1;1",
                "ld15iqr": 0.36317550500000095,
                "hd15iqr": 0.5216347599999978,
                "ops": 2.5199426078232903,
                "total": 1.9841721729999904,
                "iterations": 1
            }
        },
        {
            "group": null,
            "name": "test_02_pdh_lock",
            "fullname": "tests/benchmarks/test_benchmarks.py::test_02_pdh_lock",
            "params": null,
            "param": null,
            "extra_info": {},
            "options": {
                "disable_gc": false,
                "timer": "perf_counter",
                "min_rounds": 5,
                "max_time": 1.0,
                "min_time": 5e-06,
                "warmup": false
            },
            "stats": {
                "min": 1.3143310410000026,
                "max": 1.594186264000001,
                "mean": 1.386526614199994,
                "stddev": 0.11706457953842866,
                "rounds": 5,
                "median": 1.3404614549999962,
                "iqr": 0.09019018300000425,
                "q1": 1.324839938249987,
                "q3": 1.4150301212499912,
                "iqr_outliers": 1,
                "stddev_outliers": 1,
                "outliers": "1;1",
                "ld15iqr": 1.3143310410000026,
                "hd15iqr": 1.594186264000001,
                "ops": 0.7212266895987322,
                "total": 6.9326330709999695,
                "iterations": 1
            }
        },
        {
            "group": null,
            "name": "test_03_near_unstable",
            "fullname": "tests/benchmarks/test_benchmarks.py::test_03_near_unstable",
            "params": null,
            "param": null,
            "extra_info": {},
            "options": {
                "disable_gc": false,
                "timer": "perf_counter",
                "min_rounds": 5,
                "max_time": 1.0,
                "min_time": 5e-06,
                "warmup": false
            },
            "stats": {
                "min": 1.7399999876488437e-06,
                "max": 2.4589999981117217e-05,
                "mean": 2.50184997604126e-06,
                "stddev": 9.203194767804566e-07,
                "rounds": 54198,
                "median": 1.839999981712026e-06,
                "iqr": 1.4510000312384363e-06,
                "q1": 1.7999999784024112e-06,
                "q3": 3.2510000096408476e-06,
                "iqr_outliers": 273,
                "stddev_outliers": 546,
                "outliers": "546;273",
                "ld15iqr": 1.7399999876488437e-06,
                "hd15iqr": 5.439999995360267e-06,
                "ops": 399704.2227057615,
                "total": 0.13559526500148422,
                "iterations": 1
            }
        },
        {
            "group": null,
            "name": "test_04_geometrical_params",
            "fullname": "tests/benchmarks/test_benchmarks.py::test_04_geometrical_params",
            "params": null,
            "param": null,
            "extra_info": {},
            "options": {
                "disable_gc": false,
                "timer": "perf_counter",
                "min_rounds": 5,
                "max_time": 1.0,
                "min_time": 5e-06,
                "warmup": false
            },
            "stats": {
                "min": 0.5032195370000068,
                "max": 0.8767936339999949,
                "mean": 0.5819886033999978,
                "stddev": 0.16487191450839983,
                "rounds": 5,
                "median": 0.5070502279999971,
                "iqr": 0.100618169250005,
                "q1": 0.5057724184999941,
                "q3": 0.6063905877499991,
                "iqr_outliers": 1,
                "stddev_outliers": 1,
                "outliers": "1;1",
                "ld15iqr": 0.5032195370000068,
                "hd15iqr": 0.8767936339999949,
                "ops": 1.7182467047601362,
                "total": 2.909943016999989,
                "iterations": 1
            }
        },
        {
            "group": null,
            "name": "test_05_modulation",
            "fullname": "tests/benchmarks/test_benchmarks.py::test_05_modulation",
            "params": null,
            "param": null,
            "extra_info": {},
            "options": {
                "disable_gc": false,
                "timer": "perf_counter",
                "min_rounds": 5,
                "max_time": 1.0,
                "min_time": 5e-06,
                "warmup": false
            },
            "stats": {
                "min": 0.17103822699999682,
                "max": 0.5657119979999834,
                "mean": 0.22169811999999567,
                "stddev": 0.13900834485698269,
                "rounds": 8,
                "median": 0.17251354299999377,
                "iqr": 0.002730200499968305,
                "q1": 0.17158681200001524,
                "q3": 0.17431701249998355,
                "iqr_outliers": 1,
                "stddev_outliers": 1,
                "outliers": "1;1",
                "ld15iqr": 0.17103822699999682,
                "hd15iqr": 0.5657119979999834,
                "ops": 4.510638159674153,
                "total": 1.7735849599999653,
                "iterations": 1
            }
        },
        {
            "group": null,
            "name": "test_06_radiation_pressure",
            "fullname": "tests/benchmarks/test_benchmarks.py::test_06_radiation_pressure",
            "params": null,
            "param": null,
            "extra_info": {},
            "options": {
                "disable_gc": false,
                "timer": "perf_counter",
                "min_rounds": 5,
                "max_time": 1.0,
                "min_time": 5e-06,
                "warmup": false
            },
            "stats": {
                "min": 0.23249105700000428,
                "max": 0.2364835089999815,
                "mean": 0.23419209179999712,
                "stddev": 0.0018794157748526557,
                "rounds": 5,
                "median": 0.23341413800000055,
                "iqr": 0.0034541537499919173,
                "q1": 0.23260915200000198,
                "q3": 0.2360633057499939,
                "iqr_outliers": 0,
                "stddev_outliers": 1,
                "outliers": "1;0",
                "ld15iqr": 0.23249105700000428,
                "hd15iqr": 0.2364835089999815,
                "ops": 4.269999009420062,
                "total": 1.1709604589999856,
                "iterations": 1
            }
        },
        {
            "group": null,
            "name": "test_07_homodyne",
            "fullname": "tests/benchmarks/test_benchmarks.py::test_07_homodyne",
            "params": null,
            "param": null,
            "extra_info": {},
            "options": {
                "disable_gc": false,
                "timer": "perf_counter",
                "min_rounds": 5,
                "max_time": 1.0,
                "min_time": 5e-06,
                "warmup": false
            },
            "stats": {
                "min": 0.1119486770000151,
                "max": 0.11834599900001308,
                "mean": 0.11446822000000338,
                "stddev": 0.0019393594635277055,
                "rounds": 10,
                "median": 0.11416112799999212,
                "iqr": 0.0032526109999935215,
                "q1": 0.11274229700001115,
                "q3": 0.11599490800000467,
                "iqr_outliers": 0,
                "stddev_outliers": 2,
                "outliers": "2;0",
                "ld15iqr": 0.1119486770000151,
                "hd15iqr": 0.11834599900001308,
                "ops": 8.736049184655535,
                "total": 1.1446822000000338,
                "iterations": 1
            }
        },
        {
            "group": null,
            "name": "test_08_optical_spring",
            "fullname": "tests/benchmarks/test_benchmarks.py::test_08_optical_spring",
            "params": null,
            "param": null,
            "extra_info": {},
            "options": {
                "disable_gc": false,
                "timer": "perf_counter",
                "min_rounds": 5,
                "max_time": 1.0,
                "min_time": 5e-06,
                "warmup": false
            },
            "stats": {
                "min": 0.2872589960000198,
                "max": 0.2904154070000118,
                "mean": 0.2891456282000092,
                "stddev": 0.001302252275162902,
                "rounds": 5,
                "median": 0.28979116600001475,
                "iqr": 0.0019483777500255428,
                "q1": 0.2880835759999911,
                "q3": 0.29003195375001667,
                "iqr_outliers": 0,
                "stddev_outliers": 1,
                "outliers": "1;0",
                "ld15iqr": 0.2872589960000198,
                "hd15iqr": 0.2904154070000118,
                "ops": 3.458464878840482,
                "total": 1.4457281410000462,
                "iterations": 1
            }
        },
        {
            "group": null,
            "name": "test_09_aligo_sensitivity",
            "fullname": "tests/benchmarks/test_benchmarks.py::test_09_aligo_sensitivity",
            "params": null,
            "param": null,
            "extra_info": {},
            "options": {
                "disable_gc": false,
                "timer": "perf_counter",
                "min_rounds": 5,
                "max_time": 1.0,
                "min_time": 5e-06,
                "warmup": false
            },
            "stats": {
                "min": 0.31331083500001,
                "max": 0.8750623220000193,
                "mean": 0.42980433340000557,
                "stddev": 0.24893588264063352,
                "rounds": 5,
                "median": 0.31987623699998835,
                "iqr": 0.14541428749998886,
                "q1": 0.3161291032500131,
                "q3": 0.46154339075000195,
                "iqr_outliers": 1,
                "stddev_outliers": 1,
                "outliers": "1;1",
                "ld15iqr": 0.31331083500001,
                "hd15iqr": 0.8750623220000193,
                "ops": 2.326640106416356,
                "total": 2.149021667000028,
                "iterations": 1
            }
        },
        {
            "group": null,
            "name": "test_10_shifted_beam",
            "fullname": "tests/benchmarks/test_benchmarks.py::test_10_shifted_beam",
            "params": null,
            "param": null,
            "extra_info": {},
            "options": {
                "disable_gc": false,
                "timer": "perf_counter",
                "min_rounds": 5,
                "max_time": 1.0,
                "min_time": 5e-06,
                "warmup": false
            },
            "stats": {
                "min": 0.7078193849999934,
                "max": 0.7212994100000003,
                "mean": 0.7153641880000009,
                "stddev": 0.005022719864225911,
                "rounds": 5,
                "median": 0.7152386479999961,
                "iqr": 0.006223727000012502,
                "q1": 0.7127017972499985,
                "q3": 0.718925524250011,
                "iqr_outliers": 0,
                "stddev_outliers": 2,
                "outliers": "2;0",
                "ld15iqr": 0.7078193849999934,
                "hd15iqr": 0.7212994100000003,
                "ops": 1.3978893782700774,
                "total": 3.5768209400000046,
                "iterations": 1
            }
        },
        {
            "group": null,
            "name": "test_angular_radiation_pressure",
            "fullname": "tests/benchmarks/test_benchmarks.py::test_angular_radiation_pressure",
            "params": null,
            "param": null,
            "extra_info": {},
            "options": {
                "disable_gc": false,
                "timer": "perf_counter",
                "min_rounds": 5,
                "max_time": 1.0,
                "min_time": 5e-06,
                "warmup": false
            },
            "stats": {
                "min": 0.33760832199999413,
                "max": 0.34666448599998034,
                "mean": 0.3417316759999949,
                "stddev": 0.00380220179144792,
                "rounds": 5,
                "median": 0.34201639400001227,
                "iqr": 0.006481764999982431,
                "q1": 0.33818166025000096,
                "q3": 0.3446634252499834,
                "iqr_outliers": 0,
                "stddev_outliers": 2,
                "outliers": "2;0",
                "ld15iqr": 0.33760832199999413,
                "hd15iqr": 0.34666448599998034,
                "ops": 2.9262724828587885,
                "total": 1.7086583799999744,
                "iterations": 1
            }
        },
        {
            "group": null,
            "name": "test_cavity_eigenmodes",
            "fullname": "tests/benchmarks/test_benchmarks.py::test_cavity_eigenmodes",
            "params": null,
            "param": null,
            "extra_info": {},
            "options": {
                "disable_gc": false,
                "timer": "perf_counter",
                "min_rounds": 5,
                "max_time": 1.0,
                "min_time": 5e-06,
                "warmup": false
            },
            "stats": {
                "min": 0.2669380690000196,
                "max": 1.1425992000000065,
                "mean": 0.4441853318000085,
                "stddev": 0.3904318555284153,
                "rounds": 5,
                "median": 0.2713826899999958,
                "iqr": 0.22229164924998202,
                "q1": 0.26754884650002,
                "q3": 0.489840495750002,
                "iqr_outliers": 1,
                "stddev_outliers": 1,
                "outliers": "1;1",
                "ld15iqr": 0.2669380690000196,
                "hd15iqr": 1.1425992000000065,
                "ops": 2.251312522967875,
                "total": 2.2209266590000425,
                "iterations": 1
            }
        },
        {
            "group": null,
            "name": "test_coupled_cavity_commands",
            "fullname": "tests/benchmarks/test_benchmarks.py::test_coupled_cavity_commands",
            "params": null,
            "param": null,
            "extra_info": {},
            "options": {
                "disable_gc": false,
                "timer": "perf_counter",
                "min_rounds": 5,
                "max_time": 1.0,
                "min_time": 5e-06,
                "warmup": false
            },
            "stats": {
                "min": 4.309770654000005,
                "max": 5.426551526000026,
                "mean": 4.7370570824000025,
                "stddev": 0.5695171898228131,
                "rounds": 5,
                "median": 4.339501894999984,
                "iqr": 1.008057460250015,
                "q1": 4.316559543749996,
                "q3": 5.324617004000011,
                "iqr_outliers": 0,
                "stddev_outliers": 1,
                "outliers": "1;0",
                "ld15iqr": 4.309770654000005,
                "hd15iqr": 5.426551526000026,
                "ops": 0.21110153046611713,
                "total": 23.685285412000013,
                "iterations": 1
            }
        },
        {
            "group": null,
            "name": "test_frequency_dependant_squeezing",
            "fullname": "tests/benchmarks/test_benchmarks.py::test_frequency_dependant_squeezing",
            "params": null,
            "param": null,
            "extra_info": {},
            "options": {
                "disable_gc": false,
                "timer": "perf_counter",
                "min_rounds": 5,
                "max_time": 1.0,
                "min_time": 5e-06,
                "warmup": false
            },
            "stats": {
                "min": 1.5008686089999799,
                "max": 2.703775749999977,
                "mean": 1.7494839301999945,
                "stddev": 0.533622641774764,
                "rounds": 5,
                "median": 1.5065825320000101,
                "iqr": 0.3231906052500122,
                "q1": 1.5025575272499907,
                "q3": 1.825748132500003,
                "iqr_outliers": 1,
                "stddev_outliers": 1,
                "outliers": "1;1",
                "ld15iqr": 1.5008686089999799,
                "hd15iqr": 2.703775749999977,
                "ops": 0.5715971337248485,
                "total": 8.747419650999973,
                "iterations": 1
            }
        },
        {
            "group": null,
            "name": "test_lock_actions",
            "fullname": "tests/benchmarks/test_benchmarks.py::test_lock_actions",
            "params": null,
            "param": null,
            "extra_info": {},
            "options": {
                "disable_gc": false,
                "timer": "perf_counter",
                "min_rounds": 5,
                "max_time": 1.0,
                "min_time": 5e-06,
                "warmup": false
            },
            "stats": {
                "min": 4.71668563099999,
                "max": 6.087225015999991,
                "mean": 5.110689414199993,
                "stddev": 0.5649279728568273,
                "rounds": 5,
                "median": 4.930574243999985,
                "iqr": 0.5897997132500024,
                "q1": 4.737699791749996,
                "q3": 5.327499504999999,
                "iqr_outliers": 0,
                "stddev_outliers": 1,
                "outliers": "1;0",
                "ld15iqr": 4.71668563099999,
                "hd15iqr": 6.087225015999991,
                "ops": 0.19566831770710058,
                "total": 25.553447070999965,
                "iterations": 1
            }
        }
    ],
    "datetime": "2024-05-22T11:36:26.799612",
    "version": "4.0.0"
}