{
    "machine_info": {
        "node": "runner-xxurkrix-project-39604133-concurrent-0",
        "processor": "",
        "machine": "x86_64",
        "python_compiler": "GCC 12.2.0",
        "python_implementation": "CPython",
        "python_implementation_version": "3.13.0",
        "python_version": "3.13.0",
        "python_build": [
            "main",
            "Nov 12 2024 06:05:34"
        ],
        "release": "5.15.154+",
        "system": "Linux",
        "cpu": {
            "python_version": "3.13.0.final.0 (64 bit)",
            "cpuinfo_version": [
                9,
                0,
                0
            ],
            "cpuinfo_version_string": "9.0.0",
            "arch": "X86_64",
            "bits": 64,
            "count": 2,
            "arch_string_raw": "x86_64",
            "vendor_id_raw": "AuthenticAMD",
            "brand_raw": "AMD EPYC 7B13",
            "hz_advertised_friendly": "2.4500 GHz",
            "hz_actual_friendly": "2.4500 GHz",
            "hz_advertised": [
                2449998000,
                0
            ],
            "hz_actual": [
                2449998000,
                0
            ],
            "model": 1,
            "family": 25,
            "flags": [
                "3dnowext",
                "3dnowprefetch",
                "abm",
                "adx",
                "aes",
                "apic",
                "arat",
                "avx",
                "avx2",
                "bmi1",
                "bmi2",
                "clflush",
                "clflushopt",
                "clwb",
                "clzero",
                "cmov",
                "cmp_legacy",
                "constant_tsc",
                "cpuid",
                "cr8_legacy",
                "cx16",
                "cx8",
                "de",
                "erms",
                "extd_apicid",
                "f16c",
                "fma",
                "fpu",
                "fsgsbase",
                "fsrm",
                "fxsr",
                "fxsr_opt",
                "ht",
                "hypervisor",
                "ibpb",
                "ibrs",
                "invpcid",
                "invpcid_single",
                "lahf_lm",
                "lm",
                "mca",
                "mce",
                "misalignsse",
                "mmx",
                "mmxext",
                "movbe",
                "msr",
                "mtrr",
                "nonstop_tsc",
                "nopl",
                "npt",
                "nrip_save",
                "nx",
                "osvw",
                "osxsave",
                "pae",
                "pat",
                "pcid",
                "pclmulqdq",
                "pdpe1gb",
                "pge",
                "pni",
                "popcnt",
                "pse",
                "pse36",
                "rdpid",
                "rdrand",
                "rdrnd",
                "rdseed",
                "rdtscp",
                "rep_good",
                "sep",
                "sha",
                "sha_ni",
                "smap",
                "smep",
                "ssbd",
                "sse",
                "sse2",
                "sse4_1",
                "sse4_2",
                "sse4a",
                "ssse3",
                "stibp",
                "syscall",
                "topoext",
                "tsc",
                "tsc_adjust",
                "tsc_known_freq",
                "umip",
                "vaes",
                "vme",
                "vmmcall",
                "vpclmulqdq",
                "x2apic",
                "xgetbv1",
                "xsave",
                "xsavec",
                "xsaveerptr",
                "xsaveopt"
            ],
            "l3_cache_size": 524288,
            "l2_cache_size": 524288,
            "l1_data_cache_size": 32768,
            "l1_instruction_cache_size": 32768,
            "l2_cache_line_size": 512,
            "l2_cache_associativity": 6
        }
    },
    "commit_info": {
        "id": "f443591eaf7c29ee2393fa101f666ed8601aaaa9",
        "time": "2024-11-18T10:53:10+00:00",
        "author_time": "2024-11-18T10:53:10+00:00",
        "dirty": false,
        "project": "finesse3",
        "branch": "(detached head)"
    },
    "benchmarks": [
        {
            "group": null,
            "name": "test_01_simple_cav",
            "fullname": "tests/benchmarks/test_benchmarks.py::test_01_simple_cav",
            "params": null,
            "param": null,
            "extra_info": {},
            "options": {
                "disable_gc": false,
                "timer": "perf_counter",
                "min_rounds": 5,
                "max_time": 1.0,
                "min_time": 5e-06,
                "warmup": false
            },
            "stats": {
                "min": 0.2972502840000004,
                "max": 0.5037128849999988,
                "mean": 0.3401248138000028,
                "stddev": 0.09146329490348735,
                "rounds": 5,
                "median": 0.2997794100000135,
                "iqr": 0.054122162250003214,
                "q1": 0.2980148737499988,
                "q3": 0.352137036000002,
                "iqr_outliers": 1,
                "stddev_outliers": 1,
                "outliers": "1;1",
                "ld15iqr": 0.2972502840000004,
                "hd15iqr": 0.5037128849999988,
                "ops": 2.9400971626492716,
                "total": 1.700624069000014,
                "iterations": 1
            }
        },
        {
            "group": null,
            "name": "test_02_pdh_lock",
            "fullname": "tests/benchmarks/test_benchmarks.py::test_02_pdh_lock",
            "params": null,
            "param": null,
            "extra_info": {},
            "options": {
                "disable_gc": false,
                "timer": "perf_counter",
                "min_rounds": 5,
                "max_time": 1.0,
                "min_time": 5e-06,
                "warmup": false
            },
            "stats": {
                "min": 1.3074838349999993,
                "max": 1.652595544999997,
                "mean": 1.437288119599998,
                "stddev": 0.17120794863289326,
                "rounds": 5,
                "median": 1.3169372380000084,
                "iqr": 0.2956090670000222,
                "q1": 1.313239381499983,
                "q3": 1.6088484485000052,
                "iqr_outliers": 0,
                "stddev_outliers": 1,
                "outliers": "1;0",
                "ld15iqr": 1.3074838349999993,
                "hd15iqr": 1.652595544999997,
                "ops": 0.6957547247230452,
                "total": 7.18644059799999,
                "iterations": 1
            }
        },
        {
            "group": null,
            "name": "test_03_near_unstable",
            "fullname": "tests/benchmarks/test_benchmarks.py::test_03_near_unstable",
            "params": null,
            "param": null,
            "extra_info": {},
            "options": {
                "disable_gc": false,
                "timer": "perf_counter",
                "min_rounds": 5,
                "max_time": 1.0,
                "min_time": 5e-06,
                "warmup": false
            },
            "stats": {
                "min": 1.9999999949504854e-06,
                "max": 2.0109999979922577e-05,
                "mean": 2.1412637865424e-06,
                "stddev": 4.6558663146332214e-07,
                "rounds": 75019,
                "median": 2.1000000174353772e-06,
                "iqr": 4.899999339613714e-08,
                "q1": 2.080000001569715e-06,
                "q3": 2.1289999949658522e-06,
                "iqr_outliers": 1658,
                "stddev_outliers": 770,
                "outliers": "770;1658",
                "ld15iqr": 2.0089999850370077e-06,
                "hd15iqr": 2.209000001585082e-06,
                "ops": 467013.92247180693,
                "total": 0.1606354680026243,
                "iterations": 1
            }
        },
        {
            "group": null,
            "name": "test_04_geometrical_params",
            "fullname": "tests/benchmarks/test_benchmarks.py::test_04_geometrical_params",
            "params": null,
            "param": null,
            "extra_info": {},
            "options": {
                "disable_gc": false,
                "timer": "perf_counter",
                "min_rounds": 5,
                "max_time": 1.0,
                "min_time": 5e-06,
                "warmup": false
            },
            "stats": {
                "min": 0.4924695409999913,
                "max": 0.5438839840000185,
                "mean": 0.5092852764000042,
                "stddev": 0.022503165381649082,
                "rounds": 5,
                "median": 0.4963474930000018,
                "iqr": 0.033162029750002375,
                "q1": 0.49311018725000366,
                "q3": 0.526272217000006,
                "iqr_outliers": 0,
                "stddev_outliers": 1,
                "outliers": "1;0",
                "ld15iqr": 0.4924695409999913,
                "hd15iqr": 0.5438839840000185,
                "ops": 1.963536050106772,
                "total": 2.5464263820000212,
                "iterations": 1
            }
        },
        {
            "group": null,
            "name": "test_05_modulation",
            "fullname": "tests/benchmarks/test_benchmarks.py::test_05_modulation",
            "params": null,
            "param": null,
            "extra_info": {},
            "options": {
                "disable_gc": false,
                "timer": "perf_counter",
                "min_rounds": 5,
                "max_time": 1.0,
                "min_time": 5e-06,
                "warmup": false
            },
            "stats": {
                "min": 0.12994148500001756,
                "max": 0.13395504499999333,
                "mean": 0.13167511862500092,
                "stddev": 0.0014731676714792093,
                "rounds": 8,
                "median": 0.13135879000000728,
                "iqr": 0.002603550500012375,
                "q1": 0.1303949344999893,
                "q3": 0.13299848500000166,
                "iqr_outliers": 0,
                "stddev_outliers": 2,
                "outliers": "2;0",
                "ld15iqr": 0.12994148500001756,
                "hd15iqr": 0.13395504499999333,
                "ops": 7.594449205304394,
                "total": 1.0534009490000074,
                "iterations": 1
            }
        },
        {
            "group": null,
            "name": "test_06_radiation_pressure",
            "fullname": "tests/benchmarks/test_benchmarks.py::test_06_radiation_pressure",
            "params": null,
            "param": null,
            "extra_info": {},
            "options": {
                "disable_gc": false,
                "timer": "perf_counter",
                "min_rounds": 5,
                "max_time": 1.0,
                "min_time": 5e-06,
                "warmup": false
            },
            "stats": {
                "min": 0.2594721100000186,
                "max": 0.2620570600000178,
                "mean": 0.2605599434000112,
                "stddev": 0.0009939823381112602,
                "rounds": 5,
                "median": 0.2604704990000073,
                "iqr": 0.0013719300000119006,
                "q1": 0.2598051992500032,
                "q3": 0.2611771292500151,
                "iqr_outliers": 0,
                "stddev_outliers": 2,
                "outliers": "2;0",
                "ld15iqr": 0.2594721100000186,
                "hd15iqr": 0.2620570600000178,
                "ops": 3.837888460333297,
                "total": 1.302799717000056,
                "iterations": 1
            }
        },
        {
            "group": null,
            "name": "test_07_homodyne",
            "fullname": "tests/benchmarks/test_benchmarks.py::test_07_homodyne",
            "params": null,
            "param": null,
            "extra_info": {},
            "options": {
                "disable_gc": false,
                "timer": "perf_counter",
                "min_rounds": 5,
                "max_time": 1.0,
                "min_time": 5e-06,
                "warmup": false
            },
            "stats": {
                "min": 0.09200136699999462,
                "max": 0.7216311960000041,
                "mean": 0.15532402109091042,
                "stddev": 0.18792478688916048,
                "rounds": 11,
                "median": 0.09837469800001486,
                "iqr": 0.010326604250018079,
                "q1": 0.09326656799999,
                "q3": 0.10359317225000808,
                "iqr_outliers": 1,
                "stddev_outliers": 1,
                "outliers": "1;1",
                "ld15iqr": 0.09200136699999462,
                "hd15iqr": 0.7216311960000041,
                "ops": 6.4381542080648595,
                "total": 1.7085642320000147,
                "iterations": 1
            }
        },
        {
            "group": null,
            "name": "test_08_optical_spring",
            "fullname": "tests/benchmarks/test_benchmarks.py::test_08_optical_spring",
            "params": null,
            "param": null,
            "extra_info": {},
            "options": {
                "disable_gc": false,
                "timer": "perf_counter",
                "min_rounds": 5,
                "max_time": 1.0,
                "min_time": 5e-06,
                "warmup": false
            },
            "stats": {
                "min": 0.2465577069999938,
                "max": 0.26073052000000985,
                "mean": 0.2524299942000027,
                "stddev": 0.005492316573051996,
                "rounds": 5,
                "median": 0.25132038800001055,
                "iqr": 0.007675568250014919,
                "q1": 0.2484012527499928,
                "q3": 0.2560768210000077,
                "iqr_outliers": 0,
                "stddev_outliers": 2,
                "outliers": "2;0",
                "ld15iqr": 0.2465577069999938,
                "hd15iqr": 0.26073052000000985,
                "ops": 3.9614943666626647,
                "total": 1.2621499710000137,
                "iterations": 1
            }
        },
        {
            "group": null,
            "name": "test_09_aligo_sensitivity",
            "fullname": "tests/benchmarks/test_benchmarks.py::test_09_aligo_sensitivity",
            "params": null,
            "param": null,
            "extra_info": {},
            "options": {
                "disable_gc": false,
                "timer": "perf_counter",
                "min_rounds": 5,
                "max_time": 1.0,
                "min_time": 5e-06,
                "warmup": false
            },
            "stats": {
                "min": 0.2745903720000058,
                "max": 0.28327167300000156,
                "mean": 0.27932618659999664,
                "stddev": 0.0031621854027900046,
                "rounds": 5,
                "median": 0.2796489429999838,
                "iqr": 0.003589145999995935,
                "q1": 0.27760816199999994,
                "q3": 0.28119730799999587,
                "iqr_outliers": 0,
                "stddev_outliers": 2,
                "outliers": "2;0",
                "ld15iqr": 0.2745903720000058,
                "hd15iqr": 0.28327167300000156,
                "ops": 3.580043862597207,
                "total": 1.396630932999983,
                "iterations": 1
            }
        },
        {
            "group": null,
            "name": "test_10_shifted_beam",
            "fullname": "tests/benchmarks/test_benchmarks.py::test_10_shifted_beam",
            "params": null,
            "param": null,
            "extra_info": {},
            "options": {
                "disable_gc": false,
                "timer": "perf_counter",
                "min_rounds": 5,
                "max_time": 1.0,
                "min_time": 5e-06,
                "warmup": false
            },
            "stats": {
                "min": 0.7729723770000021,
                "max": 0.7886418589999948,
                "mean": 0.7771580134000032,
                "stddev": 0.0066339079471778575,
                "rounds": 5,
                "median": 0.7739818569999954,
                "iqr": 0.0069273005000027865,
                "q1": 0.7730608695000072,
                "q3": 0.77998817000001,
                "iqr_outliers": 0,
                "stddev_outliers": 1,
                "outliers": "1;0",
                "ld15iqr": 0.7729723770000021,
                "hd15iqr": 0.7886418589999948,
                "ops": 1.2867396111957736,
                "total": 3.8857900670000163,
                "iterations": 1
            }
        },
        {
            "group": null,
            "name": "test_angular_radiation_pressure",
            "fullname": "tests/benchmarks/test_benchmarks.py::test_angular_radiation_pressure",
            "params": null,
            "param": null,
            "extra_info": {},
            "options": {
                "disable_gc": false,
                "timer": "perf_counter",
                "min_rounds": 5,
                "max_time": 1.0,
                "min_time": 5e-06,
                "warmup": false
            },
            "stats": {
                "min": 0.33204135299999393,
                "max": 0.3327105030000155,
                "mean": 0.33242607899999826,
                "stddev": 0.00027716206059054665,
                "rounds": 5,
                "median": 0.33255518299998243,
                "iqr": 0.0004298549999930401,
                "q1": 0.33218781300000444,
                "q3": 0.3326176679999975,
                "iqr_outliers": 0,
                "stddev_outliers": 2,
                "outliers": "2;0",
                "ld15iqr": 0.33204135299999393,
                "hd15iqr": 0.3327105030000155,
                "ops": 3.0081875736349954,
                "total": 1.6621303949999913,
                "iterations": 1
            }
        },
        {
            "group": null,
            "name": "test_cavity_eigenmodes",
            "fullname": "tests/benchmarks/test_benchmarks.py::test_cavity_eigenmodes",
            "params": null,
            "param": null,
            "extra_info": {},
            "options": {
                "disable_gc": false,
                "timer": "perf_counter",
                "min_rounds": 5,
                "max_time": 1.0,
                "min_time": 5e-06,
                "warmup": false
            },
            "stats": {
                "min": 0.2937635060000048,
                "max": 1.3503802259999986,
                "mean": 0.5113626612000018,
                "stddev": 0.4690620994884139,
                "rounds": 5,
                "median": 0.3016891780000037,
                "iqr": 0.27144382150000723,
                "q1": 0.29891370424999764,
                "q3": 0.5703575257500049,
                "iqr_outliers": 1,
                "stddev_outliers": 1,
                "outliers": "1;1",
                "ld15iqr": 0.2937635060000048,
                "hd15iqr": 1.3503802259999986,
                "ops": 1.9555592847810304,
                "total": 2.5568133060000093,
                "iterations": 1
            }
        },
        {
            "group": null,
            "name": "test_coupled_cavity_commands",
            "fullname": "tests/benchmarks/test_benchmarks.py::test_coupled_cavity_commands",
            "params": null,
            "param": null,
            "extra_info": {},
            "options": {
                "disable_gc": false,
                "timer": "perf_counter",
                "min_rounds": 5,
                "max_time": 1.0,
                "min_time": 5e-06,
                "warmup": false
            },
            "stats": {
                "min": 6.021025791,
                "max": 7.313548885999978,
                "mean": 6.32822551299999,
                "stddev": 0.5539668098010123,
                "rounds": 5,
                "median": 6.087256402999998,
                "iqr": 0.42186295999998435,
                "q1": 6.038126536499995,
                "q3": 6.459989496499979,
                "iqr_outliers": 1,
                "stddev_outliers": 1,
                "outliers": "1;1",
                "ld15iqr": 6.021025791,
                "hd15iqr": 7.313548885999978,
                "ops": 0.158022181407049,
                "total": 31.641127564999948,
                "iterations": 1
            }
        },
        {
            "group": null,
            "name": "test_frequency_dependant_squeezing",
            "fullname": "tests/benchmarks/test_benchmarks.py::test_frequency_dependant_squeezing",
            "params": null,
            "param": null,
            "extra_info": {},
            "options": {
                "disable_gc": false,
                "timer": "perf_counter",
                "min_rounds": 5,
                "max_time": 1.0,
                "min_time": 5e-06,
                "warmup": false
            },
            "stats": {
                "min": 1.6730903799999908,
                "max": 1.7017088720000118,
                "mean": 1.6920847244000072,
                "stddev": 0.012100663237650012,
                "rounds": 5,
                "median": 1.6971119680000015,
                "iqr": 0.01763269299998882,
                "q1": 1.6837257107500179,
                "q3": 1.7013584037500067,
                "iqr_outliers": 0,
                "stddev_outliers": 1,
                "outliers": "1;0",
                "ld15iqr": 1.6730903799999908,
                "hd15iqr": 1.7017088720000118,
                "ops": 0.5909869556647572,
                "total": 8.460423622000036,
                "iterations": 1
            }
        },
        {
            "group": null,
            "name": "test_lock_actions",
            "fullname": "tests/benchmarks/test_benchmarks.py::test_lock_actions",
            "params": null,
            "param": null,
            "extra_info": {},
            "options": {
                "disable_gc": false,
                "timer": "perf_counter",
                "min_rounds": 5,
                "max_time": 1.0,
                "min_time": 5e-06,
                "warmup": false
            },
            "stats": {
                "min": 3.188272364999989,
                "max": 5.000881698000001,
                "mean": 3.55697697999999,
                "stddev": 0.8072088121808295,
                "rounds": 5,
                "median": 3.196298681000002,
                "iqr": 0.467414111250001,
                "q1": 3.1897242607499834,
                "q3": 3.6571383719999844,
                "iqr_outliers": 1,
                "stddev_outliers": 1,
                "outliers": "1;1",
                "ld15iqr": 3.188272364999989,
                "hd15iqr": 5.000881698000001,
                "ops": 0.28113760803703675,
                "total": 17.784884899999952,
                "iterations": 1
            }
        }
    ],
    "datetime": "2024-11-18T10:59:16.871632+00:00",
    "version": "5.1.0"
}