{
    "machine_info": {
        "node": "runner--azerasq-project-39604133-concurrent-0",
        "processor": "",
        "machine": "x86_64",
        "python_compiler": "GCC 12.2.0",
        "python_implementation": "CPython",
        "python_implementation_version": "3.12.7",
        "python_version": "3.12.7",
        "python_build": [
            "main",
            "Oct  1 2024 22:28:30"
        ],
        "release": "5.15.154+",
        "system": "Linux",
        "cpu": {
            "python_version": "3.12.7.final.0 (64 bit)",
            "cpuinfo_version": [
                9,
                0,
                0
            ],
            "cpuinfo_version_string": "9.0.0",
            "arch": "X86_64",
            "bits": 64,
            "count": 2,
            "arch_string_raw": "x86_64",
            "vendor_id_raw": "AuthenticAMD",
            "brand_raw": "AMD EPYC 7B13",
            "hz_advertised_friendly": "2.4500 GHz",
            "hz_actual_friendly": "2.4500 GHz",
            "hz_advertised": [
                2450000000,
                0
            ],
            "hz_actual": [
                2450000000,
                0
            ],
            "model": 1,
            "family": 25,
            "flags": [
                "3dnowext",
                "3dnowprefetch",
                "abm",
                "adx",
                "aes",
                "apic",
                "arat",
                "avx",
                "avx2",
                "bmi1",
                "bmi2",
                "clflush",
                "clflushopt",
                "clwb",
                "clzero",
                "cmov",
                "cmp_legacy",
                "constant_tsc",
                "cpuid",
                "cr8_legacy",
                "cx16",
                "cx8",
                "de",
                "erms",
                "extd_apicid",
                "f16c",
                "fma",
                "fpu",
                "fsgsbase",
                "fsrm",
                "fxsr",
                "fxsr_opt",
                "ht",
                "hypervisor",
                "ibpb",
                "ibrs",
                "invpcid",
                "invpcid_single",
                "lahf_lm",
                "lm",
                "mca",
                "mce",
                "misalignsse",
                "mmx",
                "mmxext",
                "movbe",
                "msr",
                "mtrr",
                "nonstop_tsc",
                "nopl",
                "npt",
                "nrip_save",
                "nx",
                "osvw",
                "osxsave",
                "pae",
                "pat",
                "pcid",
                "pclmulqdq",
                "pdpe1gb",
                "pge",
                "pni",
                "popcnt",
                "pse",
                "pse36",
                "rdpid",
                "rdrand",
                "rdrnd",
                "rdseed",
                "rdtscp",
                "rep_good",
                "sep",
                "sha",
                "sha_ni",
                "smap",
                "smep",
                "ssbd",
                "sse",
                "sse2",
                "sse4_1",
                "sse4_2",
                "sse4a",
                "ssse3",
                "stibp",
                "syscall",
                "topoext",
                "tsc",
                "tsc_adjust",
                "tsc_known_freq",
                "umip",
                "vaes",
                "vme",
                "vmmcall",
                "vpclmulqdq",
                "x2apic",
                "xgetbv1",
                "xsave",
                "xsavec",
                "xsaveerptr",
                "xsaveopt"
            ],
            "l3_cache_size": 524288,
            "l2_cache_size": 524288,
            "l1_data_cache_size": 32768,
            "l1_instruction_cache_size": 32768,
            "l2_cache_line_size": 512,
            "l2_cache_associativity": 6
        }
    },
    "commit_info": {
        "id": "b3f8ac141458ab6960a656ba7793698a5d85bce7",
        "time": "2024-10-15T14:37:58-07:00",
        "author_time": "2024-10-15T14:37:58-07:00",
        "dirty": false,
        "project": "finesse3",
        "branch": "(detached head)"
    },
    "benchmarks": [
        {
            "group": null,
            "name": "test_01_simple_cav",
            "fullname": "tests/benchmarks/test_benchmarks.py::test_01_simple_cav",
            "params": null,
            "param": null,
            "extra_info": {},
            "options": {
                "disable_gc": false,
                "timer": "perf_counter",
                "min_rounds": 5,
                "max_time": 1.0,
                "min_time": 5e-06,
                "warmup": false
            },
            "stats": {
                "min": 0.3112496990000011,
                "max": 0.5214969150000002,
                "mean": 0.3579274794000014,
                "stddev": 0.09152827075029014,
                "rounds": 5,
                "median": 0.3197407769999927,
                "iqr": 0.0573597999999933,
                "q1": 0.3143446790000084,
                "q3": 0.3717044790000017,
                "iqr_outliers": 1,
                "stddev_outliers": 1,
                "outliers": "1;1",
                "ld15iqr": 0.3112496990000011,
                "hd15iqr": 0.5214969150000002,
                "ops": 2.793862046234375,
                "total": 1.789637397000007,
                "iterations": 1
            }
        },
        {
            "group": null,
            "name": "test_02_pdh_lock",
            "fullname": "tests/benchmarks/test_benchmarks.py::test_02_pdh_lock",
            "params": null,
            "param": null,
            "extra_info": {},
            "options": {
                "disable_gc": false,
                "timer": "perf_counter",
                "min_rounds": 5,
                "max_time": 1.0,
                "min_time": 5e-06,
                "warmup": false
            },
            "stats": {
                "min": 1.3985194920000197,
                "max": 1.687649534000002,
                "mean": 1.4627610070000003,
                "stddev": 0.12586929164218827,
                "rounds": 5,
                "median": 1.4082380799999896,
                "iqr": 0.08093727725000832,
                "q1": 1.4025767129999949,
                "q3": 1.4835139902500032,
                "iqr_outliers": 1,
                "stddev_outliers": 1,
                "outliers": "1;1",
                "ld15iqr": 1.3985194920000197,
                "hd15iqr": 1.687649534000002,
                "ops": 0.6836386772784679,
                "total": 7.3138050350000015,
                "iterations": 1
            }
        },
        {
            "group": null,
            "name": "test_03_near_unstable",
            "fullname": "tests/benchmarks/test_benchmarks.py::test_03_near_unstable",
            "params": null,
            "param": null,
            "extra_info": {},
            "options": {
                "disable_gc": false,
                "timer": "perf_counter",
                "min_rounds": 5,
                "max_time": 1.0,
                "min_time": 5e-06,
                "warmup": false
            },
            "stats": {
                "min": 2.310000013494573e-06,
                "max": 2.8011000011929355e-05,
                "mean": 2.521411503149623e-06,
                "stddev": 5.495945815781717e-07,
                "rounds": 51047,
                "median": 2.4899999857552757e-06,
                "iqr": 6.999997026468918e-08,
                "q1": 2.4500000108673703e-06,
                "q3": 2.5199999811320595e-06,
                "iqr_outliers": 1021,
                "stddev_outliers": 466,
                "outliers": "466;1021",
                "ld15iqr": 2.348999998957879e-06,
                "hd15iqr": 2.6289999937034736e-06,
                "ops": 396603.25129430456,
                "total": 0.1287104930012788,
                "iterations": 1
            }
        },
        {
            "group": null,
            "name": "test_04_geometrical_params",
            "fullname": "tests/benchmarks/test_benchmarks.py::test_04_geometrical_params",
            "params": null,
            "param": null,
            "extra_info": {},
            "options": {
                "disable_gc": false,
                "timer": "perf_counter",
                "min_rounds": 5,
                "max_time": 1.0,
                "min_time": 5e-06,
                "warmup": false
            },
            "stats": {
                "min": 0.5265857039999844,
                "max": 0.8906067039999925,
                "mean": 0.614344853199998,
                "stddev": 0.15518610755525677,
                "rounds": 5,
                "median": 0.5483963600000266,
                "iqr": 0.11349681549997115,
                "q1": 0.5352014550000064,
                "q3": 0.6486982704999775,
                "iqr_outliers": 1,
                "stddev_outliers": 1,
                "outliers": "1;1",
                "ld15iqr": 0.5265857039999844,
                "hd15iqr": 0.8906067039999925,
                "ops": 1.6277502689103724,
                "total": 3.0717242659999897,
                "iterations": 1
            }
        },
        {
            "group": null,
            "name": "test_05_modulation",
            "fullname": "tests/benchmarks/test_benchmarks.py::test_05_modulation",
            "params": null,
            "param": null,
            "extra_info": {},
            "options": {
                "disable_gc": false,
                "timer": "perf_counter",
                "min_rounds": 5,
                "max_time": 1.0,
                "min_time": 5e-06,
                "warmup": false
            },
            "stats": {
                "min": 0.14361306300000365,
                "max": 0.1476513149999903,
                "mean": 0.14537934912500106,
                "stddev": 0.0016586341872424607,
                "rounds": 8,
                "median": 0.14506747450001,
                "iqr": 0.0031881949999927883,
                "q1": 0.14381476900000223,
                "q3": 0.14700296399999502,
                "iqr_outliers": 0,
                "stddev_outliers": 3,
                "outliers": "3;0",
                "ld15iqr": 0.14361306300000365,
                "hd15iqr": 0.1476513149999903,
                "ops": 6.878556039896514,
                "total": 1.1630347930000084,
                "iterations": 1
            }
        },
        {
            "group": null,
            "name": "test_06_radiation_pressure",
            "fullname": "tests/benchmarks/test_benchmarks.py::test_06_radiation_pressure",
            "params": null,
            "param": null,
            "extra_info": {},
            "options": {
                "disable_gc": false,
                "timer": "perf_counter",
                "min_rounds": 5,
                "max_time": 1.0,
                "min_time": 5e-06,
                "warmup": false
            },
            "stats": {
                "min": 0.28009786699999495,
                "max": 0.8149700989999928,
                "mean": 0.3922942199999966,
                "stddev": 0.23632806899012485,
                "rounds": 5,
                "median": 0.2903047380000032,
                "iqr": 0.1390214429999972,
                "q1": 0.28340967274999684,
                "q3": 0.42243111574999404,
                "iqr_outliers": 1,
                "stddev_outliers": 1,
                "outliers": "1;1",
                "ld15iqr": 0.28009786699999495,
                "hd15iqr": 0.8149700989999928,
                "ops": 2.549107147181543,
                "total": 1.961471099999983,
                "iterations": 1
            }
        },
        {
            "group": null,
            "name": "test_07_homodyne",
            "fullname": "tests/benchmarks/test_benchmarks.py::test_07_homodyne",
            "params": null,
            "param": null,
            "extra_info": {},
            "options": {
                "disable_gc": false,
                "timer": "perf_counter",
                "min_rounds": 5,
                "max_time": 1.0,
                "min_time": 5e-06,
                "warmup": false
            },
            "stats": {
                "min": 0.09992116900002657,
                "max": 0.10482465000001184,
                "mean": 0.1021924528999989,
                "stddev": 0.0019089879407882683,
                "rounds": 10,
                "median": 0.1012960849999871,
                "iqr": 0.003536679999996295,
                "q1": 0.1006504199999938,
                "q3": 0.1041870999999901,
                "iqr_outliers": 0,
                "stddev_outliers": 4,
                "outliers": "4;0",
                "ld15iqr": 0.09992116900002657,
                "hd15iqr": 0.10482465000001184,
                "ops": 9.785458432811634,
                "total": 1.021924528999989,
                "iterations": 1
            }
        },
        {
            "group": null,
            "name": "test_08_optical_spring",
            "fullname": "tests/benchmarks/test_benchmarks.py::test_08_optical_spring",
            "params": null,
            "param": null,
            "extra_info": {},
            "options": {
                "disable_gc": false,
                "timer": "perf_counter",
                "min_rounds": 5,
                "max_time": 1.0,
                "min_time": 5e-06,
                "warmup": false
            },
            "stats": {
                "min": 0.2618353450000086,
                "max": 0.9242127299999936,
                "mean": 0.40080992279999916,
                "stddev": 0.29264520061258636,
                "rounds": 5,
                "median": 0.2742547459999969,
                "iqr": 0.171865127000018,
                "q1": 0.2662284932499901,
                "q3": 0.4380936202500081,
                "iqr_outliers": 1,
                "stddev_outliers": 1,
                "outliers": "1;1",
                "ld15iqr": 0.2618353450000086,
                "hd15iqr": 0.9242127299999936,
                "ops": 2.494948211396931,
                "total": 2.004049613999996,
                "iterations": 1
            }
        },
        {
            "group": null,
            "name": "test_09_aligo_sensitivity",
            "fullname": "tests/benchmarks/test_benchmarks.py::test_09_aligo_sensitivity",
            "params": null,
            "param": null,
            "extra_info": {},
            "options": {
                "disable_gc": false,
                "timer": "perf_counter",
                "min_rounds": 5,
                "max_time": 1.0,
                "min_time": 5e-06,
                "warmup": false
            },
            "stats": {
                "min": 0.3023740190000126,
                "max": 0.33445883300001356,
                "mean": 0.31581999840000774,
                "stddev": 0.011957745761562215,
                "rounds": 5,
                "median": 0.31348952999999824,
                "iqr": 0.014226066000006199,
                "q1": 0.3082826772500056,
                "q3": 0.3225087432500118,
                "iqr_outliers": 0,
                "stddev_outliers": 2,
                "outliers": "2;0",
                "ld15iqr": 0.3023740190000126,
                "hd15iqr": 0.33445883300001356,
                "ops": 3.166360601184701,
                "total": 1.5790999920000388,
                "iterations": 1
            }
        },
        {
            "group": null,
            "name": "test_10_shifted_beam",
            "fullname": "tests/benchmarks/test_benchmarks.py::test_10_shifted_beam",
            "params": null,
            "param": null,
            "extra_info": {},
            "options": {
                "disable_gc": false,
                "timer": "perf_counter",
                "min_rounds": 5,
                "max_time": 1.0,
                "min_time": 5e-06,
                "warmup": false
            },
            "stats": {
                "min": 0.7988603269999999,
                "max": 1.5809364220000077,
                "mean": 0.9640550349999956,
                "stddev": 0.3449669672622611,
                "rounds": 5,
                "median": 0.8098476389999973,
                "iqr": 0.20851000850002066,
                "q1": 0.8047061344999804,
                "q3": 1.013216143000001,
                "iqr_outliers": 1,
                "stddev_outliers": 1,
                "outliers": "1;1",
                "ld15iqr": 0.7988603269999999,
                "hd15iqr": 1.5809364220000077,
                "ops": 1.0372851794711124,
                "total": 4.820275174999978,
                "iterations": 1
            }
        },
        {
            "group": null,
            "name": "test_angular_radiation_pressure",
            "fullname": "tests/benchmarks/test_benchmarks.py::test_angular_radiation_pressure",
            "params": null,
            "param": null,
            "extra_info": {},
            "options": {
                "disable_gc": false,
                "timer": "perf_counter",
                "min_rounds": 5,
                "max_time": 1.0,
                "min_time": 5e-06,
                "warmup": false
            },
            "stats": {
                "min": 0.3549924840000074,
                "max": 0.36288642499999924,
                "mean": 0.359639152799997,
                "stddev": 0.002979788593388999,
                "rounds": 5,
                "median": 0.36044467499999655,
                "iqr": 0.003668897750010558,
                "q1": 0.35785248224998867,
                "q3": 0.3615213799999992,
                "iqr_outliers": 0,
                "stddev_outliers": 2,
                "outliers": "2;0",
                "ld15iqr": 0.3549924840000074,
                "hd15iqr": 0.36288642499999924,
                "ops": 2.780564886260094,
                "total": 1.7981957639999848,
                "iterations": 1
            }
        },
        {
            "group": null,
            "name": "test_cavity_eigenmodes",
            "fullname": "tests/benchmarks/test_benchmarks.py::test_cavity_eigenmodes",
            "params": null,
            "param": null,
            "extra_info": {},
            "options": {
                "disable_gc": false,
                "timer": "perf_counter",
                "min_rounds": 5,
                "max_time": 1.0,
                "min_time": 5e-06,
                "warmup": false
            },
            "stats": {
                "min": 0.2934810090000042,
                "max": 1.1940449249999858,
                "mean": 0.4826936927999895,
                "stddev": 0.39772144915667546,
                "rounds": 5,
                "median": 0.30789575000000013,
                "iqr": 0.2309813804999976,
                "q1": 0.30221759399998405,
                "q3": 0.5331989744999817,
                "iqr_outliers": 1,
                "stddev_outliers": 1,
                "outliers": "1;1",
                "ld15iqr": 0.2934810090000042,
                "hd15iqr": 1.1940449249999858,
                "ops": 2.071707202551667,
                "total": 2.4134684639999477,
                "iterations": 1
            }
        },
        {
            "group": null,
            "name": "test_coupled_cavity_commands",
            "fullname": "tests/benchmarks/test_benchmarks.py::test_coupled_cavity_commands",
            "params": null,
            "param": null,
            "extra_info": {},
            "options": {
                "disable_gc": false,
                "timer": "perf_counter",
                "min_rounds": 5,
                "max_time": 1.0,
                "min_time": 5e-06,
                "warmup": false
            },
            "stats": {
                "min": 6.239080123999997,
                "max": 7.599891635000006,
                "mean": 6.8338249430000015,
                "stddev": 0.686984533746242,
                "rounds": 5,
                "median": 6.435161192999999,
                "iqr": 1.2663459720000105,
                "q1": 6.307320394999998,
                "q3": 7.573666367000008,
                "iqr_outliers": 0,
                "stddev_outliers": 2,
                "outliers": "2;0",
                "ld15iqr": 6.239080123999997,
                "hd15iqr": 7.599891635000006,
                "ops": 0.1463309359459546,
                "total": 34.16912471500001,
                "iterations": 1
            }
        },
        {
            "group": null,
            "name": "test_frequency_dependant_squeezing",
            "fullname": "tests/benchmarks/test_benchmarks.py::test_frequency_dependant_squeezing",
            "params": null,
            "param": null,
            "extra_info": {},
            "options": {
                "disable_gc": false,
                "timer": "perf_counter",
                "min_rounds": 5,
                "max_time": 1.0,
                "min_time": 5e-06,
                "warmup": false
            },
            "stats": {
                "min": 1.7293915200000356,
                "max": 3.2585943359999874,
                "mean": 2.0696833304000166,
                "stddev": 0.6653114882400146,
                "rounds": 5,
                "median": 1.795018070000026,
                "iqr": 0.4174315425000117,
                "q1": 1.7518122330000097,
                "q3": 2.1692437755000213,
                "iqr_outliers": 1,
                "stddev_outliers": 1,
                "outliers": "1;1",
                "ld15iqr": 1.7293915200000356,
                "hd15iqr": 3.2585943359999874,
                "ops": 0.48316570236217043,
                "total": 10.348416652000083,
                "iterations": 1
            }
        },
        {
            "group": null,
            "name": "test_lock_actions",
            "fullname": "tests/benchmarks/test_benchmarks.py::test_lock_actions",
            "params": null,
            "param": null,
            "extra_info": {},
            "options": {
                "disable_gc": false,
                "timer": "perf_counter",
                "min_rounds": 5,
                "max_time": 1.0,
                "min_time": 5e-06,
                "warmup": false
            },
            "stats": {
                "min": 3.2129696379999473,
                "max": 4.9005856809999955,
                "mean": 3.5707787475999795,
                "stddev": 0.7440541392685972,
                "rounds": 5,
                "median": 3.2292191799999728,
                "iqr": 0.4766414130000385,
                "q1": 3.2175434229999667,
                "q3": 3.694184836000005,
                "iqr_outliers": 1,
                "stddev_outliers": 1,
                "outliers": "1;1",
                "ld15iqr": 3.2129696379999473,
                "hd15iqr": 4.9005856809999955,
                "ops": 0.28005095545954173,
                "total": 17.853893737999897,
                "iterations": 1
            }
        }
    ],
    "datetime": "2024-10-15T21:45:43.304515",
    "version": "4.0.0"
}