{
    "machine_info": {
        "node": "runner-jhcjxvh-project-39604133-concurrent-0",
        "processor": "",
        "machine": "x86_64",
        "python_compiler": "GCC 12.2.0",
        "python_implementation": "CPython",
        "python_implementation_version": "3.12.2",
        "python_version": "3.12.2",
        "python_build": [
            "main",
            "Mar 12 2024 11:02:14"
        ],
        "release": "5.4.109+",
        "system": "Linux",
        "cpu": {
            "python_version": "3.12.2.final.0 (64 bit)",
            "cpuinfo_version": [
                9,
                0,
                0
            ],
            "cpuinfo_version_string": "9.0.0",
            "arch": "X86_64",
            "bits": 64,
            "count": 2,
            "arch_string_raw": "x86_64",
            "vendor_id_raw": "AuthenticAMD",
            "brand_raw": "AMD EPYC 7B12",
            "hz_advertised_friendly": "2.2500 GHz",
            "hz_actual_friendly": "2.2500 GHz",
            "hz_advertised": [
                2249998000,
                0
            ],
            "hz_actual": [
                2249998000,
                0
            ],
            "model": 49,
            "family": 23,
            "flags": [
                "3dnowext",
                "3dnowprefetch",
                "abm",
                "adx",
                "aes",
                "apic",
                "arat",
                "avx",
                "avx2",
                "bmi1",
                "bmi2",
                "clflush",
                "clflushopt",
                "clwb",
                "clzero",
                "cmov",
                "cmp_legacy",
                "constant_tsc",
                "cpuid",
                "cr8_legacy",
                "cx16",
                "cx8",
                "de",
                "extd_apicid",
                "f16c",
                "fma",
                "fpu",
                "fsgsbase",
                "fxsr",
                "fxsr_opt",
                "ht",
                "hypervisor",
                "ibpb",
                "ibrs",
                "lahf_lm",
                "lm",
                "mca",
                "mce",
                "misalignsse",
                "mmx",
                "mmxext",
                "movbe",
                "msr",
                "mtrr",
                "nonstop_tsc",
                "nopl",
                "npt",
                "nrip_save",
                "nx",
                "osvw",
                "osxsave",
                "pae",
                "pat",
                "pclmulqdq",
                "pdpe1gb",
                "pge",
                "pni",
                "popcnt",
                "pse",
                "pse36",
                "rdpid",
                "rdrand",
                "rdrnd",
                "rdseed",
                "rdtscp",
                "rep_good",
                "sep",
                "sha",
                "sha_ni",
                "smap",
                "smep",
                "ssbd",
                "sse",
                "sse2",
                "sse4_1",
                "sse4_2",
                "sse4a",
                "ssse3",
                "stibp",
                "syscall",
                "topoext",
                "tsc",
                "tsc_adjust",
                "tsc_known_freq",
                "umip",
                "vme",
                "vmmcall",
                "x2apic",
                "xgetbv1",
                "xsave",
                "xsavec",
                "xsaveerptr",
                "xsaveopt"
            ],
            "l3_cache_size": 524288,
            "l2_cache_size": 524288,
            "l1_data_cache_size": 32768,
            "l1_instruction_cache_size": 32768,
            "l2_cache_line_size": 512,
            "l2_cache_associativity": 6
        }
    },
    "commit_info": {
        "id": "abcb74a9032cf503e2aba6044543b965428bcd99",
        "time": "2024-03-25T17:21:19+01:00",
        "author_time": "2024-03-25T17:21:19+01:00",
        "dirty": false,
        "project": "finesse3",
        "branch": "(detached head)"
    },
    "benchmarks": [
        {
            "group": null,
            "name": "test_01_simple_cav",
            "fullname": "tests/benchmarks/test_benchmarks.py::test_01_simple_cav",
            "params": null,
            "param": null,
            "extra_info": {},
            "options": {
                "disable_gc": false,
                "timer": "perf_counter",
                "min_rounds": 5,
                "max_time": 1.0,
                "min_time": 5e-06,
                "warmup": false
            },
            "stats": {
                "min": 0.3784506750000105,
                "max": 0.5769226430000032,
                "mean": 0.42831016600000565,
                "stddev": 0.08398973406453182,
                "rounds": 5,
                "median": 0.38788981600001193,
                "iqr": 0.06830222600000724,
                "q1": 0.3846284377499991,
                "q3": 0.45293066375000635,
                "iqr_outliers": 1,
                "stddev_outliers": 1,
                "outliers": "1;1",
                "ld15iqr": 0.3784506750000105,
                "hd15iqr": 0.5769226430000032,
                "ops": 2.334756630548869,
                "total": 2.1415508300000283,
                "iterations": 1
            }
        },
        {
            "group": null,
            "name": "test_02_pdh_lock",
            "fullname": "tests/benchmarks/test_benchmarks.py::test_02_pdh_lock",
            "params": null,
            "param": null,
            "extra_info": {},
            "options": {
                "disable_gc": false,
                "timer": "perf_counter",
                "min_rounds": 5,
                "max_time": 1.0,
                "min_time": 5e-06,
                "warmup": false
            },
            "stats": {
                "min": 1.326235349000001,
                "max": 1.6283971350000002,
                "mean": 1.3898255402000017,
                "stddev": 0.1334061630808393,
                "rounds": 5,
                "median": 1.3330601609999917,
                "iqr": 0.08014872400001138,
                "q1": 1.3272928445000005,
                "q3": 1.407441568500012,
                "iqr_outliers": 1,
                "stddev_outliers": 1,
                "outliers": "1;1",
                "ld15iqr": 1.326235349000001,
                "hd15iqr": 1.6283971350000002,
                "ops": 0.7195147671959574,
                "total": 6.949127701000009,
                "iterations": 1
            }
        },
        {
            "group": null,
            "name": "test_03_near_unstable",
            "fullname": "tests/benchmarks/test_benchmarks.py::test_03_near_unstable",
            "params": null,
            "param": null,
            "extra_info": {},
            "options": {
                "disable_gc": false,
                "timer": "perf_counter",
                "min_rounds": 5,
                "max_time": 1.0,
                "min_time": 5e-06,
                "warmup": false
            },
            "stats": {
                "min": 1.7999999784024112e-06,
                "max": 0.00013422000000673506,
                "mean": 2.6634491883838913e-06,
                "stddev": 1.3596981813136387e-06,
                "rounds": 49162,
                "median": 3.1199999739328632e-06,
                "iqr": 1.2900000001536682e-06,
                "q1": 1.889999992954472e-06,
                "q3": 3.17999999310814e-06,
                "iqr_outliers": 339,
                "stddev_outliers": 598,
                "outliers": "598;339",
                "ld15iqr": 1.7999999784024112e-06,
                "hd15iqr": 5.119999997305058e-06,
                "ops": 375453.0044580174,
                "total": 0.13094048899932886,
                "iterations": 1
            }
        },
        {
            "group": null,
            "name": "test_04_geometrical_params",
            "fullname": "tests/benchmarks/test_benchmarks.py::test_04_geometrical_params",
            "params": null,
            "param": null,
            "extra_info": {},
            "options": {
                "disable_gc": false,
                "timer": "perf_counter",
                "min_rounds": 5,
                "max_time": 1.0,
                "min_time": 5e-06,
                "warmup": false
            },
            "stats": {
                "min": 0.5152808809999954,
                "max": 1.0720933800000125,
                "mean": 0.7254694716000017,
                "stddev": 0.27681213455341974,
                "rounds": 5,
                "median": 0.5380874359999837,
                "iqr": 0.4841422105000035,
                "q1": 0.5195578002500056,
                "q3": 1.0037000107500091,
                "iqr_outliers": 0,
                "stddev_outliers": 1,
                "outliers": "1;0",
                "ld15iqr": 0.5152808809999954,
                "hd15iqr": 1.0720933800000125,
                "ops": 1.378417754498379,
                "total": 3.6273473580000086,
                "iterations": 1
            }
        },
        {
            "group": null,
            "name": "test_05_modulation",
            "fullname": "tests/benchmarks/test_benchmarks.py::test_05_modulation",
            "params": null,
            "param": null,
            "extra_info": {},
            "options": {
                "disable_gc": false,
                "timer": "perf_counter",
                "min_rounds": 5,
                "max_time": 1.0,
                "min_time": 5e-06,
                "warmup": false
            },
            "stats": {
                "min": 0.17287155400001097,
                "max": 0.17762220000000184,
                "mean": 0.17529280187499907,
                "stddev": 0.0018685030187401523,
                "rounds": 8,
                "median": 0.17487095599999236,
                "iqr": 0.0033847414999854664,
                "q1": 0.17383431650000603,
                "q3": 0.1772190579999915,
                "iqr_outliers": 0,
                "stddev_outliers": 3,
                "outliers": "3;0",
                "ld15iqr": 0.17287155400001097,
                "hd15iqr": 0.17762220000000184,
                "ops": 5.7047408068307215,
                "total": 1.4023424149999926,
                "iterations": 1
            }
        },
        {
            "group": null,
            "name": "test_06_radiation_pressure",
            "fullname": "tests/benchmarks/test_benchmarks.py::test_06_radiation_pressure",
            "params": null,
            "param": null,
            "extra_info": {},
            "options": {
                "disable_gc": false,
                "timer": "perf_counter",
                "min_rounds": 5,
                "max_time": 1.0,
                "min_time": 5e-06,
                "warmup": false
            },
            "stats": {
                "min": 0.24123886700002117,
                "max": 0.7575121099999933,
                "mean": 0.3474123469999995,
                "stddev": 0.22929777671863338,
                "rounds": 5,
                "median": 0.24374603399999728,
                "iqr": 0.1370427487499981,
                "q1": 0.2417842692499974,
                "q3": 0.3788270179999955,
                "iqr_outliers": 1,
                "stddev_outliers": 1,
                "outliers": "1;1",
                "ld15iqr": 0.24123886700002117,
                "hd15iqr": 0.7575121099999933,
                "ops": 2.8784238920558614,
                "total": 1.7370617349999975,
                "iterations": 1
            }
        },
        {
            "group": null,
            "name": "test_07_homodyne",
            "fullname": "tests/benchmarks/test_benchmarks.py::test_07_homodyne",
            "params": null,
            "param": null,
            "extra_info": {},
            "options": {
                "disable_gc": false,
                "timer": "perf_counter",
                "min_rounds": 5,
                "max_time": 1.0,
                "min_time": 5e-06,
                "warmup": false
            },
            "stats": {
                "min": 0.11350698699999384,
                "max": 0.1420965810000041,
                "mean": 0.11868252000000439,
                "stddev": 0.008543459235397965,
                "rounds": 10,
                "median": 0.11593045450000261,
                "iqr": 0.0047438960000363295,
                "q1": 0.11438659799998163,
                "q3": 0.11913049400001796,
                "iqr_outliers": 1,
                "stddev_outliers": 1,
                "outliers": "1;1",
                "ld15iqr": 0.11350698699999384,
                "hd15iqr": 0.1420965810000041,
                "ops": 8.42584063769427,
                "total": 1.1868252000000439,
                "iterations": 1
            }
        },
        {
            "group": null,
            "name": "test_08_optical_spring",
            "fullname": "tests/benchmarks/test_benchmarks.py::test_08_optical_spring",
            "params": null,
            "param": null,
            "extra_info": {},
            "options": {
                "disable_gc": false,
                "timer": "perf_counter",
                "min_rounds": 5,
                "max_time": 1.0,
                "min_time": 5e-06,
                "warmup": false
            },
            "stats": {
                "min": 0.29861488000000236,
                "max": 0.9401982250000174,
                "mean": 0.4343898462000027,
                "stddev": 0.28289995956521446,
                "rounds": 5,
                "median": 0.30647895999999264,
                "iqr": 0.17461569675000277,
                "q1": 0.3025402270000015,
                "q3": 0.47715592375000426,
                "iqr_outliers": 1,
                "stddev_outliers": 1,
                "outliers": "1;1",
                "ld15iqr": 0.29861488000000236,
                "hd15iqr": 0.9401982250000174,
                "ops": 2.302079592209386,
                "total": 2.1719492310000135,
                "iterations": 1
            }
        },
        {
            "group": null,
            "name": "test_09_aligo_sensitivity",
            "fullname": "tests/benchmarks/test_benchmarks.py::test_09_aligo_sensitivity",
            "params": null,
            "param": null,
            "extra_info": {},
            "options": {
                "disable_gc": false,
                "timer": "perf_counter",
                "min_rounds": 5,
                "max_time": 1.0,
                "min_time": 5e-06,
                "warmup": false
            },
            "stats": {
                "min": 0.33224207099999603,
                "max": 0.3426699529999837,
                "mean": 0.3370817725999927,
                "stddev": 0.003826991959357201,
                "rounds": 5,
                "median": 0.3362327559999869,
                "iqr": 0.0045064452500085395,
                "q1": 0.3349598114999921,
                "q3": 0.33946625675000064,
                "iqr_outliers": 0,
                "stddev_outliers": 2,
                "outliers": "2;0",
                "ld15iqr": 0.33224207099999603,
                "hd15iqr": 0.3426699529999837,
                "ops": 2.9666391994048196,
                "total": 1.6854088629999637,
                "iterations": 1
            }
        },
        {
            "group": null,
            "name": "test_10_shifted_beam",
            "fullname": "tests/benchmarks/test_benchmarks.py::test_10_shifted_beam",
            "params": null,
            "param": null,
            "extra_info": {},
            "options": {
                "disable_gc": false,
                "timer": "perf_counter",
                "min_rounds": 5,
                "max_time": 1.0,
                "min_time": 5e-06,
                "warmup": false
            },
            "stats": {
                "min": 0.7365507789999981,
                "max": 1.4745937180000226,
                "mean": 0.8922289782000064,
                "stddev": 0.32570481054457073,
                "rounds": 5,
                "median": 0.7455446489999815,
                "iqr": 0.2007076424999923,
                "q1": 0.7402101452500176,
                "q3": 0.9409177877500099,
                "iqr_outliers": 1,
                "stddev_outliers": 1,
                "outliers": "1;1",
                "ld15iqr": 0.7365507789999981,
                "hd15iqr": 1.4745937180000226,
                "ops": 1.1207885245079263,
                "total": 4.461144891000032,
                "iterations": 1
            }
        },
        {
            "group": null,
            "name": "test_angular_radiation_pressure",
            "fullname": "tests/benchmarks/test_benchmarks.py::test_angular_radiation_pressure",
            "params": null,
            "param": null,
            "extra_info": {},
            "options": {
                "disable_gc": false,
                "timer": "perf_counter",
                "min_rounds": 5,
                "max_time": 1.0,
                "min_time": 5e-06,
                "warmup": false
            },
            "stats": {
                "min": 0.3366295460000117,
                "max": 0.3519399049999947,
                "mean": 0.34199424680000445,
                "stddev": 0.006340315572936449,
                "rounds": 5,
                "median": 0.3403342109999983,
                "iqr": 0.009244299750001517,
                "q1": 0.33684937100000667,
                "q3": 0.3460936707500082,
                "iqr_outliers": 0,
                "stddev_outliers": 1,
                "outliers": "1;0",
                "ld15iqr": 0.3366295460000117,
                "hd15iqr": 0.3519399049999947,
                "ops": 2.9240257967988335,
                "total": 1.7099712340000224,
                "iterations": 1
            }
        },
        {
            "group": null,
            "name": "test_cavity_eigenmodes",
            "fullname": "tests/benchmarks/test_benchmarks.py::test_cavity_eigenmodes",
            "params": null,
            "param": null,
            "extra_info": {},
            "options": {
                "disable_gc": false,
                "timer": "perf_counter",
                "min_rounds": 5,
                "max_time": 1.0,
                "min_time": 5e-06,
                "warmup": false
            },
            "stats": {
                "min": 0.26142537600000537,
                "max": 0.36300248800000645,
                "mean": 0.2842723989999968,
                "stddev": 0.04412102263225747,
                "rounds": 5,
                "median": 0.2643795589999911,
                "iqr": 0.03046684149999379,
                "q1": 0.2625280267499974,
                "q3": 0.2929948682499912,
                "iqr_outliers": 1,
                "stddev_outliers": 1,
                "outliers": "1;1",
                "ld15iqr": 0.26142537600000537,
                "hd15iqr": 0.36300248800000645,
                "ops": 3.5177527031036573,
                "total": 1.4213619949999838,
                "iterations": 1
            }
        },
        {
            "group": null,
            "name": "test_coupled_cavity_commands",
            "fullname": "tests/benchmarks/test_benchmarks.py::test_coupled_cavity_commands",
            "params": null,
            "param": null,
            "extra_info": {},
            "options": {
                "disable_gc": false,
                "timer": "perf_counter",
                "min_rounds": 5,
                "max_time": 1.0,
                "min_time": 5e-06,
                "warmup": false
            },
            "stats": {
                "min": 4.505955516,
                "max": 5.649998305999986,
                "mean": 4.824017773800006,
                "stddev": 0.46860546199636643,
                "rounds": 5,
                "median": 4.66575776900001,
                "iqr": 0.3853974124999908,
                "q1": 4.563687000750015,
                "q3": 4.949084413250006,
                "iqr_outliers": 1,
                "stddev_outliers": 1,
                "outliers": "1;1",
                "ld15iqr": 4.505955516,
                "hd15iqr": 5.649998305999986,
                "ops": 0.20729608531526486,
                "total": 24.12008886900003,
                "iterations": 1
            }
        },
        {
            "group": null,
            "name": "test_frequency_dependant_squeezing",
            "fullname": "tests/benchmarks/test_benchmarks.py::test_frequency_dependant_squeezing",
            "params": null,
            "param": null,
            "extra_info": {},
            "options": {
                "disable_gc": false,
                "timer": "perf_counter",
                "min_rounds": 5,
                "max_time": 1.0,
                "min_time": 5e-06,
                "warmup": false
            },
            "stats": {
                "min": 1.5657707689999825,
                "max": 1.711813826000025,
                "mean": 1.6182028623999998,
                "stddev": 0.0589350833930811,
                "rounds": 5,
                "median": 1.606275568000001,
                "iqr": 0.0816499439999987,
                "q1": 1.571555908249998,
                "q3": 1.6532058522499966,
                "iqr_outliers": 0,
                "stddev_outliers": 1,
                "outliers": "1;0",
                "ld15iqr": 1.5657707689999825,
                "hd15iqr": 1.711813826000025,
                "ops": 0.6179694914869162,
                "total": 8.091014311999999,
                "iterations": 1
            }
        },
        {
            "group": null,
            "name": "test_lock_actions",
            "fullname": "tests/benchmarks/test_benchmarks.py::test_lock_actions",
            "params": null,
            "param": null,
            "extra_info": {},
            "options": {
                "disable_gc": false,
                "timer": "perf_counter",
                "min_rounds": 5,
                "max_time": 1.0,
                "min_time": 5e-06,
                "warmup": false
            },
            "stats": {
                "min": 5.335422850000015,
                "max": 5.65788354,
                "mean": 5.514428103,
                "stddev": 0.12485195802996439,
                "rounds": 5,
                "median": 5.565327878000005,
                "iqr": 0.16949004574998128,
                "q1": 5.419483118500004,
                "q3": 5.588973164249985,
                "iqr_outliers": 0,
                "stddev_outliers": 2,
                "outliers": "2;0",
                "ld15iqr": 5.335422850000015,
                "hd15iqr": 5.65788354,
                "ops": 0.18134246767239065,
                "total": 27.572140515,
                "iterations": 1
            }
        }
    ],
    "datetime": "2024-03-25T16:34:06.952627",
    "version": "4.0.0"
}