{
    "machine_info": {
        "node": "runner-nn8vmrs9z-project-39604133-concurrent-0",
        "processor": "",
        "machine": "x86_64",
        "python_compiler": "GCC 12.2.0",
        "python_implementation": "CPython",
        "python_implementation_version": "3.12.2",
        "python_version": "3.12.2",
        "python_build": [
            "main",
            "Feb 13 2024 09:17:46"
        ],
        "release": "5.4.109+",
        "system": "Linux",
        "cpu": {
            "python_version": "3.12.2.final.0 (64 bit)",
            "cpuinfo_version": [
                9,
                0,
                0
            ],
            "cpuinfo_version_string": "9.0.0",
            "arch": "X86_64",
            "bits": 64,
            "count": 2,
            "arch_string_raw": "x86_64",
            "vendor_id_raw": "AuthenticAMD",
            "brand_raw": "AMD EPYC 7B12",
            "hz_advertised_friendly": "2.2500 GHz",
            "hz_actual_friendly": "2.2500 GHz",
            "hz_advertised": [
                2249998000,
                0
            ],
            "hz_actual": [
                2249998000,
                0
            ],
            "model": 49,
            "family": 23,
            "flags": [
                "3dnowext",
                "3dnowprefetch",
                "abm",
                "adx",
                "aes",
                "apic",
                "arat",
                "avx",
                "avx2",
                "bmi1",
                "bmi2",
                "clflush",
                "clflushopt",
                "clwb",
                "clzero",
                "cmov",
                "cmp_legacy",
                "constant_tsc",
                "cpuid",
                "cr8_legacy",
                "cx16",
                "cx8",
                "de",
                "extd_apicid",
                "f16c",
                "fma",
                "fpu",
                "fsgsbase",
                "fxsr",
                "fxsr_opt",
                "ht",
                "hypervisor",
                "ibpb",
                "ibrs",
                "lahf_lm",
                "lm",
                "mca",
                "mce",
                "misalignsse",
                "mmx",
                "mmxext",
                "movbe",
                "msr",
                "mtrr",
                "nonstop_tsc",
                "nopl",
                "npt",
                "nrip_save",
                "nx",
                "osvw",
                "osxsave",
                "pae",
                "pat",
                "pclmulqdq",
                "pdpe1gb",
                "pge",
                "pni",
                "popcnt",
                "pse",
                "pse36",
                "rdpid",
                "rdrand",
                "rdrnd",
                "rdseed",
                "rdtscp",
                "rep_good",
                "sep",
                "sha",
                "sha_ni",
                "smap",
                "smep",
                "ssbd",
                "sse",
                "sse2",
                "sse4_1",
                "sse4_2",
                "sse4a",
                "ssse3",
                "stibp",
                "syscall",
                "topoext",
                "tsc",
                "tsc_adjust",
                "tsc_known_freq",
                "umip",
                "vme",
                "vmmcall",
                "x2apic",
                "xgetbv1",
                "xsave",
                "xsavec",
                "xsaveerptr",
                "xsaveopt"
            ],
            "l3_cache_size": 524288,
            "l2_cache_size": 524288,
            "l1_data_cache_size": 32768,
            "l1_instruction_cache_size": 32768,
            "l2_cache_line_size": 512,
            "l2_cache_associativity": 6
        }
    },
    "commit_info": {
        "id": "4d0b1520867714ae3e44de92c184ea75c6ced845",
        "time": "2024-02-26T10:48:18+01:00",
        "author_time": "2024-02-26T10:48:18+01:00",
        "dirty": false,
        "project": "finesse3",
        "branch": "(detached head)"
    },
    "benchmarks": [
        {
            "group": null,
            "name": "test_01_simple_cav",
            "fullname": "tests/benchmarks/test_benchmarks.py::test_01_simple_cav",
            "params": null,
            "param": null,
            "extra_info": {},
            "options": {
                "disable_gc": false,
                "timer": "perf_counter",
                "min_rounds": 5,
                "max_time": 1.0,
                "min_time": 5e-06,
                "warmup": false
            },
            "stats": {
                "min": 0.3732132079999815,
                "max": 0.5639697000000297,
                "mean": 0.41789472039999964,
                "stddev": 0.08192482472092248,
                "rounds": 5,
                "median": 0.38582389600003353,
                "iqr": 0.0572361385000022,
                "q1": 0.37595484349998287,
                "q3": 0.43319098199998507,
                "iqr_outliers": 1,
                "stddev_outliers": 1,
                "outliers": "1;1",
                "ld15iqr": 0.3732132079999815,
                "hd15iqr": 0.5639697000000297,
                "ops": 2.3929471974252796,
                "total": 2.089473601999998,
                "iterations": 1
            }
        },
        {
            "group": null,
            "name": "test_02_pdh_lock",
            "fullname": "tests/benchmarks/test_benchmarks.py::test_02_pdh_lock",
            "params": null,
            "param": null,
            "extra_info": {},
            "options": {
                "disable_gc": false,
                "timer": "perf_counter",
                "min_rounds": 5,
                "max_time": 1.0,
                "min_time": 5e-06,
                "warmup": false
            },
            "stats": {
                "min": 1.3751499449999756,
                "max": 1.6863427340000499,
                "mean": 1.448064775599994,
                "stddev": 0.13344648051406435,
                "rounds": 5,
                "median": 1.392186191999997,
                "iqr": 0.08289001250003025,
                "q1": 1.3862334562499683,
                "q3": 1.4691234687499986,
                "iqr_outliers": 1,
                "stddev_outliers": 1,
                "outliers": "1;1",
                "ld15iqr": 1.3751499449999756,
                "hd15iqr": 1.6863427340000499,
                "ops": 0.690576842175902,
                "total": 7.24032387799997,
                "iterations": 1
            }
        },
        {
            "group": null,
            "name": "test_03_near_unstable",
            "fullname": "tests/benchmarks/test_benchmarks.py::test_03_near_unstable",
            "params": null,
            "param": null,
            "extra_info": {},
            "options": {
                "disable_gc": false,
                "timer": "perf_counter",
                "min_rounds": 5,
                "max_time": 1.0,
                "min_time": 5e-06,
                "warmup": false
            },
            "stats": {
                "min": 1.7599999750927964e-06,
                "max": 0.0001041960000520703,
                "mean": 2.724648754129656e-06,
                "stddev": 1.4932868687023125e-06,
                "rounds": 45350,
                "median": 3.110000022843451e-06,
                "iqr": 1.3009999406676798e-06,
                "q1": 1.8700000055105193e-06,
                "q3": 3.170999946178199e-06,
                "iqr_outliers": 433,
                "stddev_outliers": 460,
                "outliers": "460;433",
                "ld15iqr": 1.7599999750927964e-06,
                "hd15iqr": 5.169999951704085e-06,
                "ops": 367019.7850215866,
                "total": 0.12356282099977989,
                "iterations": 1
            }
        },
        {
            "group": null,
            "name": "test_04_geometrical_params",
            "fullname": "tests/benchmarks/test_benchmarks.py::test_04_geometrical_params",
            "params": null,
            "param": null,
            "extra_info": {},
            "options": {
                "disable_gc": false,
                "timer": "perf_counter",
                "min_rounds": 5,
                "max_time": 1.0,
                "min_time": 5e-06,
                "warmup": false
            },
            "stats": {
                "min": 0.540717710000024,
                "max": 0.9745040610000046,
                "mean": 0.6393098984000176,
                "stddev": 0.18798581370878129,
                "rounds": 5,
                "median": 0.5506524810000428,
                "iqr": 0.1315676357499882,
                "q1": 0.5476221185000156,
                "q3": 0.6791897542500038,
                "iqr_outliers": 1,
                "stddev_outliers": 1,
                "outliers": "1;1",
                "ld15iqr": 0.540717710000024,
                "hd15iqr": 0.9745040610000046,
                "ops": 1.5641866370326365,
                "total": 3.196549492000088,
                "iterations": 1
            }
        },
        {
            "group": null,
            "name": "test_05_modulation",
            "fullname": "tests/benchmarks/test_benchmarks.py::test_05_modulation",
            "params": null,
            "param": null,
            "extra_info": {},
            "options": {
                "disable_gc": false,
                "timer": "perf_counter",
                "min_rounds": 5,
                "max_time": 1.0,
                "min_time": 5e-06,
                "warmup": false
            },
            "stats": {
                "min": 0.17643317299996397,
                "max": 0.18087342299998,
                "mean": 0.17877101171427512,
                "stddev": 0.0016491114508869983,
                "rounds": 7,
                "median": 0.179221186999996,
                "iqr": 0.0025998892499927706,
                "q1": 0.17737726149999844,
                "q3": 0.1799771507499912,
                "iqr_outliers": 0,
                "stddev_outliers": 2,
                "outliers": "2;0",
                "ld15iqr": 0.17643317299996397,
                "hd15iqr": 0.18087342299998,
                "ops": 5.593748060218359,
                "total": 1.2513970819999258,
                "iterations": 1
            }
        },
        {
            "group": null,
            "name": "test_06_radiation_pressure",
            "fullname": "tests/benchmarks/test_benchmarks.py::test_06_radiation_pressure",
            "params": null,
            "param": null,
            "extra_info": {},
            "options": {
                "disable_gc": false,
                "timer": "perf_counter",
                "min_rounds": 5,
                "max_time": 1.0,
                "min_time": 5e-06,
                "warmup": false
            },
            "stats": {
                "min": 0.24074450699998806,
                "max": 0.7572329489999561,
                "mean": 0.3515743579999935,
                "stddev": 0.22689555212190718,
                "rounds": 5,
                "median": 0.2519231310000123,
                "iqr": 0.14007930675001035,
                "q1": 0.24519672974999196,
                "q3": 0.3852760365000023,
                "iqr_outliers": 1,
                "stddev_outliers": 1,
                "outliers": "1;1",
                "ld15iqr": 0.24074450699998806,
                "hd15iqr": 0.7572329489999561,
                "ops": 2.844348506212784,
                "total": 1.7578717899999674,
                "iterations": 1
            }
        },
        {
            "group": null,
            "name": "test_07_homodyne",
            "fullname": "tests/benchmarks/test_benchmarks.py::test_07_homodyne",
            "params": null,
            "param": null,
            "extra_info": {},
            "options": {
                "disable_gc": false,
                "timer": "perf_counter",
                "min_rounds": 5,
                "max_time": 1.0,
                "min_time": 5e-06,
                "warmup": false
            },
            "stats": {
                "min": 0.11540477300002294,
                "max": 0.1232252410000001,
                "mean": 0.11947400555556618,
                "stddev": 0.0025179362841704646,
                "rounds": 9,
                "median": 0.11973643699997183,
                "iqr": 0.003606523750036672,
                "q1": 0.11785573599999566,
                "q3": 0.12146225975003233,
                "iqr_outliers": 0,
                "stddev_outliers": 4,
                "outliers": "4;0",
                "ld15iqr": 0.11540477300002294,
                "hd15iqr": 0.1232252410000001,
                "ops": 8.37002154024969,
                "total": 1.0752660500000957,
                "iterations": 1
            }
        },
        {
            "group": null,
            "name": "test_08_optical_spring",
            "fullname": "tests/benchmarks/test_benchmarks.py::test_08_optical_spring",
            "params": null,
            "param": null,
            "extra_info": {},
            "options": {
                "disable_gc": false,
                "timer": "perf_counter",
                "min_rounds": 5,
                "max_time": 1.0,
                "min_time": 5e-06,
                "warmup": false
            },
            "stats": {
                "min": 0.30809967800001914,
                "max": 0.8976914179999653,
                "mean": 0.42901245740000604,
                "stddev": 0.2620182214569184,
                "rounds": 5,
                "median": 0.31151810800002977,
                "iqr": 0.15175113674999352,
                "q1": 0.3102557247500073,
                "q3": 0.4620068615000008,
                "iqr_outliers": 1,
                "stddev_outliers": 1,
                "outliers": "1;1",
                "ld15iqr": 0.30809967800001914,
                "hd15iqr": 0.8976914179999653,
                "ops": 2.330934644789608,
                "total": 2.14506228700003,
                "iterations": 1
            }
        },
        {
            "group": null,
            "name": "test_09_aligo_sensitivity",
            "fullname": "tests/benchmarks/test_benchmarks.py::test_09_aligo_sensitivity",
            "params": null,
            "param": null,
            "extra_info": {},
            "options": {
                "disable_gc": false,
                "timer": "perf_counter",
                "min_rounds": 5,
                "max_time": 1.0,
                "min_time": 5e-06,
                "warmup": false
            },
            "stats": {
                "min": 0.333537616000001,
                "max": 0.3406660940000279,
                "mean": 0.3370995109999967,
                "stddev": 0.0026332399502429485,
                "rounds": 5,
                "median": 0.33680454799997506,
                "iqr": 0.0033549992499928294,
                "q1": 0.33553145049999955,
                "q3": 0.3388864497499924,
                "iqr_outliers": 0,
                "stddev_outliers": 2,
                "outliers": "2;0",
                "ld15iqr": 0.333537616000001,
                "hd15iqr": 0.3406660940000279,
                "ops": 2.966483092881169,
                "total": 1.6854975549999835,
                "iterations": 1
            }
        },
        {
            "group": null,
            "name": "test_10_shifted_beam",
            "fullname": "tests/benchmarks/test_benchmarks.py::test_10_shifted_beam",
            "params": null,
            "param": null,
            "extra_info": {},
            "options": {
                "disable_gc": false,
                "timer": "perf_counter",
                "min_rounds": 5,
                "max_time": 1.0,
                "min_time": 5e-06,
                "warmup": false
            },
            "stats": {
                "min": 0.7485578910000186,
                "max": 1.517348835000007,
                "mean": 0.9103633026000011,
                "stddev": 0.339437569529862,
                "rounds": 5,
                "median": 0.762069251000014,
                "iqr": 0.2070935699999552,
                "q1": 0.7511317567500129,
                "q3": 0.9582253267499681,
                "iqr_outliers": 1,
                "stddev_outliers": 1,
                "outliers": "1;1",
                "ld15iqr": 0.7485578910000186,
                "hd15iqr": 1.517348835000007,
                "ops": 1.0984625557115453,
                "total": 4.551816513000006,
                "iterations": 1
            }
        },
        {
            "group": null,
            "name": "test_angular_radiation_pressure",
            "fullname": "tests/benchmarks/test_benchmarks.py::test_angular_radiation_pressure",
            "params": null,
            "param": null,
            "extra_info": {},
            "options": {
                "disable_gc": false,
                "timer": "perf_counter",
                "min_rounds": 5,
                "max_time": 1.0,
                "min_time": 5e-06,
                "warmup": false
            },
            "stats": {
                "min": 0.34379752699999244,
                "max": 1.2907111040000245,
                "mean": 0.5353732388000025,
                "stddev": 0.422251822634977,
                "rounds": 5,
                "median": 0.347555347000025,
                "iqr": 0.23958598724999547,
                "q1": 0.3450714162499935,
                "q3": 0.584657403499989,
                "iqr_outliers": 1,
                "stddev_outliers": 1,
                "outliers": "1;1",
                "ld15iqr": 0.34379752699999244,
                "hd15iqr": 1.2907111040000245,
                "ops": 1.8678557827085682,
                "total": 2.676866194000013,
                "iterations": 1
            }
        },
        {
            "group": null,
            "name": "test_cavity_eigenmodes",
            "fullname": "tests/benchmarks/test_benchmarks.py::test_cavity_eigenmodes",
            "params": null,
            "param": null,
            "extra_info": {},
            "options": {
                "disable_gc": false,
                "timer": "perf_counter",
                "min_rounds": 5,
                "max_time": 1.0,
                "min_time": 5e-06,
                "warmup": false
            },
            "stats": {
                "min": 0.2796415220000199,
                "max": 0.29241403999998283,
                "mean": 0.28440693159999453,
                "stddev": 0.004916738229074737,
                "rounds": 5,
                "median": 0.28401559899998574,
                "iqr": 0.005716277249987911,
                "q1": 0.2808851180000005,
                "q3": 0.2866013952499884,
                "iqr_outliers": 0,
                "stddev_outliers": 1,
                "outliers": "1;0",
                "ld15iqr": 0.2796415220000199,
                "hd15iqr": 0.29241403999998283,
                "ops": 3.5160887056242873,
                "total": 1.4220346579999728,
                "iterations": 1
            }
        },
        {
            "group": null,
            "name": "test_coupled_cavity_commands",
            "fullname": "tests/benchmarks/test_benchmarks.py::test_coupled_cavity_commands",
            "params": null,
            "param": null,
            "extra_info": {},
            "options": {
                "disable_gc": false,
                "timer": "perf_counter",
                "min_rounds": 5,
                "max_time": 1.0,
                "min_time": 5e-06,
                "warmup": false
            },
            "stats": {
                "min": 4.539230293999992,
                "max": 5.879953666999995,
                "mean": 4.8698398289999885,
                "stddev": 0.5668092563115166,
                "rounds": 5,
                "median": 4.646226493999961,
                "iqr": 0.3767648212499921,
                "q1": 4.59543634325,
                "q3": 4.972201164499992,
                "iqr_outliers": 1,
                "stddev_outliers": 1,
                "outliers": "1;1",
                "ld15iqr": 4.539230293999992,
                "hd15iqr": 5.879953666999995,
                "ops": 0.2053455627113198,
                "total": 24.349199144999943,
                "iterations": 1
            }
        },
        {
            "group": null,
            "name": "test_frequency_dependant_squeezing",
            "fullname": "tests/benchmarks/test_benchmarks.py::test_frequency_dependant_squeezing",
            "params": null,
            "param": null,
            "extra_info": {},
            "options": {
                "disable_gc": false,
                "timer": "perf_counter",
                "min_rounds": 5,
                "max_time": 1.0,
                "min_time": 5e-06,
                "warmup": false
            },
            "stats": {
                "min": 1.58998163199999,
                "max": 3.17399816599999,
                "mean": 1.9161260707999985,
                "stddev": 0.7032248892903842,
                "rounds": 5,
                "median": 1.6019474770000102,
                "iqr": 0.4064485757499483,
                "q1": 1.5977868415000245,
                "q3": 2.004235417249973,
                "iqr_outliers": 1,
                "stddev_outliers": 1,
                "outliers": "1;1",
                "ld15iqr": 1.58998163199999,
                "hd15iqr": 3.17399816599999,
                "ops": 0.5218863284828078,
                "total": 9.580630353999993,
                "iterations": 1
            }
        },
        {
            "group": null,
            "name": "test_lock_actions",
            "fullname": "tests/benchmarks/test_benchmarks.py::test_lock_actions",
            "params": null,
            "param": null,
            "extra_info": {},
            "options": {
                "disable_gc": false,
                "timer": "perf_counter",
                "min_rounds": 5,
                "max_time": 1.0,
                "min_time": 5e-06,
                "warmup": false
            },
            "stats": {
                "min": 5.287674374999995,
                "max": 5.517115767000007,
                "mean": 5.394661603600014,
                "stddev": 0.10169360928618089,
                "rounds": 5,
                "median": 5.418275600000015,
                "iqr": 0.18107075549998797,
                "q1": 5.2914042435000255,
                "q3": 5.472474999000013,
                "iqr_outliers": 0,
                "stddev_outliers": 3,
                "outliers": "3;0",
                "ld15iqr": 5.287674374999995,
                "hd15iqr": 5.517115767000007,
                "ops": 0.18536843892722968,
                "total": 26.97330801800007,
                "iterations": 1
            }
        }
    ],
    "datetime": "2024-02-26T09:55:02.234294",
    "version": "4.0.0"
}