{
    "machine_info": {
        "node": "runner--azerasq-project-39604133-concurrent-0",
        "processor": "",
        "machine": "x86_64",
        "python_compiler": "GCC 12.2.0",
        "python_implementation": "CPython",
        "python_implementation_version": "3.12.7",
        "python_version": "3.12.7",
        "python_build": [
            "main",
            "Dec  3 2024 05:24:11"
        ],
        "release": "5.15.154+",
        "system": "Linux",
        "cpu": {
            "python_version": "3.12.7.final.0 (64 bit)",
            "cpuinfo_version": [
                9,
                0,
                0
            ],
            "cpuinfo_version_string": "9.0.0",
            "arch": "X86_64",
            "bits": 64,
            "count": 2,
            "arch_string_raw": "x86_64",
            "vendor_id_raw": "AuthenticAMD",
            "brand_raw": "AMD EPYC 7B13",
            "hz_advertised_friendly": "2.4500 GHz",
            "hz_actual_friendly": "2.4500 GHz",
            "hz_advertised": [
                2449996000,
                0
            ],
            "hz_actual": [
                2449996000,
                0
            ],
            "model": 1,
            "family": 25,
            "flags": [
                "3dnowext",
                "3dnowprefetch",
                "abm",
                "adx",
                "aes",
                "apic",
                "arat",
                "avx",
                "avx2",
                "bmi1",
                "bmi2",
                "clflush",
                "clflushopt",
                "clwb",
                "clzero",
                "cmov",
                "cmp_legacy",
                "constant_tsc",
                "cpuid",
                "cr8_legacy",
                "cx16",
                "cx8",
                "de",
                "erms",
                "extd_apicid",
                "f16c",
                "fma",
                "fpu",
                "fsgsbase",
                "fsrm",
                "fxsr",
                "fxsr_opt",
                "ht",
                "hypervisor",
                "ibpb",
                "ibrs",
                "invpcid",
                "invpcid_single",
                "lahf_lm",
                "lm",
                "mca",
                "mce",
                "misalignsse",
                "mmx",
                "mmxext",
                "movbe",
                "msr",
                "mtrr",
                "nonstop_tsc",
                "nopl",
                "npt",
                "nrip_save",
                "nx",
                "osvw",
                "osxsave",
                "pae",
                "pat",
                "pcid",
                "pclmulqdq",
                "pdpe1gb",
                "pge",
                "pni",
                "popcnt",
                "pse",
                "pse36",
                "rdpid",
                "rdrand",
                "rdrnd",
                "rdseed",
                "rdtscp",
                "rep_good",
                "sep",
                "sha",
                "sha_ni",
                "smap",
                "smep",
                "ssbd",
                "sse",
                "sse2",
                "sse4_1",
                "sse4_2",
                "sse4a",
                "ssse3",
                "stibp",
                "syscall",
                "topoext",
                "tsc",
                "tsc_adjust",
                "tsc_known_freq",
                "umip",
                "vaes",
                "vme",
                "vmmcall",
                "vpclmulqdq",
                "x2apic",
                "xgetbv1",
                "xsave",
                "xsavec",
                "xsaveerptr",
                "xsaveopt"
            ],
            "l3_cache_size": 524288,
            "l2_cache_size": 524288,
            "l1_data_cache_size": 32768,
            "l1_instruction_cache_size": 32768,
            "l2_cache_line_size": 512,
            "l2_cache_associativity": 6
        }
    },
    "commit_info": {
        "id": "38bc6ee192d74e3fd20189d054a03a0436967e48",
        "time": "2024-12-03T16:26:25+01:00",
        "author_time": "2024-12-03T16:26:25+01:00",
        "dirty": false,
        "project": "finesse3",
        "branch": "(detached head)"
    },
    "benchmarks": [
        {
            "group": null,
            "name": "test_01_simple_cav",
            "fullname": "tests/benchmarks/test_benchmarks.py::test_01_simple_cav",
            "params": null,
            "param": null,
            "extra_info": {},
            "options": {
                "disable_gc": false,
                "timer": "perf_counter",
                "min_rounds": 5,
                "max_time": 1.0,
                "min_time": 5e-06,
                "warmup": false
            },
            "stats": {
                "min": 0.25817115500001364,
                "max": 0.4676354399999809,
                "mean": 0.3062903843999948,
                "stddev": 0.09032865128184289,
                "rounds": 5,
                "median": 0.26832189900000003,
                "iqr": 0.05659998024998458,
                "q1": 0.26392211974999924,
                "q3": 0.3205220999999838,
                "iqr_outliers": 1,
                "stddev_outliers": 1,
                "outliers": "1;1",
                "ld15iqr": 0.25817115500001364,
                "hd15iqr": 0.4676354399999809,
                "ops": 3.2648755917001524,
                "total": 1.5314519219999738,
                "iterations": 1
            }
        },
        {
            "group": null,
            "name": "test_02_pdh_lock",
            "fullname": "tests/benchmarks/test_benchmarks.py::test_02_pdh_lock",
            "params": null,
            "param": null,
            "extra_info": {},
            "options": {
                "disable_gc": false,
                "timer": "perf_counter",
                "min_rounds": 5,
                "max_time": 1.0,
                "min_time": 5e-06,
                "warmup": false
            },
            "stats": {
                "min": 1.1728672360000019,
                "max": 1.4980545079999956,
                "mean": 1.296480526199997,
                "stddev": 0.16337217823553477,
                "rounds": 5,
                "median": 1.1828350699999817,
                "iqr": 0.28613764375000983,
                "q1": 1.176538577499997,
                "q3": 1.4626762212500068,
                "iqr_outliers": 0,
                "stddev_outliers": 1,
                "outliers": "1;0",
                "ld15iqr": 1.1728672360000019,
                "hd15iqr": 1.4980545079999956,
                "ops": 0.7713189514161191,
                "total": 6.482402630999985,
                "iterations": 1
            }
        },
        {
            "group": null,
            "name": "test_03_near_unstable",
            "fullname": "tests/benchmarks/test_benchmarks.py::test_03_near_unstable",
            "params": null,
            "param": null,
            "extra_info": {},
            "options": {
                "disable_gc": false,
                "timer": "perf_counter",
                "min_rounds": 5,
                "max_time": 1.0,
                "min_time": 5e-06,
                "warmup": false
            },
            "stats": {
                "min": 1.7090000028474606e-06,
                "max": 4.380000001447115e-05,
                "mean": 1.8207479828552165e-06,
                "stddev": 8.1017111005867e-07,
                "rounds": 42882,
                "median": 1.7699999830256274e-06,
                "iqr": 3.800002446041617e-08,
                "q1": 1.750999985006274e-06,
                "q3": 1.7890000094666902e-06,
                "iqr_outliers": 1577,
                "stddev_outliers": 248,
                "outliers": "248;1577",
                "ld15iqr": 1.7090000028474606e-06,
                "hd15iqr": 1.8490000002202578e-06,
                "ops": 549224.8292549769,
                "total": 0.0780773150007974,
                "iterations": 1
            }
        },
        {
            "group": null,
            "name": "test_04_geometrical_params",
            "fullname": "tests/benchmarks/test_benchmarks.py::test_04_geometrical_params",
            "params": null,
            "param": null,
            "extra_info": {},
            "options": {
                "disable_gc": false,
                "timer": "perf_counter",
                "min_rounds": 5,
                "max_time": 1.0,
                "min_time": 5e-06,
                "warmup": false
            },
            "stats": {
                "min": 0.45575563700001,
                "max": 0.8695715030000031,
                "mean": 0.5445987696000032,
                "stddev": 0.18180180931272627,
                "rounds": 5,
                "median": 0.4685978390000116,
                "iqr": 0.11460224924998386,
                "q1": 0.45676559375000636,
                "q3": 0.5713678429999902,
                "iqr_outliers": 1,
                "stddev_outliers": 1,
                "outliers": "1;1",
                "ld15iqr": 0.45575563700001,
                "hd15iqr": 0.8695715030000031,
                "ops": 1.836214210940065,
                "total": 2.7229938480000158,
                "iterations": 1
            }
        },
        {
            "group": null,
            "name": "test_05_modulation",
            "fullname": "tests/benchmarks/test_benchmarks.py::test_05_modulation",
            "params": null,
            "param": null,
            "extra_info": {},
            "options": {
                "disable_gc": false,
                "timer": "perf_counter",
                "min_rounds": 5,
                "max_time": 1.0,
                "min_time": 5e-06,
                "warmup": false
            },
            "stats": {
                "min": 0.11872602799999754,
                "max": 0.5863708569999915,
                "mean": 0.1728833682222191,
                "stddev": 0.15506274257001076,
                "rounds": 9,
                "median": 0.121406267999987,
                "iqr": 0.0013491785000070422,
                "q1": 0.12093263299999535,
                "q3": 0.12228181150000239,
                "iqr_outliers": 2,
                "stddev_outliers": 1,
                "outliers": "1;2",
                "ld15iqr": 0.11993388799999138,
                "hd15iqr": 0.5863708569999915,
                "ops": 5.7842463985004615,
                "total": 1.555950313999972,
                "iterations": 1
            }
        },
        {
            "group": null,
            "name": "test_06_radiation_pressure",
            "fullname": "tests/benchmarks/test_benchmarks.py::test_06_radiation_pressure",
            "params": null,
            "param": null,
            "extra_info": {},
            "options": {
                "disable_gc": false,
                "timer": "perf_counter",
                "min_rounds": 5,
                "max_time": 1.0,
                "min_time": 5e-06,
                "warmup": false
            },
            "stats": {
                "min": 0.24684015700000828,
                "max": 0.27333000400000174,
                "mean": 0.2567767119999985,
                "stddev": 0.010655085200106568,
                "rounds": 5,
                "median": 0.25388181899998585,
                "iqr": 0.015243893249994755,
                "q1": 0.2485861660000026,
                "q3": 0.26383005924999736,
                "iqr_outliers": 0,
                "stddev_outliers": 1,
                "outliers": "1;0",
                "ld15iqr": 0.24684015700000828,
                "hd15iqr": 0.27333000400000174,
                "ops": 3.894434165042217,
                "total": 1.2838835599999925,
                "iterations": 1
            }
        },
        {
            "group": null,
            "name": "test_07_homodyne",
            "fullname": "tests/benchmarks/test_benchmarks.py::test_07_homodyne",
            "params": null,
            "param": null,
            "extra_info": {},
            "options": {
                "disable_gc": false,
                "timer": "perf_counter",
                "min_rounds": 5,
                "max_time": 1.0,
                "min_time": 5e-06,
                "warmup": false
            },
            "stats": {
                "min": 0.08192478899999855,
                "max": 0.08672623000001067,
                "mean": 0.08392129600000492,
                "stddev": 0.0016680361695304612,
                "rounds": 11,
                "median": 0.08338994999999727,
                "iqr": 0.003098058250010638,
                "q1": 0.08251547675000381,
                "q3": 0.08561353500001445,
                "iqr_outliers": 0,
                "stddev_outliers": 5,
                "outliers": "5;0",
                "ld15iqr": 0.08192478899999855,
                "hd15iqr": 0.08672623000001067,
                "ops": 11.915926560523342,
                "total": 0.9231342560000542,
                "iterations": 1
            }
        },
        {
            "group": null,
            "name": "test_08_optical_spring",
            "fullname": "tests/benchmarks/test_benchmarks.py::test_08_optical_spring",
            "params": null,
            "param": null,
            "extra_info": {},
            "options": {
                "disable_gc": false,
                "timer": "perf_counter",
                "min_rounds": 5,
                "max_time": 1.0,
                "min_time": 5e-06,
                "warmup": false
            },
            "stats": {
                "min": 0.2219655019999891,
                "max": 0.22902613299999075,
                "mean": 0.22646817500000224,
                "stddev": 0.0028253993060629776,
                "rounds": 5,
                "median": 0.22659609300001193,
                "iqr": 0.0037345535000099517,
                "q1": 0.2250391077499998,
                "q3": 0.22877366125000975,
                "iqr_outliers": 0,
                "stddev_outliers": 1,
                "outliers": "1;0",
                "ld15iqr": 0.2219655019999891,
                "hd15iqr": 0.22902613299999075,
                "ops": 4.415631467865143,
                "total": 1.1323408750000112,
                "iterations": 1
            }
        },
        {
            "group": null,
            "name": "test_09_aligo_sensitivity",
            "fullname": "tests/benchmarks/test_benchmarks.py::test_09_aligo_sensitivity",
            "params": null,
            "param": null,
            "extra_info": {},
            "options": {
                "disable_gc": false,
                "timer": "perf_counter",
                "min_rounds": 5,
                "max_time": 1.0,
                "min_time": 5e-06,
                "warmup": false
            },
            "stats": {
                "min": 0.2407979760000103,
                "max": 0.25172524899997484,
                "mean": 0.24513493739999603,
                "stddev": 0.004434337880564258,
                "rounds": 5,
                "median": 0.243802297000002,
                "iqr": 0.0067304064999831326,
                "q1": 0.24170613675000396,
                "q3": 0.2484365432499871,
                "iqr_outliers": 0,
                "stddev_outliers": 1,
                "outliers": "1;0",
                "ld15iqr": 0.2407979760000103,
                "hd15iqr": 0.25172524899997484,
                "ops": 4.079385870518578,
                "total": 1.2256746869999802,
                "iterations": 1
            }
        },
        {
            "group": null,
            "name": "test_10_shifted_beam",
            "fullname": "tests/benchmarks/test_benchmarks.py::test_10_shifted_beam",
            "params": null,
            "param": null,
            "extra_info": {},
            "options": {
                "disable_gc": false,
                "timer": "perf_counter",
                "min_rounds": 5,
                "max_time": 1.0,
                "min_time": 5e-06,
                "warmup": false
            },
            "stats": {
                "min": 0.7064450860000022,
                "max": 1.489892588999993,
                "mean": 0.867293089200001,
                "stddev": 0.3480714404894202,
                "rounds": 5,
                "median": 0.712215485999991,
                "iqr": 0.2025019805000099,
                "q1": 0.7087583260000017,
                "q3": 0.9112603065000116,
                "iqr_outliers": 1,
                "stddev_outliers": 1,
                "outliers": "1;1",
                "ld15iqr": 0.7064450860000022,
                "hd15iqr": 1.489892588999993,
                "ops": 1.1530127617209645,
                "total": 4.336465446000005,
                "iterations": 1
            }
        },
        {
            "group": null,
            "name": "test_angular_radiation_pressure",
            "fullname": "tests/benchmarks/test_benchmarks.py::test_angular_radiation_pressure",
            "params": null,
            "param": null,
            "extra_info": {},
            "options": {
                "disable_gc": false,
                "timer": "perf_counter",
                "min_rounds": 5,
                "max_time": 1.0,
                "min_time": 5e-06,
                "warmup": false
            },
            "stats": {
                "min": 0.29256862899998737,
                "max": 0.30226264099999867,
                "mean": 0.2966930255999955,
                "stddev": 0.00357952966416164,
                "rounds": 5,
                "median": 0.296699488999991,
                "iqr": 0.0039849212499945,
                "q1": 0.2943368365000012,
                "q3": 0.2983217577499957,
                "iqr_outliers": 0,
                "stddev_outliers": 2,
                "outliers": "2;0",
                "ld15iqr": 0.29256862899998737,
                "hd15iqr": 0.30226264099999867,
                "ops": 3.3704870479436546,
                "total": 1.4834651279999775,
                "iterations": 1
            }
        },
        {
            "group": null,
            "name": "test_cavity_eigenmodes",
            "fullname": "tests/benchmarks/test_benchmarks.py::test_cavity_eigenmodes",
            "params": null,
            "param": null,
            "extra_info": {},
            "options": {
                "disable_gc": false,
                "timer": "perf_counter",
                "min_rounds": 5,
                "max_time": 1.0,
                "min_time": 5e-06,
                "warmup": false
            },
            "stats": {
                "min": 0.256510569999989,
                "max": 1.218120526000007,
                "mean": 0.45197138980000207,
                "stddev": 0.42830258087244505,
                "rounds": 5,
                "median": 0.2614386210000248,
                "iqr": 0.2452764480000056,
                "q1": 0.25811087499999275,
                "q3": 0.5033873229999983,
                "iqr_outliers": 1,
                "stddev_outliers": 1,
                "outliers": "1;1",
                "ld15iqr": 0.256510569999989,
                "hd15iqr": 1.218120526000007,
                "ops": 2.212529426790712,
                "total": 2.25985694900001,
                "iterations": 1
            }
        },
        {
            "group": null,
            "name": "test_coupled_cavity_commands",
            "fullname": "tests/benchmarks/test_benchmarks.py::test_coupled_cavity_commands",
            "params": null,
            "param": null,
            "extra_info": {},
            "options": {
                "disable_gc": false,
                "timer": "perf_counter",
                "min_rounds": 5,
                "max_time": 1.0,
                "min_time": 5e-06,
                "warmup": false
            },
            "stats": {
                "min": 4.470826826999996,
                "max": 5.74729735599999,
                "mean": 4.964451830799993,
                "stddev": 0.6406163254186908,
                "rounds": 5,
                "median": 4.542415283999986,
                "iqr": 1.1394060760000144,
                "q1": 4.480707367499988,
                "q3": 5.620113443500003,
                "iqr_outliers": 0,
                "stddev_outliers": 1,
                "outliers": "1;0",
                "ld15iqr": 4.470826826999996,
                "hd15iqr": 5.74729735599999,
                "ops": 0.20143210853530544,
                "total": 24.822259153999966,
                "iterations": 1
            }
        },
        {
            "group": null,
            "name": "test_frequency_dependant_squeezing",
            "fullname": "tests/benchmarks/test_benchmarks.py::test_frequency_dependant_squeezing",
            "params": null,
            "param": null,
            "extra_info": {},
            "options": {
                "disable_gc": false,
                "timer": "perf_counter",
                "min_rounds": 5,
                "max_time": 1.0,
                "min_time": 5e-06,
                "warmup": false
            },
            "stats": {
                "min": 1.4869304989999819,
                "max": 2.8681559020000122,
                "mean": 1.7750602303999983,
                "stddev": 0.6111271937270886,
                "rounds": 5,
                "median": 1.5066409130000125,
                "iqr": 0.3519156417500042,
                "q1": 1.4985181684999915,
                "q3": 1.8504338102499958,
                "iqr_outliers": 1,
                "stddev_outliers": 1,
                "outliers": "1;1",
                "ld15iqr": 1.4869304989999819,
                "hd15iqr": 2.8681559020000122,
                "ops": 0.5633611653699528,
                "total": 8.875301151999992,
                "iterations": 1
            }
        },
        {
            "group": null,
            "name": "test_lock_actions",
            "fullname": "tests/benchmarks/test_benchmarks.py::test_lock_actions",
            "params": null,
            "param": null,
            "extra_info": {},
            "options": {
                "disable_gc": false,
                "timer": "perf_counter",
                "min_rounds": 5,
                "max_time": 1.0,
                "min_time": 5e-06,
                "warmup": false
            },
            "stats": {
                "min": 3.103195040999992,
                "max": 4.687210816999993,
                "mean": 3.4327659469999956,
                "stddev": 0.7013421254241426,
                "rounds": 5,
                "median": 3.1274894340000117,
                "iqr": 0.40809470675001336,
                "q1": 3.1119787949999846,
                "q3": 3.520073501749998,
                "iqr_outliers": 1,
                "stddev_outliers": 1,
                "outliers": "1;1",
                "ld15iqr": 3.103195040999992,
                "hd15iqr": 4.687210816999993,
                "ops": 0.29131027732139214,
                "total": 17.16382973499998,
                "iterations": 1
            }
        }
    ],
    "datetime": "2024-12-03T15:37:50.530131+00:00",
    "version": "5.1.0"
}