{
    "machine_info": {
        "node": "runner-j2nyww-s-project-39604133-concurrent-0",
        "processor": "",
        "machine": "x86_64",
        "python_compiler": "GCC 12.2.0",
        "python_implementation": "CPython",
        "python_implementation_version": "3.12.6",
        "python_version": "3.12.6",
        "python_build": [
            "main",
            "Sep 12 2024 21:12:04"
        ],
        "release": "5.15.154+",
        "system": "Linux",
        "cpu": {
            "python_version": "3.12.6.final.0 (64 bit)",
            "cpuinfo_version": [
                9,
                0,
                0
            ],
            "cpuinfo_version_string": "9.0.0",
            "arch": "X86_64",
            "bits": 64,
            "count": 2,
            "arch_string_raw": "x86_64",
            "vendor_id_raw": "AuthenticAMD",
            "brand_raw": "AMD EPYC 7B13",
            "hz_advertised_friendly": "2.4500 GHz",
            "hz_actual_friendly": "2.4500 GHz",
            "hz_advertised": [
                2449998000,
                0
            ],
            "hz_actual": [
                2449998000,
                0
            ],
            "model": 1,
            "family": 25,
            "flags": [
                "3dnowext",
                "3dnowprefetch",
                "abm",
                "adx",
                "aes",
                "apic",
                "arat",
                "avx",
                "avx2",
                "bmi1",
                "bmi2",
                "clflush",
                "clflushopt",
                "clwb",
                "clzero",
                "cmov",
                "cmp_legacy",
                "constant_tsc",
                "cpuid",
                "cr8_legacy",
                "cx16",
                "cx8",
                "de",
                "erms",
                "extd_apicid",
                "f16c",
                "fma",
                "fpu",
                "fsgsbase",
                "fsrm",
                "fxsr",
                "fxsr_opt",
                "ht",
                "hypervisor",
                "ibpb",
                "ibrs",
                "invpcid",
                "invpcid_single",
                "lahf_lm",
                "lm",
                "mca",
                "mce",
                "misalignsse",
                "mmx",
                "mmxext",
                "movbe",
                "msr",
                "mtrr",
                "nonstop_tsc",
                "nopl",
                "npt",
                "nrip_save",
                "nx",
                "osvw",
                "osxsave",
                "pae",
                "pat",
                "pcid",
                "pclmulqdq",
                "pdpe1gb",
                "pge",
                "pni",
                "popcnt",
                "pse",
                "pse36",
                "rdpid",
                "rdrand",
                "rdrnd",
                "rdseed",
                "rdtscp",
                "rep_good",
                "sep",
                "sha",
                "sha_ni",
                "smap",
                "smep",
                "ssbd",
                "sse",
                "sse2",
                "sse4_1",
                "sse4_2",
                "sse4a",
                "ssse3",
                "stibp",
                "syscall",
                "topoext",
                "tsc",
                "tsc_adjust",
                "tsc_known_freq",
                "umip",
                "vaes",
                "vme",
                "vmmcall",
                "vpclmulqdq",
                "x2apic",
                "xgetbv1",
                "xsave",
                "xsavec",
                "xsaveerptr",
                "xsaveopt"
            ],
            "l3_cache_size": 524288,
            "l2_cache_size": 524288,
            "l1_data_cache_size": 32768,
            "l1_instruction_cache_size": 32768,
            "l2_cache_line_size": 512,
            "l2_cache_associativity": 6
        }
    },
    "commit_info": {
        "id": "fddb8dde9df077f64ae9cd40006798133c2f6b16",
        "time": "2024-09-19T14:48:34+02:00",
        "author_time": "2024-09-19T14:48:34+02:00",
        "dirty": false,
        "project": "finesse3",
        "branch": "(detached head)"
    },
    "benchmarks": [
        {
            "group": null,
            "name": "test_01_simple_cav",
            "fullname": "tests/benchmarks/test_benchmarks.py::test_01_simple_cav",
            "params": null,
            "param": null,
            "extra_info": {},
            "options": {
                "disable_gc": false,
                "timer": "perf_counter",
                "min_rounds": 5,
                "max_time": 1.0,
                "min_time": 5e-06,
                "warmup": false
            },
            "stats": {
                "min": 0.27111958000000413,
                "max": 0.47649268199999995,
                "mean": 0.3174894204000026,
                "stddev": 0.08906254978911865,
                "rounds": 5,
                "median": 0.2815735160000088,
                "iqr": 0.059802725000000834,
                "q1": 0.2728981667500001,
                "q3": 0.33270089175000095,
                "iqr_outliers": 1,
                "stddev_outliers": 1,
                "outliers": "1;1",
                "ld15iqr": 0.27111958000000413,
                "hd15iqr": 0.47649268199999995,
                "ops": 3.149711252551683,
                "total": 1.587447102000013,
                "iterations": 1
            }
        },
        {
            "group": null,
            "name": "test_02_pdh_lock",
            "fullname": "tests/benchmarks/test_benchmarks.py::test_02_pdh_lock",
            "params": null,
            "param": null,
            "extra_info": {},
            "options": {
                "disable_gc": false,
                "timer": "perf_counter",
                "min_rounds": 5,
                "max_time": 1.0,
                "min_time": 5e-06,
                "warmup": false
            },
            "stats": {
                "min": 1.2222566440000122,
                "max": 1.5143381670000053,
                "mean": 1.284897096800003,
                "stddev": 0.12834091022360222,
                "rounds": 5,
                "median": 1.2266588619999936,
                "iqr": 0.07919944100000365,
                "q1": 1.2254365600000021,
                "q3": 1.3046360010000058,
                "iqr_outliers": 1,
                "stddev_outliers": 1,
                "outliers": "1;1",
                "ld15iqr": 1.2222566440000122,
                "hd15iqr": 1.5143381670000053,
                "ops": 0.7782724410308571,
                "total": 6.424485484000016,
                "iterations": 1
            }
        },
        {
            "group": null,
            "name": "test_03_near_unstable",
            "fullname": "tests/benchmarks/test_benchmarks.py::test_03_near_unstable",
            "params": null,
            "param": null,
            "extra_info": {},
            "options": {
                "disable_gc": false,
                "timer": "perf_counter",
                "min_rounds": 5,
                "max_time": 1.0,
                "min_time": 5e-06,
                "warmup": false
            },
            "stats": {
                "min": 1.9490000227051496e-06,
                "max": 2.574999999183092e-05,
                "mean": 2.0604979031397788e-06,
                "stddev": 5.349479251535742e-07,
                "rounds": 52936,
                "median": 2.019999982394438e-06,
                "iqr": 4.000000330961484e-08,
                "q1": 1.9999999949504854e-06,
                "q3": 2.0399999982601003e-06,
                "iqr_outliers": 1790,
                "stddev_outliers": 430,
                "outliers": "430;1790",
                "ld15iqr": 1.9490000227051496e-06,
                "hd15iqr": 2.1000000174353772e-06,
                "ops": 485319.59119017003,
                "total": 0.10907451700060733,
                "iterations": 1
            }
        },
        {
            "group": null,
            "name": "test_04_geometrical_params",
            "fullname": "tests/benchmarks/test_benchmarks.py::test_04_geometrical_params",
            "params": null,
            "param": null,
            "extra_info": {},
            "options": {
                "disable_gc": false,
                "timer": "perf_counter",
                "min_rounds": 5,
                "max_time": 1.0,
                "min_time": 5e-06,
                "warmup": false
            },
            "stats": {
                "min": 0.4585488079999891,
                "max": 0.772759523000019,
                "mean": 0.5447286390000045,
                "stddev": 0.13012860486692354,
                "rounds": 5,
                "median": 0.48171396000000755,
                "iqr": 0.11575647675000056,
                "q1": 0.47501814200000325,
                "q3": 0.5907746187500038,
                "iqr_outliers": 1,
                "stddev_outliers": 1,
                "outliers": "1;1",
                "ld15iqr": 0.4585488079999891,
                "hd15iqr": 0.772759523000019,
                "ops": 1.83577643693522,
                "total": 2.7236431950000224,
                "iterations": 1
            }
        },
        {
            "group": null,
            "name": "test_05_modulation",
            "fullname": "tests/benchmarks/test_benchmarks.py::test_05_modulation",
            "params": null,
            "param": null,
            "extra_info": {},
            "options": {
                "disable_gc": false,
                "timer": "perf_counter",
                "min_rounds": 5,
                "max_time": 1.0,
                "min_time": 5e-06,
                "warmup": false
            },
            "stats": {
                "min": 0.12040602999999805,
                "max": 0.12532447899999966,
                "mean": 0.12293808200000456,
                "stddev": 0.0015914130253705725,
                "rounds": 8,
                "median": 0.12298735500000646,
                "iqr": 0.0021592094999931533,
                "q1": 0.12187025450000988,
                "q3": 0.12402946400000303,
                "iqr_outliers": 0,
                "stddev_outliers": 3,
                "outliers": "3;0",
                "ld15iqr": 0.12040602999999805,
                "hd15iqr": 0.12532447899999966,
                "ops": 8.134176031800813,
                "total": 0.9835046560000364,
                "iterations": 1
            }
        },
        {
            "group": null,
            "name": "test_06_radiation_pressure",
            "fullname": "tests/benchmarks/test_benchmarks.py::test_06_radiation_pressure",
            "params": null,
            "param": null,
            "extra_info": {},
            "options": {
                "disable_gc": false,
                "timer": "perf_counter",
                "min_rounds": 5,
                "max_time": 1.0,
                "min_time": 5e-06,
                "warmup": false
            },
            "stats": {
                "min": 0.24682076799999209,
                "max": 0.7454887909999854,
                "mean": 0.35206431139999383,
                "stddev": 0.2199730214851465,
                "rounds": 5,
                "median": 0.2560224949999963,
                "iqr": 0.12814379950000898,
                "q1": 0.2519628587499909,
                "q3": 0.3801066582499999,
                "iqr_outliers": 1,
                "stddev_outliers": 1,
                "outliers": "1;1",
                "ld15iqr": 0.24682076799999209,
                "hd15iqr": 0.7454887909999854,
                "ops": 2.8403901435606222,
                "total": 1.760321556999969,
                "iterations": 1
            }
        },
        {
            "group": null,
            "name": "test_07_homodyne",
            "fullname": "tests/benchmarks/test_benchmarks.py::test_07_homodyne",
            "params": null,
            "param": null,
            "extra_info": {},
            "options": {
                "disable_gc": false,
                "timer": "perf_counter",
                "min_rounds": 5,
                "max_time": 1.0,
                "min_time": 5e-06,
                "warmup": false
            },
            "stats": {
                "min": 0.08778764699999897,
                "max": 0.10851729899999896,
                "mean": 0.0942520799999975,
                "stddev": 0.007635054267846808,
                "rounds": 11,
                "median": 0.09084799499999008,
                "iqr": 0.009205574999995747,
                "q1": 0.08916947124999552,
                "q3": 0.09837504624999127,
                "iqr_outliers": 0,
                "stddev_outliers": 2,
                "outliers": "2;0",
                "ld15iqr": 0.08778764699999897,
                "hd15iqr": 0.10851729899999896,
                "ops": 10.60984542728422,
                "total": 1.0367728799999725,
                "iterations": 1
            }
        },
        {
            "group": null,
            "name": "test_08_optical_spring",
            "fullname": "tests/benchmarks/test_benchmarks.py::test_08_optical_spring",
            "params": null,
            "param": null,
            "extra_info": {},
            "options": {
                "disable_gc": false,
                "timer": "perf_counter",
                "min_rounds": 5,
                "max_time": 1.0,
                "min_time": 5e-06,
                "warmup": false
            },
            "stats": {
                "min": 0.23791166000000885,
                "max": 0.8083377340000197,
                "mean": 0.35434963060000085,
                "stddev": 0.2537939675394094,
                "rounds": 5,
                "median": 0.24127470899998116,
                "iqr": 0.14411201900001203,
                "q1": 0.24030918349999553,
                "q3": 0.38442120250000755,
                "iqr_outliers": 1,
                "stddev_outliers": 1,
                "outliers": "1;1",
                "ld15iqr": 0.23791166000000885,
                "hd15iqr": 0.8083377340000197,
                "ops": 2.822071518197309,
                "total": 1.7717481530000043,
                "iterations": 1
            }
        },
        {
            "group": null,
            "name": "test_09_aligo_sensitivity",
            "fullname": "tests/benchmarks/test_benchmarks.py::test_09_aligo_sensitivity",
            "params": null,
            "param": null,
            "extra_info": {},
            "options": {
                "disable_gc": false,
                "timer": "perf_counter",
                "min_rounds": 5,
                "max_time": 1.0,
                "min_time": 5e-06,
                "warmup": false
            },
            "stats": {
                "min": 0.2525756670000021,
                "max": 0.2627217810000104,
                "mean": 0.25935748739999553,
                "stddev": 0.00398135580792139,
                "rounds": 5,
                "median": 0.2606730969999944,
                "iqr": 0.004092976499990186,
                "q1": 0.2576720272499955,
                "q3": 0.2617650037499857,
                "iqr_outliers": 0,
                "stddev_outliers": 1,
                "outliers": "1;0",
                "ld15iqr": 0.2525756670000021,
                "hd15iqr": 0.2627217810000104,
                "ops": 3.855682016450693,
                "total": 1.2967874369999777,
                "iterations": 1
            }
        },
        {
            "group": null,
            "name": "test_10_shifted_beam",
            "fullname": "tests/benchmarks/test_benchmarks.py::test_10_shifted_beam",
            "params": null,
            "param": null,
            "extra_info": {},
            "options": {
                "disable_gc": false,
                "timer": "perf_counter",
                "min_rounds": 5,
                "max_time": 1.0,
                "min_time": 5e-06,
                "warmup": false
            },
            "stats": {
                "min": 0.7344579109999927,
                "max": 1.4497046440000076,
                "mean": 0.8831644416000017,
                "stddev": 0.31675825107566596,
                "rounds": 5,
                "median": 0.741080807000003,
                "iqr": 0.18667235524999626,
                "q1": 0.7386512090000039,
                "q3": 0.9253235642500002,
                "iqr_outliers": 1,
                "stddev_outliers": 1,
                "outliers": "1;1",
                "ld15iqr": 0.7344579109999927,
                "hd15iqr": 1.4497046440000076,
                "ops": 1.1322919638706592,
                "total": 4.415822208000009,
                "iterations": 1
            }
        },
        {
            "group": null,
            "name": "test_angular_radiation_pressure",
            "fullname": "tests/benchmarks/test_benchmarks.py::test_angular_radiation_pressure",
            "params": null,
            "param": null,
            "extra_info": {},
            "options": {
                "disable_gc": false,
                "timer": "perf_counter",
                "min_rounds": 5,
                "max_time": 1.0,
                "min_time": 5e-06,
                "warmup": false
            },
            "stats": {
                "min": 0.3055683380000005,
                "max": 0.30854600500001084,
                "mean": 0.30711136160001046,
                "stddev": 0.0012816779286387878,
                "rounds": 5,
                "median": 0.30678121100001476,
                "iqr": 0.0022166022500158533,
                "q1": 0.30615396200000333,
                "q3": 0.3083705642500192,
                "iqr_outliers": 0,
                "stddev_outliers": 2,
                "outliers": "2;0",
                "ld15iqr": 0.3055683380000005,
                "hd15iqr": 0.30854600500001084,
                "ops": 3.2561478507018737,
                "total": 1.5355568080000523,
                "iterations": 1
            }
        },
        {
            "group": null,
            "name": "test_cavity_eigenmodes",
            "fullname": "tests/benchmarks/test_benchmarks.py::test_cavity_eigenmodes",
            "params": null,
            "param": null,
            "extra_info": {},
            "options": {
                "disable_gc": false,
                "timer": "perf_counter",
                "min_rounds": 5,
                "max_time": 1.0,
                "min_time": 5e-06,
                "warmup": false
            },
            "stats": {
                "min": 0.2626041810000004,
                "max": 0.2786276610000016,
                "mean": 0.27363912060000645,
                "stddev": 0.006323725098961142,
                "rounds": 5,
                "median": 0.2757639040000015,
                "iqr": 0.0051174547500068,
                "q1": 0.2717951992500076,
                "q3": 0.2769126540000144,
                "iqr_outliers": 1,
                "stddev_outliers": 1,
                "outliers": "1;1",
                "ld15iqr": 0.27485887200001,
                "hd15iqr": 0.2786276610000016,
                "ops": 3.6544482302358943,
                "total": 1.3681956030000322,
                "iterations": 1
            }
        },
        {
            "group": null,
            "name": "test_coupled_cavity_commands",
            "fullname": "tests/benchmarks/test_benchmarks.py::test_coupled_cavity_commands",
            "params": null,
            "param": null,
            "extra_info": {},
            "options": {
                "disable_gc": false,
                "timer": "perf_counter",
                "min_rounds": 5,
                "max_time": 1.0,
                "min_time": 5e-06,
                "warmup": false
            },
            "stats": {
                "min": 5.860604354000003,
                "max": 7.035917001000001,
                "mean": 6.360614818000005,
                "stddev": 0.5984320442805758,
                "rounds": 5,
                "median": 5.995330372000012,
                "iqr": 1.098084743500003,
                "q1": 5.904731183750002,
                "q3": 7.002815927250005,
                "iqr_outliers": 0,
                "stddev_outliers": 2,
                "outliers": "2;0",
                "ld15iqr": 5.860604354000003,
                "hd15iqr": 7.035917001000001,
                "ops": 0.15721750626528808,
                "total": 31.803074090000024,
                "iterations": 1
            }
        },
        {
            "group": null,
            "name": "test_frequency_dependant_squeezing",
            "fullname": "tests/benchmarks/test_benchmarks.py::test_frequency_dependant_squeezing",
            "params": null,
            "param": null,
            "extra_info": {},
            "options": {
                "disable_gc": false,
                "timer": "perf_counter",
                "min_rounds": 5,
                "max_time": 1.0,
                "min_time": 5e-06,
                "warmup": false
            },
            "stats": {
                "min": 1.508926181999982,
                "max": 1.5685687570000084,
                "mean": 1.5316240988000005,
                "stddev": 0.023354556709799263,
                "rounds": 5,
                "median": 1.523434261999995,
                "iqr": 0.030507095500020398,
                "q1": 1.5158800544999949,
                "q3": 1.5463871500000153,
                "iqr_outliers": 0,
                "stddev_outliers": 1,
                "outliers": "1;0",
                "ld15iqr": 1.508926181999982,
                "hd15iqr": 1.5685687570000084,
                "ops": 0.6529017144503548,
                "total": 7.658120494000002,
                "iterations": 1
            }
        },
        {
            "group": null,
            "name": "test_lock_actions",
            "fullname": "tests/benchmarks/test_benchmarks.py::test_lock_actions",
            "params": null,
            "param": null,
            "extra_info": {},
            "options": {
                "disable_gc": false,
                "timer": "perf_counter",
                "min_rounds": 5,
                "max_time": 1.0,
                "min_time": 5e-06,
                "warmup": false
            },
            "stats": {
                "min": 3.0955815620000067,
                "max": 3.1302897409999844,
                "mean": 3.1154758714000024,
                "stddev": 0.013040077384241362,
                "rounds": 5,
                "median": 3.1158264610000117,
                "iqr": 0.01644463649998329,
                "q1": 3.108392192000011,
                "q3": 3.124836828499994,
                "iqr_outliers": 0,
                "stddev_outliers": 2,
                "outliers": "2;0",
                "ld15iqr": 3.0955815620000067,
                "hd15iqr": 3.1302897409999844,
                "ops": 0.32097825220858783,
                "total": 15.577379357000012,
                "iterations": 1
            }
        }
    ],
    "datetime": "2024-09-19T12:59:28.328356",
    "version": "4.0.0"
}