{
    "machine_info": {
        "node": "runner-jhcjxvh-project-39604133-concurrent-0",
        "processor": "",
        "machine": "x86_64",
        "python_compiler": "GCC 12.2.0",
        "python_implementation": "CPython",
        "python_implementation_version": "3.12.4",
        "python_version": "3.12.4",
        "python_build": [
            "main",
            "Jul 10 2024 19:07:58"
        ],
        "release": "5.15.154+",
        "system": "Linux",
        "cpu": {
            "python_version": "3.12.4.final.0 (64 bit)",
            "cpuinfo_version": [
                9,
                0,
                0
            ],
            "cpuinfo_version_string": "9.0.0",
            "arch": "X86_64",
            "bits": 64,
            "count": 2,
            "arch_string_raw": "x86_64",
            "vendor_id_raw": "AuthenticAMD",
            "brand_raw": "AMD EPYC 7B13",
            "hz_advertised_friendly": "2.4500 GHz",
            "hz_actual_friendly": "2.4500 GHz",
            "hz_advertised": [
                2449994000,
                0
            ],
            "hz_actual": [
                2449994000,
                0
            ],
            "model": 1,
            "family": 25,
            "flags": [
                "3dnowext",
                "3dnowprefetch",
                "abm",
                "adx",
                "aes",
                "apic",
                "arat",
                "avx",
                "avx2",
                "bmi1",
                "bmi2",
                "clflush",
                "clflushopt",
                "clwb",
                "clzero",
                "cmov",
                "cmp_legacy",
                "constant_tsc",
                "cpuid",
                "cr8_legacy",
                "cx16",
                "cx8",
                "de",
                "erms",
                "extd_apicid",
                "f16c",
                "fma",
                "fpu",
                "fsgsbase",
                "fsrm",
                "fxsr",
                "fxsr_opt",
                "ht",
                "hypervisor",
                "ibpb",
                "ibrs",
                "invpcid",
                "invpcid_single",
                "lahf_lm",
                "lm",
                "mca",
                "mce",
                "misalignsse",
                "mmx",
                "mmxext",
                "movbe",
                "msr",
                "mtrr",
                "nonstop_tsc",
                "nopl",
                "npt",
                "nrip_save",
                "nx",
                "osvw",
                "osxsave",
                "pae",
                "pat",
                "pcid",
                "pclmulqdq",
                "pdpe1gb",
                "pge",
                "pni",
                "popcnt",
                "pse",
                "pse36",
                "rdpid",
                "rdrand",
                "rdrnd",
                "rdseed",
                "rdtscp",
                "rep_good",
                "sep",
                "sha",
                "sha_ni",
                "smap",
                "smep",
                "ssbd",
                "sse",
                "sse2",
                "sse4_1",
                "sse4_2",
                "sse4a",
                "ssse3",
                "stibp",
                "syscall",
                "topoext",
                "tsc",
                "tsc_adjust",
                "tsc_known_freq",
                "umip",
                "vaes",
                "vme",
                "vmmcall",
                "vpclmulqdq",
                "x2apic",
                "xgetbv1",
                "xsave",
                "xsavec",
                "xsaveerptr",
                "xsaveopt"
            ],
            "l3_cache_size": 524288,
            "l2_cache_size": 524288,
            "l1_data_cache_size": 32768,
            "l1_instruction_cache_size": 32768,
            "l2_cache_line_size": 512,
            "l2_cache_associativity": 6
        }
    },
    "commit_info": {
        "id": "b3ba5da76feb5356bfeebdf0f37f8c9707489441",
        "time": "2024-07-19T11:13:12+00:00",
        "author_time": "2024-07-19T11:13:12+00:00",
        "dirty": false,
        "project": "finesse3",
        "branch": "(detached head)"
    },
    "benchmarks": [
        {
            "group": null,
            "name": "test_01_simple_cav",
            "fullname": "tests/benchmarks/test_benchmarks.py::test_01_simple_cav",
            "params": null,
            "param": null,
            "extra_info": {},
            "options": {
                "disable_gc": false,
                "timer": "perf_counter",
                "min_rounds": 5,
                "max_time": 1.0,
                "min_time": 5e-06,
                "warmup": false
            },
            "stats": {
                "min": 0.2598885459999991,
                "max": 0.47649050299999374,
                "mean": 0.3067628085999985,
                "stddev": 0.09496294678229666,
                "rounds": 5,
                "median": 0.26682006800000124,
                "iqr": 0.06039348324998883,
                "q1": 0.2608312367500041,
                "q3": 0.3212247199999929,
                "iqr_outliers": 1,
                "stddev_outliers": 1,
                "outliers": "1;1",
                "ld15iqr": 0.2598885459999991,
                "hd15iqr": 0.47649050299999374,
                "ops": 3.2598475824490967,
                "total": 1.5338140429999925,
                "iterations": 1
            }
        },
        {
            "group": null,
            "name": "test_02_pdh_lock",
            "fullname": "tests/benchmarks/test_benchmarks.py::test_02_pdh_lock",
            "params": null,
            "param": null,
            "extra_info": {},
            "options": {
                "disable_gc": false,
                "timer": "perf_counter",
                "min_rounds": 5,
                "max_time": 1.0,
                "min_time": 5e-06,
                "warmup": false
            },
            "stats": {
                "min": 1.1862913680000133,
                "max": 1.4825952019999988,
                "mean": 1.3199002246000078,
                "stddev": 0.13589222215984853,
                "rounds": 5,
                "median": 1.2970917110000073,
                "iqr": 0.25471815499999195,
                "q1": 1.1938228095000127,
                "q3": 1.4485409645000047,
                "iqr_outliers": 0,
                "stddev_outliers": 1,
                "outliers": "1;0",
                "ld15iqr": 1.1862913680000133,
                "hd15iqr": 1.4825952019999988,
                "ops": 0.7576330251046418,
                "total": 6.599501123000039,
                "iterations": 1
            }
        },
        {
            "group": null,
            "name": "test_03_near_unstable",
            "fullname": "tests/benchmarks/test_benchmarks.py::test_03_near_unstable",
            "params": null,
            "param": null,
            "extra_info": {},
            "options": {
                "disable_gc": false,
                "timer": "perf_counter",
                "min_rounds": 5,
                "max_time": 1.0,
                "min_time": 5e-06,
                "warmup": false
            },
            "stats": {
                "min": 1.8400000101337355e-06,
                "max": 2.664999999524298e-05,
                "mean": 1.9596311766151935e-06,
                "stddev": 5.989588941558854e-07,
                "rounds": 66845,
                "median": 1.910000008820134e-06,
                "iqr": 3.999997488790541e-08,
                "q1": 1.8900000213761814e-06,
                "q3": 1.929999996264087e-06,
                "iqr_outliers": 2004,
                "stddev_outliers": 561,
                "outliers": "561;2004",
                "ld15iqr": 1.8400000101337355e-06,
                "hd15iqr": 1.9899999870176543e-06,
                "ops": 510300.10745556065,
                "total": 0.13099154600084262,
                "iterations": 1
            }
        },
        {
            "group": null,
            "name": "test_04_geometrical_params",
            "fullname": "tests/benchmarks/test_benchmarks.py::test_04_geometrical_params",
            "params": null,
            "param": null,
            "extra_info": {},
            "options": {
                "disable_gc": false,
                "timer": "perf_counter",
                "min_rounds": 5,
                "max_time": 1.0,
                "min_time": 5e-06,
                "warmup": false
            },
            "stats": {
                "min": 0.44458782699999233,
                "max": 0.8439650039999833,
                "mean": 0.5274111246000018,
                "stddev": 0.17698002271293126,
                "rounds": 5,
                "median": 0.4488788970000144,
                "iqr": 0.10337506999999846,
                "q1": 0.44674052950000487,
                "q3": 0.5501155995000033,
                "iqr_outliers": 1,
                "stddev_outliers": 1,
                "outliers": "1;1",
                "ld15iqr": 0.44458782699999233,
                "hd15iqr": 0.8439650039999833,
                "ops": 1.8960540522508285,
                "total": 2.637055623000009,
                "iterations": 1
            }
        },
        {
            "group": null,
            "name": "test_05_modulation",
            "fullname": "tests/benchmarks/test_benchmarks.py::test_05_modulation",
            "params": null,
            "param": null,
            "extra_info": {},
            "options": {
                "disable_gc": false,
                "timer": "perf_counter",
                "min_rounds": 5,
                "max_time": 1.0,
                "min_time": 5e-06,
                "warmup": false
            },
            "stats": {
                "min": 0.11505597999999395,
                "max": 0.5343419069999982,
                "mean": 0.16440653255555857,
                "stddev": 0.1387370070063916,
                "rounds": 9,
                "median": 0.11844977900000231,
                "iqr": 0.0033466155000141384,
                "q1": 0.11728925700000303,
                "q3": 0.12063587250001717,
                "iqr_outliers": 1,
                "stddev_outliers": 1,
                "outliers": "1;1",
                "ld15iqr": 0.11505597999999395,
                "hd15iqr": 0.5343419069999982,
                "ops": 6.082483368853156,
                "total": 1.4796587930000271,
                "iterations": 1
            }
        },
        {
            "group": null,
            "name": "test_06_radiation_pressure",
            "fullname": "tests/benchmarks/test_benchmarks.py::test_06_radiation_pressure",
            "params": null,
            "param": null,
            "extra_info": {},
            "options": {
                "disable_gc": false,
                "timer": "perf_counter",
                "min_rounds": 5,
                "max_time": 1.0,
                "min_time": 5e-06,
                "warmup": false
            },
            "stats": {
                "min": 0.23299022900002342,
                "max": 0.2432168089999891,
                "mean": 0.23728092700000616,
                "stddev": 0.0037341641320230885,
                "rounds": 5,
                "median": 0.23697059900001705,
                "iqr": 0.0036910649999981615,
                "q1": 0.23514047150000295,
                "q3": 0.2388315365000011,
                "iqr_outliers": 0,
                "stddev_outliers": 2,
                "outliers": "2;0",
                "ld15iqr": 0.23299022900002342,
                "hd15iqr": 0.2432168089999891,
                "ops": 4.214413744261772,
                "total": 1.1864046350000308,
                "iterations": 1
            }
        },
        {
            "group": null,
            "name": "test_07_homodyne",
            "fullname": "tests/benchmarks/test_benchmarks.py::test_07_homodyne",
            "params": null,
            "param": null,
            "extra_info": {},
            "options": {
                "disable_gc": false,
                "timer": "perf_counter",
                "min_rounds": 5,
                "max_time": 1.0,
                "min_time": 5e-06,
                "warmup": false
            },
            "stats": {
                "min": 0.08333652900000743,
                "max": 0.091684588999982,
                "mean": 0.0881183913999962,
                "stddev": 0.0030906095717122477,
                "rounds": 5,
                "median": 0.08900646899999742,
                "iqr": 0.0035025724999897534,
                "q1": 0.0863379922500016,
                "q3": 0.08984056474999136,
                "iqr_outliers": 0,
                "stddev_outliers": 2,
                "outliers": "2;0",
                "ld15iqr": 0.08333652900000743,
                "hd15iqr": 0.091684588999982,
                "ops": 11.348368758352562,
                "total": 0.440591956999981,
                "iterations": 1
            }
        },
        {
            "group": null,
            "name": "test_08_optical_spring",
            "fullname": "tests/benchmarks/test_benchmarks.py::test_08_optical_spring",
            "params": null,
            "param": null,
            "extra_info": {},
            "options": {
                "disable_gc": false,
                "timer": "perf_counter",
                "min_rounds": 5,
                "max_time": 1.0,
                "min_time": 5e-06,
                "warmup": false
            },
            "stats": {
                "min": 0.21980275899997537,
                "max": 0.22432751899998493,
                "mean": 0.2213950091999834,
                "stddev": 0.0019468049482998114,
                "rounds": 5,
                "median": 0.22044932999997968,
                "iqr": 0.002984515000008514,
                "q1": 0.21992231649998217,
                "q3": 0.2229068314999907,
                "iqr_outliers": 0,
                "stddev_outliers": 1,
                "outliers": "1;0",
                "ld15iqr": 0.21980275899997537,
                "hd15iqr": 0.22432751899998493,
                "ops": 4.516813651823163,
                "total": 1.106975045999917,
                "iterations": 1
            }
        },
        {
            "group": null,
            "name": "test_09_aligo_sensitivity",
            "fullname": "tests/benchmarks/test_benchmarks.py::test_09_aligo_sensitivity",
            "params": null,
            "param": null,
            "extra_info": {},
            "options": {
                "disable_gc": false,
                "timer": "perf_counter",
                "min_rounds": 5,
                "max_time": 1.0,
                "min_time": 5e-06,
                "warmup": false
            },
            "stats": {
                "min": 0.24230006900000944,
                "max": 0.9150932670000032,
                "mean": 0.381226888599997,
                "stddev": 0.2984591472190033,
                "rounds": 5,
                "median": 0.2501939189999973,
                "iqr": 0.17044730200000657,
                "q1": 0.2464057114999889,
                "q3": 0.4168530134999955,
                "iqr_outliers": 1,
                "stddev_outliers": 1,
                "outliers": "1;1",
                "ld15iqr": 0.24230006900000944,
                "hd15iqr": 0.9150932670000032,
                "ops": 2.6231098327622213,
                "total": 1.906134442999985,
                "iterations": 1
            }
        },
        {
            "group": null,
            "name": "test_10_shifted_beam",
            "fullname": "tests/benchmarks/test_benchmarks.py::test_10_shifted_beam",
            "params": null,
            "param": null,
            "extra_info": {},
            "options": {
                "disable_gc": false,
                "timer": "perf_counter",
                "min_rounds": 5,
                "max_time": 1.0,
                "min_time": 5e-06,
                "warmup": false
            },
            "stats": {
                "min": 0.7101329179999993,
                "max": 0.7202322969999955,
                "mean": 0.7161810311999943,
                "stddev": 0.003908228881898978,
                "rounds": 5,
                "median": 0.7163588869999842,
                "iqr": 0.00521201974999741,
                "q1": 0.7140075372499979,
                "q3": 0.7192195569999953,
                "iqr_outliers": 0,
                "stddev_outliers": 2,
                "outliers": "2;0",
                "ld15iqr": 0.7101329179999993,
                "hd15iqr": 0.7202322969999955,
                "ops": 1.39629500983076,
                "total": 3.5809051559999716,
                "iterations": 1
            }
        },
        {
            "group": null,
            "name": "test_angular_radiation_pressure",
            "fullname": "tests/benchmarks/test_benchmarks.py::test_angular_radiation_pressure",
            "params": null,
            "param": null,
            "extra_info": {},
            "options": {
                "disable_gc": false,
                "timer": "perf_counter",
                "min_rounds": 5,
                "max_time": 1.0,
                "min_time": 5e-06,
                "warmup": false
            },
            "stats": {
                "min": 0.297061259000003,
                "max": 0.3120194990000016,
                "mean": 0.3045490089999987,
                "stddev": 0.00545441483974191,
                "rounds": 5,
                "median": 0.3052627790000031,
                "iqr": 0.00641778749999844,
                "q1": 0.30107676649999604,
                "q3": 0.3074945539999945,
                "iqr_outliers": 0,
                "stddev_outliers": 2,
                "outliers": "2;0",
                "ld15iqr": 0.297061259000003,
                "hd15iqr": 0.3120194990000016,
                "ops": 3.283543766185771,
                "total": 1.5227450449999935,
                "iterations": 1
            }
        },
        {
            "group": null,
            "name": "test_cavity_eigenmodes",
            "fullname": "tests/benchmarks/test_benchmarks.py::test_cavity_eigenmodes",
            "params": null,
            "param": null,
            "extra_info": {},
            "options": {
                "disable_gc": false,
                "timer": "perf_counter",
                "min_rounds": 5,
                "max_time": 1.0,
                "min_time": 5e-06,
                "warmup": false
            },
            "stats": {
                "min": 0.2530267589999937,
                "max": 1.1457417360000193,
                "mean": 0.4339018408000072,
                "stddev": 0.39793928691056407,
                "rounds": 5,
                "median": 0.25726765999999657,
                "iqr": 0.22743993600001033,
                "q1": 0.2536784872500064,
                "q3": 0.48111842325001675,
                "iqr_outliers": 1,
                "stddev_outliers": 1,
                "outliers": "1;1",
                "ld15iqr": 0.2530267589999937,
                "hd15iqr": 1.1457417360000193,
                "ops": 2.304668719902751,
                "total": 2.169509204000036,
                "iterations": 1
            }
        },
        {
            "group": null,
            "name": "test_coupled_cavity_commands",
            "fullname": "tests/benchmarks/test_benchmarks.py::test_coupled_cavity_commands",
            "params": null,
            "param": null,
            "extra_info": {},
            "options": {
                "disable_gc": false,
                "timer": "perf_counter",
                "min_rounds": 5,
                "max_time": 1.0,
                "min_time": 5e-06,
                "warmup": false
            },
            "stats": {
                "min": 4.265449534999988,
                "max": 5.3969284509999795,
                "mean": 4.720618767399986,
                "stddev": 0.5971834630058627,
                "rounds": 5,
                "median": 4.314437554999984,
                "iqr": 1.0905297635000082,
                "q1": 4.272386727499985,
                "q3": 5.362916490999993,
                "iqr_outliers": 0,
                "stddev_outliers": 2,
                "outliers": "2;0",
                "ld15iqr": 4.265449534999988,
                "hd15iqr": 5.3969284509999795,
                "ops": 0.21183663610073264,
                "total": 23.603093836999932,
                "iterations": 1
            }
        },
        {
            "group": null,
            "name": "test_frequency_dependant_squeezing",
            "fullname": "tests/benchmarks/test_benchmarks.py::test_frequency_dependant_squeezing",
            "params": null,
            "param": null,
            "extra_info": {},
            "options": {
                "disable_gc": false,
                "timer": "perf_counter",
                "min_rounds": 5,
                "max_time": 1.0,
                "min_time": 5e-06,
                "warmup": false
            },
            "stats": {
                "min": 1.4696257650000177,
                "max": 2.781359469999984,
                "mean": 1.7473436756000011,
                "stddev": 0.5782153420423385,
                "rounds": 5,
                "median": 1.5023728749999918,
                "iqr": 0.3456067112499781,
                "q1": 1.477329899250016,
                "q3": 1.822936610499994,
                "iqr_outliers": 1,
                "stddev_outliers": 1,
                "outliers": "1;1",
                "ld15iqr": 1.4696257650000177,
                "hd15iqr": 2.781359469999984,
                "ops": 0.5722972612451989,
                "total": 8.736718378000006,
                "iterations": 1
            }
        },
        {
            "group": null,
            "name": "test_lock_actions",
            "fullname": "tests/benchmarks/test_benchmarks.py::test_lock_actions",
            "params": null,
            "param": null,
            "extra_info": {},
            "options": {
                "disable_gc": false,
                "timer": "perf_counter",
                "min_rounds": 5,
                "max_time": 1.0,
                "min_time": 5e-06,
                "warmup": false
            },
            "stats": {
                "min": 3.096451481999992,
                "max": 4.5316979410000044,
                "mean": 3.408506139799999,
                "stddev": 0.62826308116989,
                "rounds": 5,
                "median": 3.1429862180000043,
                "iqr": 0.384138078250011,
                "q1": 3.1132227854999925,
                "q3": 3.4973608637500035,
                "iqr_outliers": 1,
                "stddev_outliers": 1,
                "outliers": "1;1",
                "ld15iqr": 3.096451481999992,
                "hd15iqr": 4.5316979410000044,
                "ops": 0.2933836581144246,
                "total": 17.042530698999997,
                "iterations": 1
            }
        }
    ],
    "datetime": "2024-07-19T11:19:49.689367",
    "version": "4.0.0"
}