{
    "machine_info": {
        "node": "runner-zxwgkjap-project-39604133-concurrent-0",
        "processor": "",
        "machine": "x86_64",
        "python_compiler": "GCC 12.2.0",
        "python_implementation": "CPython",
        "python_implementation_version": "3.12.1",
        "python_version": "3.12.1",
        "python_build": [
            "main",
            "Jan 17 2024 06:18:08"
        ],
        "release": "5.4.109+",
        "system": "Linux",
        "cpu": {
            "python_version": "3.12.1.final.0 (64 bit)",
            "cpuinfo_version": [
                9,
                0,
                0
            ],
            "cpuinfo_version_string": "9.0.0",
            "arch": "X86_64",
            "bits": 64,
            "count": 2,
            "arch_string_raw": "x86_64",
            "vendor_id_raw": "AuthenticAMD",
            "brand_raw": "AMD EPYC 7B12",
            "hz_advertised_friendly": "2.2500 GHz",
            "hz_actual_friendly": "2.2500 GHz",
            "hz_advertised": [
                2249998000,
                0
            ],
            "hz_actual": [
                2249998000,
                0
            ],
            "model": 49,
            "family": 23,
            "flags": [
                "3dnowext",
                "3dnowprefetch",
                "abm",
                "adx",
                "aes",
                "apic",
                "arat",
                "avx",
                "avx2",
                "bmi1",
                "bmi2",
                "clflush",
                "clflushopt",
                "clwb",
                "clzero",
                "cmov",
                "cmp_legacy",
                "constant_tsc",
                "cpuid",
                "cr8_legacy",
                "cx16",
                "cx8",
                "de",
                "extd_apicid",
                "f16c",
                "fma",
                "fpu",
                "fsgsbase",
                "fxsr",
                "fxsr_opt",
                "ht",
                "hypervisor",
                "ibpb",
                "ibrs",
                "lahf_lm",
                "lm",
                "mca",
                "mce",
                "misalignsse",
                "mmx",
                "mmxext",
                "movbe",
                "msr",
                "mtrr",
                "nonstop_tsc",
                "nopl",
                "npt",
                "nrip_save",
                "nx",
                "osvw",
                "osxsave",
                "pae",
                "pat",
                "pclmulqdq",
                "pdpe1gb",
                "pge",
                "pni",
                "popcnt",
                "pse",
                "pse36",
                "rdpid",
                "rdrand",
                "rdrnd",
                "rdseed",
                "rdtscp",
                "rep_good",
                "sep",
                "sha",
                "sha_ni",
                "smap",
                "smep",
                "ssbd",
                "sse",
                "sse2",
                "sse4_1",
                "sse4_2",
                "sse4a",
                "ssse3",
                "stibp",
                "syscall",
                "topoext",
                "tsc",
                "tsc_adjust",
                "tsc_known_freq",
                "umip",
                "vme",
                "vmmcall",
                "x2apic",
                "xgetbv1",
                "xsave",
                "xsavec",
                "xsaveerptr",
                "xsaveopt"
            ],
            "l3_cache_size": 524288,
            "l2_cache_size": 524288,
            "l1_data_cache_size": 32768,
            "l1_instruction_cache_size": 32768,
            "l2_cache_line_size": 512,
            "l2_cache_associativity": 6
        }
    },
    "commit_info": {
        "id": "5bc21725d5a46edb7cd0ca3ac4f8df9e27d994fe",
        "time": "2024-01-23T11:46:45+01:00",
        "author_time": "2024-01-23T11:46:45+01:00",
        "dirty": false,
        "project": "finesse3",
        "branch": "(detached head)"
    },
    "benchmarks": [
        {
            "group": null,
            "name": "test_01_simple_cav",
            "fullname": "tests/benchmarks/test_benchmarks.py::test_01_simple_cav",
            "params": null,
            "param": null,
            "extra_info": {},
            "options": {
                "disable_gc": false,
                "timer": "perf_counter",
                "min_rounds": 5,
                "max_time": 1.0,
                "min_time": 5e-06,
                "warmup": false
            },
            "stats": {
                "min": 0.37560250100000303,
                "max": 0.5915576689999966,
                "mean": 0.4324015234000001,
                "stddev": 0.08973374563668511,
                "rounds": 5,
                "median": 0.3972205059999965,
                "iqr": 0.06731070974999653,
                "q1": 0.3863497692500033,
                "q3": 0.45366047899999984,
                "iqr_outliers": 1,
                "stddev_outliers": 1,
                "outliers": "1;1",
                "ld15iqr": 0.37560250100000303,
                "hd15iqr": 0.5915576689999966,
                "ops": 2.312665302695832,
                "total": 2.1620076170000004,
                "iterations": 1
            }
        },
        {
            "group": null,
            "name": "test_02_pdh_lock",
            "fullname": "tests/benchmarks/test_benchmarks.py::test_02_pdh_lock",
            "params": null,
            "param": null,
            "extra_info": {},
            "options": {
                "disable_gc": false,
                "timer": "perf_counter",
                "min_rounds": 5,
                "max_time": 1.0,
                "min_time": 5e-06,
                "warmup": false
            },
            "stats": {
                "min": 1.3115214820000176,
                "max": 1.5884225210000125,
                "mean": 1.375469527599995,
                "stddev": 0.11951743527261016,
                "rounds": 5,
                "median": 1.3206052789999774,
                "iqr": 0.08626257924998981,
                "q1": 1.3156610942499967,
                "q3": 1.4019236734999865,
                "iqr_outliers": 1,
                "stddev_outliers": 1,
                "outliers": "1;1",
                "ld15iqr": 1.3115214820000176,
                "hd15iqr": 1.5884225210000125,
                "ops": 0.7270244668704965,
                "total": 6.877347637999975,
                "iterations": 1
            }
        },
        {
            "group": null,
            "name": "test_03_near_unstable",
            "fullname": "tests/benchmarks/test_benchmarks.py::test_03_near_unstable",
            "params": null,
            "param": null,
            "extra_info": {},
            "options": {
                "disable_gc": false,
                "timer": "perf_counter",
                "min_rounds": 5,
                "max_time": 1.0,
                "min_time": 5e-06,
                "warmup": false
            },
            "stats": {
                "min": 1.7399999876488437e-06,
                "max": 0.0012708059999795296,
                "mean": 2.5211849805243234e-06,
                "stddev": 5.33521934765214e-06,
                "rounds": 58617,
                "median": 1.879999985021641e-06,
                "iqr": 1.3500000193289452e-06,
                "q1": 1.8199999942680734e-06,
                "q3": 3.1700000135970186e-06,
                "iqr_outliers": 330,
                "stddev_outliers": 217,
                "outliers": "217;330",
                "ld15iqr": 1.7399999876488437e-06,
                "hd15iqr": 5.20899999401081e-06,
                "ops": 396638.88517693494,
                "total": 0.14778430000339426,
                "iterations": 1
            }
        },
        {
            "group": null,
            "name": "test_04_geometrical_params",
            "fullname": "tests/benchmarks/test_benchmarks.py::test_04_geometrical_params",
            "params": null,
            "param": null,
            "extra_info": {},
            "options": {
                "disable_gc": false,
                "timer": "perf_counter",
                "min_rounds": 5,
                "max_time": 1.0,
                "min_time": 5e-06,
                "warmup": false
            },
            "stats": {
                "min": 0.4796837749999838,
                "max": 0.8295652249999819,
                "mean": 0.5673108337999964,
                "stddev": 0.14718418651516643,
                "rounds": 5,
                "median": 0.5095954040000095,
                "iqr": 0.09343317674999696,
                "q1": 0.49858069849999964,
                "q3": 0.5920138752499966,
                "iqr_outliers": 1,
                "stddev_outliers": 1,
                "outliers": "1;1",
                "ld15iqr": 0.4796837749999838,
                "hd15iqr": 0.8295652249999819,
                "ops": 1.7627021033632277,
                "total": 2.8365541689999816,
                "iterations": 1
            }
        },
        {
            "group": null,
            "name": "test_05_modulation",
            "fullname": "tests/benchmarks/test_benchmarks.py::test_05_modulation",
            "params": null,
            "param": null,
            "extra_info": {},
            "options": {
                "disable_gc": false,
                "timer": "perf_counter",
                "min_rounds": 5,
                "max_time": 1.0,
                "min_time": 5e-06,
                "warmup": false
            },
            "stats": {
                "min": 0.17037385500000823,
                "max": 0.17580260299999395,
                "mean": 0.17282659049999793,
                "stddev": 0.001929803538509118,
                "rounds": 8,
                "median": 0.1723649380000012,
                "iqr": 0.0023769709999896804,
                "q1": 0.1717381119999999,
                "q3": 0.17411508299998957,
                "iqr_outliers": 0,
                "stddev_outliers": 3,
                "outliers": "3;0",
                "ld15iqr": 0.17037385500000823,
                "hd15iqr": 0.17580260299999395,
                "ops": 5.786146663583067,
                "total": 1.3826127239999835,
                "iterations": 1
            }
        },
        {
            "group": null,
            "name": "test_06_radiation_pressure",
            "fullname": "tests/benchmarks/test_benchmarks.py::test_06_radiation_pressure",
            "params": null,
            "param": null,
            "extra_info": {},
            "options": {
                "disable_gc": false,
                "timer": "perf_counter",
                "min_rounds": 5,
                "max_time": 1.0,
                "min_time": 5e-06,
                "warmup": false
            },
            "stats": {
                "min": 0.23131562300000041,
                "max": 0.24769823500000143,
                "mean": 0.23682668320000175,
                "stddev": 0.006708939748815025,
                "rounds": 5,
                "median": 0.23404842700000472,
                "iqr": 0.008889131749995727,
                "q1": 0.2320838405000032,
                "q3": 0.24097297224999892,
                "iqr_outliers": 0,
                "stddev_outliers": 1,
                "outliers": "1;0",
                "ld15iqr": 0.23131562300000041,
                "hd15iqr": 0.24769823500000143,
                "ops": 4.222497171720693,
                "total": 1.1841334160000088,
                "iterations": 1
            }
        },
        {
            "group": null,
            "name": "test_07_homodyne",
            "fullname": "tests/benchmarks/test_benchmarks.py::test_07_homodyne",
            "params": null,
            "param": null,
            "extra_info": {},
            "options": {
                "disable_gc": false,
                "timer": "perf_counter",
                "min_rounds": 5,
                "max_time": 1.0,
                "min_time": 5e-06,
                "warmup": false
            },
            "stats": {
                "min": 0.1092771060000075,
                "max": 0.1195935069999905,
                "mean": 0.11376182533333513,
                "stddev": 0.003176084402164762,
                "rounds": 9,
                "median": 0.11407417799998143,
                "iqr": 0.003671881749987449,
                "q1": 0.11159087175001758,
                "q3": 0.11526275350000503,
                "iqr_outliers": 0,
                "stddev_outliers": 2,
                "outliers": "2;0",
                "ld15iqr": 0.1092771060000075,
                "hd15iqr": 0.1195935069999905,
                "ops": 8.790294961160177,
                "total": 1.0238564280000162,
                "iterations": 1
            }
        },
        {
            "group": null,
            "name": "test_08_optical_spring",
            "fullname": "tests/benchmarks/test_benchmarks.py::test_08_optical_spring",
            "params": null,
            "param": null,
            "extra_info": {},
            "options": {
                "disable_gc": false,
                "timer": "perf_counter",
                "min_rounds": 5,
                "max_time": 1.0,
                "min_time": 5e-06,
                "warmup": false
            },
            "stats": {
                "min": 0.29598156399998743,
                "max": 0.8149932489999969,
                "mean": 0.4023679770000001,
                "stddev": 0.23067305300159163,
                "rounds": 5,
                "median": 0.29984810700000253,
                "iqr": 0.1310556675000143,
                "q1": 0.298725379749996,
                "q3": 0.4297810472500103,
                "iqr_outliers": 1,
                "stddev_outliers": 1,
                "outliers": "1;1",
                "ld15iqr": 0.29598156399998743,
                "hd15iqr": 0.8149932489999969,
                "ops": 2.485287242428837,
                "total": 2.0118398850000005,
                "iterations": 1
            }
        },
        {
            "group": null,
            "name": "test_09_aligo_sensitivity",
            "fullname": "tests/benchmarks/test_benchmarks.py::test_09_aligo_sensitivity",
            "params": null,
            "param": null,
            "extra_info": {},
            "options": {
                "disable_gc": false,
                "timer": "perf_counter",
                "min_rounds": 5,
                "max_time": 1.0,
                "min_time": 5e-06,
                "warmup": false
            },
            "stats": {
                "min": 0.3139241289999859,
                "max": 0.33649817499997425,
                "mean": 0.3241607378000026,
                "stddev": 0.010262428110322802,
                "rounds": 5,
                "median": 0.3222695020000117,
                "iqr": 0.019088000250000903,
                "q1": 0.31480074400001,
                "q3": 0.3338887442500109,
                "iqr_outliers": 0,
                "stddev_outliers": 1,
                "outliers": "1;0",
                "ld15iqr": 0.3139241289999859,
                "hd15iqr": 0.33649817499997425,
                "ops": 3.0848893261619175,
                "total": 1.620803689000013,
                "iterations": 1
            }
        },
        {
            "group": null,
            "name": "test_10_shifted_beam",
            "fullname": "tests/benchmarks/test_benchmarks.py::test_10_shifted_beam",
            "params": null,
            "param": null,
            "extra_info": {},
            "options": {
                "disable_gc": false,
                "timer": "perf_counter",
                "min_rounds": 5,
                "max_time": 1.0,
                "min_time": 5e-06,
                "warmup": false
            },
            "stats": {
                "min": 0.7146676099999922,
                "max": 0.7564355620000072,
                "mean": 0.7341270305999956,
                "stddev": 0.014841635821164609,
                "rounds": 5,
                "median": 0.7333782519999943,
                "iqr": 0.011938468250015433,
                "q1": 0.7277263107499863,
                "q3": 0.7396647790000017,
                "iqr_outliers": 0,
                "stddev_outliers": 2,
                "outliers": "2;0",
                "ld15iqr": 0.7146676099999922,
                "hd15iqr": 0.7564355620000072,
                "ops": 1.3621620759321569,
                "total": 3.670635152999978,
                "iterations": 1
            }
        },
        {
            "group": null,
            "name": "test_angular_radiation_pressure",
            "fullname": "tests/benchmarks/test_benchmarks.py::test_angular_radiation_pressure",
            "params": null,
            "param": null,
            "extra_info": {},
            "options": {
                "disable_gc": false,
                "timer": "perf_counter",
                "min_rounds": 5,
                "max_time": 1.0,
                "min_time": 5e-06,
                "warmup": false
            },
            "stats": {
                "min": 0.33295567400000436,
                "max": 1.1401314450000086,
                "mean": 0.4973448556000051,
                "stddev": 0.35934425863382796,
                "rounds": 5,
                "median": 0.3359392499999956,
                "iqr": 0.20666738049999367,
                "q1": 0.3349389155000111,
                "q3": 0.5416062960000048,
                "iqr_outliers": 1,
                "stddev_outliers": 1,
                "outliers": "1;1",
                "ld15iqr": 0.33295567400000436,
                "hd15iqr": 1.1401314450000086,
                "ops": 2.0106772770245778,
                "total": 2.4867242780000254,
                "iterations": 1
            }
        },
        {
            "group": null,
            "name": "test_cavity_eigenmodes",
            "fullname": "tests/benchmarks/test_benchmarks.py::test_cavity_eigenmodes",
            "params": null,
            "param": null,
            "extra_info": {},
            "options": {
                "disable_gc": false,
                "timer": "perf_counter",
                "min_rounds": 5,
                "max_time": 1.0,
                "min_time": 5e-06,
                "warmup": false
            },
            "stats": {
                "min": 0.26690572199998996,
                "max": 0.28312617200001,
                "mean": 0.27180871220000424,
                "stddev": 0.006590924770902668,
                "rounds": 5,
                "median": 0.2691052910000167,
                "iqr": 0.006948698000002196,
                "q1": 0.26774452875000065,
                "q3": 0.27469322675000285,
                "iqr_outliers": 0,
                "stddev_outliers": 1,
                "outliers": "1;0",
                "ld15iqr": 0.26690572199998996,
                "hd15iqr": 0.28312617200001,
                "ops": 3.679057937128125,
                "total": 1.3590435610000213,
                "iterations": 1
            }
        },
        {
            "group": null,
            "name": "test_coupled_cavity_commands",
            "fullname": "tests/benchmarks/test_benchmarks.py::test_coupled_cavity_commands",
            "params": null,
            "param": null,
            "extra_info": {},
            "options": {
                "disable_gc": false,
                "timer": "perf_counter",
                "min_rounds": 5,
                "max_time": 1.0,
                "min_time": 5e-06,
                "warmup": false
            },
            "stats": {
                "min": 4.082388961000021,
                "max": 4.963089385999979,
                "mean": 4.34116571639999,
                "stddev": 0.3568172060182575,
                "rounds": 5,
                "median": 4.1896222609999825,
                "iqr": 0.3271188122499922,
                "q1": 4.143648377499993,
                "q3": 4.470767189749985,
                "iqr_outliers": 1,
                "stddev_outliers": 1,
                "outliers": "1;1",
                "ld15iqr": 4.082388961000021,
                "hd15iqr": 4.963089385999979,
                "ops": 0.23035287416516145,
                "total": 21.705828581999953,
                "iterations": 1
            }
        },
        {
            "group": null,
            "name": "test_frequency_dependant_squeezing",
            "fullname": "tests/benchmarks/test_benchmarks.py::test_frequency_dependant_squeezing",
            "params": null,
            "param": null,
            "extra_info": {},
            "options": {
                "disable_gc": false,
                "timer": "perf_counter",
                "min_rounds": 5,
                "max_time": 1.0,
                "min_time": 5e-06,
                "warmup": false
            },
            "stats": {
                "min": 1.4416989670000078,
                "max": 2.7376006359999963,
                "mean": 1.712921038799999,
                "stddev": 0.5728879427504019,
                "rounds": 5,
                "median": 1.4595637520000082,
                "iqr": 0.33003619200001566,
                "q1": 1.4545475439999862,
                "q3": 1.7845837360000019,
                "iqr_outliers": 1,
                "stddev_outliers": 1,
                "outliers": "1;1",
                "ld15iqr": 1.4416989670000078,
                "hd15iqr": 2.7376006359999963,
                "ops": 0.5837980720352167,
                "total": 8.564605193999995,
                "iterations": 1
            }
        },
        {
            "group": null,
            "name": "test_lock_actions",
            "fullname": "tests/benchmarks/test_benchmarks.py::test_lock_actions",
            "params": null,
            "param": null,
            "extra_info": {},
            "options": {
                "disable_gc": false,
                "timer": "perf_counter",
                "min_rounds": 5,
                "max_time": 1.0,
                "min_time": 5e-06,
                "warmup": false
            },
            "stats": {
                "min": 4.826745963000008,
                "max": 4.984266220999984,
                "mean": 4.938686561599996,
                "stddev": 0.06618498747670815,
                "rounds": 5,
                "median": 4.971485302000019,
                "iqr": 0.07724785099998854,
                "q1": 4.904353343249994,
                "q3": 4.981601194249983,
                "iqr_outliers": 0,
                "stddev_outliers": 1,
                "outliers": "1;0",
                "ld15iqr": 4.826745963000008,
                "hd15iqr": 4.984266220999984,
                "ops": 0.20248298561308736,
                "total": 24.693432807999983,
                "iterations": 1
            }
        }
    ],
    "datetime": "2024-01-23T10:54:02.993721",
    "version": "4.0.0"
}