{
    "machine_info": {
        "node": "runner-j1aldqxs-project-39604133-concurrent-0",
        "processor": "",
        "machine": "x86_64",
        "python_compiler": "GCC 12.2.0",
        "python_implementation": "CPython",
        "python_implementation_version": "3.13.0",
        "python_version": "3.13.0",
        "python_build": [
            "main",
            "Nov 12 2024 06:05:34"
        ],
        "release": "5.15.154+",
        "system": "Linux",
        "cpu": {
            "python_version": "3.13.0.final.0 (64 bit)",
            "cpuinfo_version": [
                9,
                0,
                0
            ],
            "cpuinfo_version_string": "9.0.0",
            "arch": "X86_64",
            "bits": 64,
            "count": 2,
            "arch_string_raw": "x86_64",
            "vendor_id_raw": "AuthenticAMD",
            "brand_raw": "AMD EPYC 7B13",
            "hz_advertised_friendly": "2.4500 GHz",
            "hz_actual_friendly": "2.4500 GHz",
            "hz_advertised": [
                2449998000,
                0
            ],
            "hz_actual": [
                2449998000,
                0
            ],
            "model": 1,
            "family": 25,
            "flags": [
                "3dnowext",
                "3dnowprefetch",
                "abm",
                "adx",
                "aes",
                "apic",
                "arat",
                "avx",
                "avx2",
                "bmi1",
                "bmi2",
                "clflush",
                "clflushopt",
                "clwb",
                "clzero",
                "cmov",
                "cmp_legacy",
                "constant_tsc",
                "cpuid",
                "cr8_legacy",
                "cx16",
                "cx8",
                "de",
                "erms",
                "extd_apicid",
                "f16c",
                "fma",
                "fpu",
                "fsgsbase",
                "fsrm",
                "fxsr",
                "fxsr_opt",
                "ht",
                "hypervisor",
                "ibpb",
                "ibrs",
                "invpcid",
                "invpcid_single",
                "lahf_lm",
                "lm",
                "mca",
                "mce",
                "misalignsse",
                "mmx",
                "mmxext",
                "movbe",
                "msr",
                "mtrr",
                "nonstop_tsc",
                "nopl",
                "npt",
                "nrip_save",
                "nx",
                "osvw",
                "osxsave",
                "pae",
                "pat",
                "pcid",
                "pclmulqdq",
                "pdpe1gb",
                "pge",
                "pni",
                "popcnt",
                "pse",
                "pse36",
                "rdpid",
                "rdrand",
                "rdrnd",
                "rdseed",
                "rdtscp",
                "rep_good",
                "sep",
                "sha",
                "sha_ni",
                "smap",
                "smep",
                "ssbd",
                "sse",
                "sse2",
                "sse4_1",
                "sse4_2",
                "sse4a",
                "ssse3",
                "stibp",
                "syscall",
                "topoext",
                "tsc",
                "tsc_adjust",
                "tsc_known_freq",
                "umip",
                "vaes",
                "vme",
                "vmmcall",
                "vpclmulqdq",
                "x2apic",
                "xgetbv1",
                "xsave",
                "xsavec",
                "xsaveerptr",
                "xsaveopt"
            ],
            "l3_cache_size": 524288,
            "l2_cache_size": 524288,
            "l1_data_cache_size": 32768,
            "l1_instruction_cache_size": 32768,
            "l2_cache_line_size": 512,
            "l2_cache_associativity": 6
        }
    },
    "commit_info": {
        "id": "192f54c723b0ea3675fe98c0fb8fd4cba2e4ac5b",
        "time": "2024-11-14T09:51:05+00:00",
        "author_time": "2024-11-14T09:51:05+00:00",
        "dirty": false,
        "project": "finesse3",
        "branch": "(detached head)"
    },
    "benchmarks": [
        {
            "group": null,
            "name": "test_01_simple_cav",
            "fullname": "tests/benchmarks/test_benchmarks.py::test_01_simple_cav",
            "params": null,
            "param": null,
            "extra_info": {},
            "options": {
                "disable_gc": false,
                "timer": "perf_counter",
                "min_rounds": 5,
                "max_time": 1.0,
                "min_time": 5e-06,
                "warmup": false
            },
            "stats": {
                "min": 0.311251544000001,
                "max": 0.5352614319999986,
                "mean": 0.3603693851999992,
                "stddev": 0.09782557271948743,
                "rounds": 5,
                "median": 0.3193961879999989,
                "iqr": 0.05841461750000221,
                "q1": 0.3150834739999979,
                "q3": 0.37349809150000013,
                "iqr_outliers": 1,
                "stddev_outliers": 1,
                "outliers": "1;1",
                "ld15iqr": 0.311251544000001,
                "hd15iqr": 0.5352614319999986,
                "ops": 2.774930504834688,
                "total": 1.801846925999996,
                "iterations": 1
            }
        },
        {
            "group": null,
            "name": "test_02_pdh_lock",
            "fullname": "tests/benchmarks/test_benchmarks.py::test_02_pdh_lock",
            "params": null,
            "param": null,
            "extra_info": {},
            "options": {
                "disable_gc": false,
                "timer": "perf_counter",
                "min_rounds": 5,
                "max_time": 1.0,
                "min_time": 5e-06,
                "warmup": false
            },
            "stats": {
                "min": 1.3207696359999943,
                "max": 1.6738822910000124,
                "mean": 1.4677839607999998,
                "stddev": 0.1788043255011411,
                "rounds": 5,
                "median": 1.3589992720000055,
                "iqr": 0.32716235049998943,
                "q1": 1.3302260425000014,
                "q3": 1.6573883929999909,
                "iqr_outliers": 0,
                "stddev_outliers": 2,
                "outliers": "2;0",
                "ld15iqr": 1.3207696359999943,
                "hd15iqr": 1.6738822910000124,
                "ops": 0.6812991739294935,
                "total": 7.338919804,
                "iterations": 1
            }
        },
        {
            "group": null,
            "name": "test_03_near_unstable",
            "fullname": "tests/benchmarks/test_benchmarks.py::test_03_near_unstable",
            "params": null,
            "param": null,
            "extra_info": {},
            "options": {
                "disable_gc": false,
                "timer": "perf_counter",
                "min_rounds": 5,
                "max_time": 1.0,
                "min_time": 5e-06,
                "warmup": false
            },
            "stats": {
                "min": 1.9999999949504854e-06,
                "max": 4.844999997999366e-05,
                "mean": 2.1083820701481892e-06,
                "stddev": 5.709960601203879e-07,
                "rounds": 50865,
                "median": 2.0689999757905753e-06,
                "iqr": 3.8999985463306075e-08,
                "q1": 2.0500000061929313e-06,
                "q3": 2.0889999916562374e-06,
                "iqr_outliers": 1884,
                "stddev_outliers": 408,
                "outliers": "408;1884",
                "ld15iqr": 1.9999999949504854e-06,
                "hd15iqr": 2.148999982409805e-06,
                "ops": 474297.3364072074,
                "total": 0.10724285399808764,
                "iterations": 1
            }
        },
        {
            "group": null,
            "name": "test_04_geometrical_params",
            "fullname": "tests/benchmarks/test_benchmarks.py::test_04_geometrical_params",
            "params": null,
            "param": null,
            "extra_info": {},
            "options": {
                "disable_gc": false,
                "timer": "perf_counter",
                "min_rounds": 5,
                "max_time": 1.0,
                "min_time": 5e-06,
                "warmup": false
            },
            "stats": {
                "min": 0.4996982629999991,
                "max": 0.54084468100001,
                "mean": 0.5262274910000031,
                "stddev": 0.01648159971724987,
                "rounds": 5,
                "median": 0.5308180090000008,
                "iqr": 0.021965197999989527,
                "q1": 0.5165014572500084,
                "q3": 0.5384666552499979,
                "iqr_outliers": 0,
                "stddev_outliers": 1,
                "outliers": "1;0",
                "ld15iqr": 0.4996982629999991,
                "hd15iqr": 0.54084468100001,
                "ops": 1.9003188109759819,
                "total": 2.6311374550000153,
                "iterations": 1
            }
        },
        {
            "group": null,
            "name": "test_05_modulation",
            "fullname": "tests/benchmarks/test_benchmarks.py::test_05_modulation",
            "params": null,
            "param": null,
            "extra_info": {},
            "options": {
                "disable_gc": false,
                "timer": "perf_counter",
                "min_rounds": 5,
                "max_time": 1.0,
                "min_time": 5e-06,
                "warmup": false
            },
            "stats": {
                "min": 0.13955308399999922,
                "max": 0.1566605959999947,
                "mean": 0.14669410628571558,
                "stddev": 0.006349727054360572,
                "rounds": 7,
                "median": 0.14476251100001036,
                "iqr": 0.00964494274997918,
                "q1": 0.14249134525001494,
                "q3": 0.15213628799999412,
                "iqr_outliers": 0,
                "stddev_outliers": 3,
                "outliers": "3;0",
                "ld15iqr": 0.13955308399999922,
                "hd15iqr": 0.1566605959999947,
                "ops": 6.8169064546622185,
                "total": 1.026858744000009,
                "iterations": 1
            }
        },
        {
            "group": null,
            "name": "test_06_radiation_pressure",
            "fullname": "tests/benchmarks/test_benchmarks.py::test_06_radiation_pressure",
            "params": null,
            "param": null,
            "extra_info": {},
            "options": {
                "disable_gc": false,
                "timer": "perf_counter",
                "min_rounds": 5,
                "max_time": 1.0,
                "min_time": 5e-06,
                "warmup": false
            },
            "stats": {
                "min": 0.2874790129999951,
                "max": 0.2941939600000012,
                "mean": 0.28957453240000175,
                "stddev": 0.002644109974066964,
                "rounds": 5,
                "median": 0.2887401429999841,
                "iqr": 0.0020329317500085153,
                "q1": 0.28823998550000596,
                "q3": 0.2902729172500145,
                "iqr_outliers": 1,
                "stddev_outliers": 1,
                "outliers": "1;1",
                "ld15iqr": 0.2874790129999951,
                "hd15iqr": 0.2941939600000012,
                "ops": 3.4533423630592517,
                "total": 1.4478726620000089,
                "iterations": 1
            }
        },
        {
            "group": null,
            "name": "test_07_homodyne",
            "fullname": "tests/benchmarks/test_benchmarks.py::test_07_homodyne",
            "params": null,
            "param": null,
            "extra_info": {},
            "options": {
                "disable_gc": false,
                "timer": "perf_counter",
                "min_rounds": 5,
                "max_time": 1.0,
                "min_time": 5e-06,
                "warmup": false
            },
            "stats": {
                "min": 0.09816420299998185,
                "max": 0.8319372550000139,
                "mean": 0.17554134369999871,
                "stddev": 0.23065160463923037,
                "rounds": 10,
                "median": 0.10403159550000396,
                "iqr": 0.005043937000039023,
                "q1": 0.10024400299997183,
                "q3": 0.10528794000001085,
                "iqr_outliers": 1,
                "stddev_outliers": 1,
                "outliers": "1;1",
                "ld15iqr": 0.09816420299998185,
                "hd15iqr": 0.8319372550000139,
                "ops": 5.696663697123149,
                "total": 1.7554134369999872,
                "iterations": 1
            }
        },
        {
            "group": null,
            "name": "test_08_optical_spring",
            "fullname": "tests/benchmarks/test_benchmarks.py::test_08_optical_spring",
            "params": null,
            "param": null,
            "extra_info": {},
            "options": {
                "disable_gc": false,
                "timer": "perf_counter",
                "min_rounds": 5,
                "max_time": 1.0,
                "min_time": 5e-06,
                "warmup": false
            },
            "stats": {
                "min": 0.26701403299998105,
                "max": 0.2798495269999819,
                "mean": 0.2732781323999916,
                "stddev": 0.005807973767430802,
                "rounds": 5,
                "median": 0.27362036099998477,
                "iqr": 0.01087062974998787,
                "q1": 0.2676376580000053,
                "q3": 0.27850828774999314,
                "iqr_outliers": 0,
                "stddev_outliers": 2,
                "outliers": "2;0",
                "ld15iqr": 0.26701403299998105,
                "hd15iqr": 0.2798495269999819,
                "ops": 3.659275593029597,
                "total": 1.366390661999958,
                "iterations": 1
            }
        },
        {
            "group": null,
            "name": "test_09_aligo_sensitivity",
            "fullname": "tests/benchmarks/test_benchmarks.py::test_09_aligo_sensitivity",
            "params": null,
            "param": null,
            "extra_info": {},
            "options": {
                "disable_gc": false,
                "timer": "perf_counter",
                "min_rounds": 5,
                "max_time": 1.0,
                "min_time": 5e-06,
                "warmup": false
            },
            "stats": {
                "min": 0.29565107999999896,
                "max": 0.3084186240000122,
                "mean": 0.30127521719999206,
                "stddev": 0.0056371239951219535,
                "rounds": 5,
                "median": 0.2992503779999822,
                "iqr": 0.009918655500015916,
                "q1": 0.2966953867499811,
                "q3": 0.306614042249997,
                "iqr_outliers": 0,
                "stddev_outliers": 1,
                "outliers": "1;0",
                "ld15iqr": 0.29565107999999896,
                "hd15iqr": 0.3084186240000122,
                "ops": 3.319224227249271,
                "total": 1.5063760859999604,
                "iterations": 1
            }
        },
        {
            "group": null,
            "name": "test_10_shifted_beam",
            "fullname": "tests/benchmarks/test_benchmarks.py::test_10_shifted_beam",
            "params": null,
            "param": null,
            "extra_info": {},
            "options": {
                "disable_gc": false,
                "timer": "perf_counter",
                "min_rounds": 5,
                "max_time": 1.0,
                "min_time": 5e-06,
                "warmup": false
            },
            "stats": {
                "min": 0.7922557850000089,
                "max": 0.822239350000018,
                "mean": 0.8055783542000029,
                "stddev": 0.011479276536452735,
                "rounds": 5,
                "median": 0.8065695180000034,
                "iqr": 0.015824636750018328,
                "q1": 0.7964597427499882,
                "q3": 0.8122843795000065,
                "iqr_outliers": 0,
                "stddev_outliers": 2,
                "outliers": "2;0",
                "ld15iqr": 0.7922557850000089,
                "hd15iqr": 0.822239350000018,
                "ops": 1.241344178112968,
                "total": 4.027891771000014,
                "iterations": 1
            }
        },
        {
            "group": null,
            "name": "test_angular_radiation_pressure",
            "fullname": "tests/benchmarks/test_benchmarks.py::test_angular_radiation_pressure",
            "params": null,
            "param": null,
            "extra_info": {},
            "options": {
                "disable_gc": false,
                "timer": "perf_counter",
                "min_rounds": 5,
                "max_time": 1.0,
                "min_time": 5e-06,
                "warmup": false
            },
            "stats": {
                "min": 0.3405398289999937,
                "max": 0.3498867339999947,
                "mean": 0.3460724158000005,
                "stddev": 0.003674663364720137,
                "rounds": 5,
                "median": 0.34716953500000614,
                "iqr": 0.005233218000000761,
                "q1": 0.34347395425000116,
                "q3": 0.3487071722500019,
                "iqr_outliers": 0,
                "stddev_outliers": 2,
                "outliers": "2;0",
                "ld15iqr": 0.3405398289999937,
                "hd15iqr": 0.3498867339999947,
                "ops": 2.889568640390895,
                "total": 1.7303620790000025,
                "iterations": 1
            }
        },
        {
            "group": null,
            "name": "test_cavity_eigenmodes",
            "fullname": "tests/benchmarks/test_benchmarks.py::test_cavity_eigenmodes",
            "params": null,
            "param": null,
            "extra_info": {},
            "options": {
                "disable_gc": false,
                "timer": "perf_counter",
                "min_rounds": 5,
                "max_time": 1.0,
                "min_time": 5e-06,
                "warmup": false
            },
            "stats": {
                "min": 0.3032827760000032,
                "max": 1.4248994839999796,
                "mean": 0.5329810829999986,
                "stddev": 0.4986505314675149,
                "rounds": 5,
                "median": 0.3120120320000126,
                "iqr": 0.2934421402499936,
                "q1": 0.30356838350000004,
                "q3": 0.5970105237499936,
                "iqr_outliers": 1,
                "stddev_outliers": 1,
                "outliers": "1;1",
                "ld15iqr": 0.3032827760000032,
                "hd15iqr": 1.4248994839999796,
                "ops": 1.8762391985308093,
                "total": 2.6649054149999927,
                "iterations": 1
            }
        },
        {
            "group": null,
            "name": "test_coupled_cavity_commands",
            "fullname": "tests/benchmarks/test_benchmarks.py::test_coupled_cavity_commands",
            "params": null,
            "param": null,
            "extra_info": {},
            "options": {
                "disable_gc": false,
                "timer": "perf_counter",
                "min_rounds": 5,
                "max_time": 1.0,
                "min_time": 5e-06,
                "warmup": false
            },
            "stats": {
                "min": 6.15253000200002,
                "max": 7.555364456999996,
                "mean": 6.535466332799996,
                "stddev": 0.5771176924818741,
                "rounds": 5,
                "median": 6.308302488999999,
                "iqr": 0.4560098692499963,
                "q1": 6.23340739124999,
                "q3": 6.689417260499987,
                "iqr_outliers": 1,
                "stddev_outliers": 1,
                "outliers": "1;1",
                "ld15iqr": 6.15253000200002,
                "hd15iqr": 7.555364456999996,
                "ops": 0.15301126944549176,
                "total": 32.67733166399998,
                "iterations": 1
            }
        },
        {
            "group": null,
            "name": "test_frequency_dependant_squeezing",
            "fullname": "tests/benchmarks/test_benchmarks.py::test_frequency_dependant_squeezing",
            "params": null,
            "param": null,
            "extra_info": {},
            "options": {
                "disable_gc": false,
                "timer": "perf_counter",
                "min_rounds": 5,
                "max_time": 1.0,
                "min_time": 5e-06,
                "warmup": false
            },
            "stats": {
                "min": 1.7143026050000003,
                "max": 1.7559150699999861,
                "mean": 1.7262599043999898,
                "stddev": 0.016942539618666083,
                "rounds": 5,
                "median": 1.722232316000003,
                "iqr": 0.014663356999996324,
                "q1": 1.716014104999985,
                "q3": 1.7306774619999814,
                "iqr_outliers": 1,
                "stddev_outliers": 1,
                "outliers": "1;1",
                "ld15iqr": 1.7143026050000003,
                "hd15iqr": 1.7559150699999861,
                "ops": 0.5792870456245568,
                "total": 8.63129952199995,
                "iterations": 1
            }
        },
        {
            "group": null,
            "name": "test_lock_actions",
            "fullname": "tests/benchmarks/test_benchmarks.py::test_lock_actions",
            "params": null,
            "param": null,
            "extra_info": {},
            "options": {
                "disable_gc": false,
                "timer": "perf_counter",
                "min_rounds": 5,
                "max_time": 1.0,
                "min_time": 5e-06,
                "warmup": false
            },
            "stats": {
                "min": 3.1973645129999966,
                "max": 3.252027330000004,
                "mean": 3.2369698662000017,
                "stddev": 0.02310166006950132,
                "rounds": 5,
                "median": 3.2475605799999983,
                "iqr": 0.02575308825002054,
                "q1": 3.2262587767499937,
                "q3": 3.2520118650000143,
                "iqr_outliers": 0,
                "stddev_outliers": 1,
                "outliers": "1;0",
                "ld15iqr": 3.1973645129999966,
                "hd15iqr": 3.252027330000004,
                "ops": 0.3089308956632138,
                "total": 16.18484933100001,
                "iterations": 1
            }
        }
    ],
    "datetime": "2024-11-14T09:57:32.494008+00:00",
    "version": "5.1.0"
}