{
    "machine_info": {
        "node": "runner-nn8vmrs9z-project-39604133-concurrent-0",
        "processor": "",
        "machine": "x86_64",
        "python_compiler": "GCC 12.2.0",
        "python_implementation": "CPython",
        "python_implementation_version": "3.13.0",
        "python_version": "3.13.0",
        "python_build": [
            "main",
            "Nov 12 2024 06:05:34"
        ],
        "release": "5.15.154+",
        "system": "Linux",
        "cpu": {
            "python_version": "3.13.0.final.0 (64 bit)",
            "cpuinfo_version": [
                9,
                0,
                0
            ],
            "cpuinfo_version_string": "9.0.0",
            "arch": "X86_64",
            "bits": 64,
            "count": 2,
            "arch_string_raw": "x86_64",
            "vendor_id_raw": "AuthenticAMD",
            "brand_raw": "AMD EPYC 7B13",
            "hz_advertised_friendly": "2.4500 GHz",
            "hz_actual_friendly": "2.4500 GHz",
            "hz_advertised": [
                2449998000,
                0
            ],
            "hz_actual": [
                2449998000,
                0
            ],
            "model": 1,
            "family": 25,
            "flags": [
                "3dnowext",
                "3dnowprefetch",
                "abm",
                "adx",
                "aes",
                "apic",
                "arat",
                "avx",
                "avx2",
                "bmi1",
                "bmi2",
                "clflush",
                "clflushopt",
                "clwb",
                "clzero",
                "cmov",
                "cmp_legacy",
                "constant_tsc",
                "cpuid",
                "cr8_legacy",
                "cx16",
                "cx8",
                "de",
                "erms",
                "extd_apicid",
                "f16c",
                "fma",
                "fpu",
                "fsgsbase",
                "fsrm",
                "fxsr",
                "fxsr_opt",
                "ht",
                "hypervisor",
                "ibpb",
                "ibrs",
                "invpcid",
                "invpcid_single",
                "lahf_lm",
                "lm",
                "mca",
                "mce",
                "misalignsse",
                "mmx",
                "mmxext",
                "movbe",
                "msr",
                "mtrr",
                "nonstop_tsc",
                "nopl",
                "npt",
                "nrip_save",
                "nx",
                "osvw",
                "osxsave",
                "pae",
                "pat",
                "pcid",
                "pclmulqdq",
                "pdpe1gb",
                "pge",
                "pni",
                "popcnt",
                "pse",
                "pse36",
                "rdpid",
                "rdrand",
                "rdrnd",
                "rdseed",
                "rdtscp",
                "rep_good",
                "sep",
                "sha",
                "sha_ni",
                "smap",
                "smep",
                "ssbd",
                "sse",
                "sse2",
                "sse4_1",
                "sse4_2",
                "sse4a",
                "ssse3",
                "stibp",
                "syscall",
                "topoext",
                "tsc",
                "tsc_adjust",
                "tsc_known_freq",
                "umip",
                "vaes",
                "vme",
                "vmmcall",
                "vpclmulqdq",
                "x2apic",
                "xgetbv1",
                "xsave",
                "xsavec",
                "xsaveerptr",
                "xsaveopt"
            ],
            "l3_cache_size": 524288,
            "l2_cache_size": 524288,
            "l1_data_cache_size": 32768,
            "l1_instruction_cache_size": 32768,
            "l2_cache_line_size": 512,
            "l2_cache_associativity": 6
        }
    },
    "commit_info": {
        "id": "180751e3d4a0cd67b51805f2ba385a7d162cdcc8",
        "time": "2024-11-16T18:00:11+10:30",
        "author_time": "2024-11-16T18:00:11+10:30",
        "dirty": false,
        "project": "finesse3",
        "branch": "(detached head)"
    },
    "benchmarks": [
        {
            "group": null,
            "name": "test_01_simple_cav",
            "fullname": "tests/benchmarks/test_benchmarks.py::test_01_simple_cav",
            "params": null,
            "param": null,
            "extra_info": {},
            "options": {
                "disable_gc": false,
                "timer": "perf_counter",
                "min_rounds": 5,
                "max_time": 1.0,
                "min_time": 5e-06,
                "warmup": false
            },
            "stats": {
                "min": 0.2715976930000181,
                "max": 0.4982713839999917,
                "mean": 0.32684029360000294,
                "stddev": 0.09612350371160983,
                "rounds": 5,
                "median": 0.2880837369999938,
                "iqr": 0.06124592624997405,
                "q1": 0.2817039167500184,
                "q3": 0.3429498429999924,
                "iqr_outliers": 1,
                "stddev_outliers": 1,
                "outliers": "1;1",
                "ld15iqr": 0.2715976930000181,
                "hd15iqr": 0.4982713839999917,
                "ops": 3.0595982795922656,
                "total": 1.6342014680000148,
                "iterations": 1
            }
        },
        {
            "group": null,
            "name": "test_02_pdh_lock",
            "fullname": "tests/benchmarks/test_benchmarks.py::test_02_pdh_lock",
            "params": null,
            "param": null,
            "extra_info": {},
            "options": {
                "disable_gc": false,
                "timer": "perf_counter",
                "min_rounds": 5,
                "max_time": 1.0,
                "min_time": 5e-06,
                "warmup": false
            },
            "stats": {
                "min": 1.2114257430000066,
                "max": 1.6162908839999943,
                "mean": 1.3820703718000005,
                "stddev": 0.19096652881807252,
                "rounds": 5,
                "median": 1.283902564000016,
                "iqr": 0.3422892082499942,
                "q1": 1.2318447247499975,
                "q3": 1.5741339329999917,
                "iqr_outliers": 0,
                "stddev_outliers": 1,
                "outliers": "1;0",
                "ld15iqr": 1.2114257430000066,
                "hd15iqr": 1.6162908839999943,
                "ops": 0.7235521579828137,
                "total": 6.910351859000002,
                "iterations": 1
            }
        },
        {
            "group": null,
            "name": "test_03_near_unstable",
            "fullname": "tests/benchmarks/test_benchmarks.py::test_03_near_unstable",
            "params": null,
            "param": null,
            "extra_info": {},
            "options": {
                "disable_gc": false,
                "timer": "perf_counter",
                "min_rounds": 5,
                "max_time": 1.0,
                "min_time": 5e-06,
                "warmup": false
            },
            "stats": {
                "min": 1.8599999975776882e-06,
                "max": 1.8000000011397788e-05,
                "mean": 1.9780136894820858e-06,
                "stddev": 3.920930321409385e-07,
                "rounds": 67205,
                "median": 1.929999996264087e-06,
                "iqr": 4.0999992734214175e-08,
                "q1": 1.910000008820134e-06,
                "q3": 1.9510000015543483e-06,
                "iqr_outliers": 10140,
                "stddev_outliers": 1122,
                "outliers": "1122;10140",
                "ld15iqr": 1.8599999975776882e-06,
                "hd15iqr": 2.019999982394438e-06,
                "ops": 505557.6740026686,
                "total": 0.13293241000164358,
                "iterations": 1
            }
        },
        {
            "group": null,
            "name": "test_04_geometrical_params",
            "fullname": "tests/benchmarks/test_benchmarks.py::test_04_geometrical_params",
            "params": null,
            "param": null,
            "extra_info": {},
            "options": {
                "disable_gc": false,
                "timer": "perf_counter",
                "min_rounds": 5,
                "max_time": 1.0,
                "min_time": 5e-06,
                "warmup": false
            },
            "stats": {
                "min": 0.46342916700001524,
                "max": 0.4772421429999838,
                "mean": 0.4705948927999998,
                "stddev": 0.006212386921417932,
                "rounds": 5,
                "median": 0.4678389359999926,
                "iqr": 0.010638008499988416,
                "q1": 0.46643899125000843,
                "q3": 0.47707699974999684,
                "iqr_outliers": 0,
                "stddev_outliers": 3,
                "outliers": "3;0",
                "ld15iqr": 0.46342916700001524,
                "hd15iqr": 0.4772421429999838,
                "ops": 2.1249699376252993,
                "total": 2.352974463999999,
                "iterations": 1
            }
        },
        {
            "group": null,
            "name": "test_05_modulation",
            "fullname": "tests/benchmarks/test_benchmarks.py::test_05_modulation",
            "params": null,
            "param": null,
            "extra_info": {},
            "options": {
                "disable_gc": false,
                "timer": "perf_counter",
                "min_rounds": 5,
                "max_time": 1.0,
                "min_time": 5e-06,
                "warmup": false
            },
            "stats": {
                "min": 0.12216373199998998,
                "max": 0.12875102900000002,
                "mean": 0.12528988575,
                "stddev": 0.0020113283664632354,
                "rounds": 8,
                "median": 0.12539171550000106,
                "iqr": 0.0022730340000123306,
                "q1": 0.1240187064999958,
                "q3": 0.12629174050000813,
                "iqr_outliers": 0,
                "stddev_outliers": 2,
                "outliers": "2;0",
                "ld15iqr": 0.12216373199998998,
                "hd15iqr": 0.12875102900000002,
                "ops": 7.981490237730543,
                "total": 1.002319086,
                "iterations": 1
            }
        },
        {
            "group": null,
            "name": "test_06_radiation_pressure",
            "fullname": "tests/benchmarks/test_benchmarks.py::test_06_radiation_pressure",
            "params": null,
            "param": null,
            "extra_info": {},
            "options": {
                "disable_gc": false,
                "timer": "perf_counter",
                "min_rounds": 5,
                "max_time": 1.0,
                "min_time": 5e-06,
                "warmup": false
            },
            "stats": {
                "min": 0.24289888399999882,
                "max": 0.2519991909999817,
                "mean": 0.24667629119998652,
                "stddev": 0.0036559639908359397,
                "rounds": 5,
                "median": 0.2466322029999901,
                "iqr": 0.0055841277499908415,
                "q1": 0.24351438724998786,
                "q3": 0.2490985149999787,
                "iqr_outliers": 0,
                "stddev_outliers": 2,
                "outliers": "2;0",
                "ld15iqr": 0.24289888399999882,
                "hd15iqr": 0.2519991909999817,
                "ops": 4.0538958776110166,
                "total": 1.2333814559999325,
                "iterations": 1
            }
        },
        {
            "group": null,
            "name": "test_07_homodyne",
            "fullname": "tests/benchmarks/test_benchmarks.py::test_07_homodyne",
            "params": null,
            "param": null,
            "extra_info": {},
            "options": {
                "disable_gc": false,
                "timer": "perf_counter",
                "min_rounds": 5,
                "max_time": 1.0,
                "min_time": 5e-06,
                "warmup": false
            },
            "stats": {
                "min": 0.0863908259999846,
                "max": 0.6939526969999861,
                "mean": 0.14633685249999218,
                "stddev": 0.17274687610131784,
                "rounds": 12,
                "median": 0.09373301849998938,
                "iqr": 0.015927853000007985,
                "q1": 0.08953775549998966,
                "q3": 0.10546560849999764,
                "iqr_outliers": 1,
                "stddev_outliers": 1,
                "outliers": "1;1",
                "ld15iqr": 0.0863908259999846,
                "hd15iqr": 0.6939526969999861,
                "ops": 6.833548644214918,
                "total": 1.7560422299999061,
                "iterations": 1
            }
        },
        {
            "group": null,
            "name": "test_08_optical_spring",
            "fullname": "tests/benchmarks/test_benchmarks.py::test_08_optical_spring",
            "params": null,
            "param": null,
            "extra_info": {},
            "options": {
                "disable_gc": false,
                "timer": "perf_counter",
                "min_rounds": 5,
                "max_time": 1.0,
                "min_time": 5e-06,
                "warmup": false
            },
            "stats": {
                "min": 0.22856649999999945,
                "max": 0.25433250000000385,
                "mean": 0.2436690580000004,
                "stddev": 0.011108518219928127,
                "rounds": 5,
                "median": 0.2489071420000073,
                "iqr": 0.01825459550001085,
                "q1": 0.23368725774999177,
                "q3": 0.2519418532500026,
                "iqr_outliers": 0,
                "stddev_outliers": 1,
                "outliers": "1;0",
                "ld15iqr": 0.22856649999999945,
                "hd15iqr": 0.25433250000000385,
                "ops": 4.1039268925150045,
                "total": 1.218345290000002,
                "iterations": 1
            }
        },
        {
            "group": null,
            "name": "test_09_aligo_sensitivity",
            "fullname": "tests/benchmarks/test_benchmarks.py::test_09_aligo_sensitivity",
            "params": null,
            "param": null,
            "extra_info": {},
            "options": {
                "disable_gc": false,
                "timer": "perf_counter",
                "min_rounds": 5,
                "max_time": 1.0,
                "min_time": 5e-06,
                "warmup": false
            },
            "stats": {
                "min": 0.25593147899999735,
                "max": 0.2690730340000016,
                "mean": 0.2626687125999979,
                "stddev": 0.00521910121381896,
                "rounds": 5,
                "median": 0.26381651599999145,
                "iqr": 0.008134467249995225,
                "q1": 0.2582542807500019,
                "q3": 0.2663887479999971,
                "iqr_outliers": 0,
                "stddev_outliers": 2,
                "outliers": "2;0",
                "ld15iqr": 0.25593147899999735,
                "hd15iqr": 0.2690730340000016,
                "ops": 3.8070769453339457,
                "total": 1.3133435629999894,
                "iterations": 1
            }
        },
        {
            "group": null,
            "name": "test_10_shifted_beam",
            "fullname": "tests/benchmarks/test_benchmarks.py::test_10_shifted_beam",
            "params": null,
            "param": null,
            "extra_info": {},
            "options": {
                "disable_gc": false,
                "timer": "perf_counter",
                "min_rounds": 5,
                "max_time": 1.0,
                "min_time": 5e-06,
                "warmup": false
            },
            "stats": {
                "min": 0.7197402980000049,
                "max": 0.7660920289999922,
                "mean": 0.7388762818000032,
                "stddev": 0.01734005550047641,
                "rounds": 5,
                "median": 0.7368114110000192,
                "iqr": 0.020679601500006584,
                "q1": 0.7272908667499962,
                "q3": 0.7479704682500028,
                "iqr_outliers": 0,
                "stddev_outliers": 2,
                "outliers": "2;0",
                "ld15iqr": 0.7197402980000049,
                "hd15iqr": 0.7660920289999922,
                "ops": 1.3534065507744597,
                "total": 3.694381409000016,
                "iterations": 1
            }
        },
        {
            "group": null,
            "name": "test_angular_radiation_pressure",
            "fullname": "tests/benchmarks/test_benchmarks.py::test_angular_radiation_pressure",
            "params": null,
            "param": null,
            "extra_info": {},
            "options": {
                "disable_gc": false,
                "timer": "perf_counter",
                "min_rounds": 5,
                "max_time": 1.0,
                "min_time": 5e-06,
                "warmup": false
            },
            "stats": {
                "min": 0.3062103000000036,
                "max": 0.31926678400000696,
                "mean": 0.3138000446000035,
                "stddev": 0.005430835711305214,
                "rounds": 5,
                "median": 0.3152206759999956,
                "iqr": 0.008898771250002824,
                "q1": 0.30934867350000417,
                "q3": 0.318247444750007,
                "iqr_outliers": 0,
                "stddev_outliers": 2,
                "outliers": "2;0",
                "ld15iqr": 0.3062103000000036,
                "hd15iqr": 0.31926678400000696,
                "ops": 3.186742695574457,
                "total": 1.5690002230000175,
                "iterations": 1
            }
        },
        {
            "group": null,
            "name": "test_cavity_eigenmodes",
            "fullname": "tests/benchmarks/test_benchmarks.py::test_cavity_eigenmodes",
            "params": null,
            "param": null,
            "extra_info": {},
            "options": {
                "disable_gc": false,
                "timer": "perf_counter",
                "min_rounds": 5,
                "max_time": 1.0,
                "min_time": 5e-06,
                "warmup": false
            },
            "stats": {
                "min": 0.2595307059999925,
                "max": 1.1681132239999954,
                "mean": 0.4441920083999946,
                "stddev": 0.4047243310022305,
                "rounds": 5,
                "median": 0.26072544699999867,
                "iqr": 0.2372625527499963,
                "q1": 0.2595457142499953,
                "q3": 0.4968082669999916,
                "iqr_outliers": 1,
                "stddev_outliers": 1,
                "outliers": "1;1",
                "ld15iqr": 0.2595307059999925,
                "hd15iqr": 1.1681132239999954,
                "ops": 2.251278683743226,
                "total": 2.220960041999973,
                "iterations": 1
            }
        },
        {
            "group": null,
            "name": "test_coupled_cavity_commands",
            "fullname": "tests/benchmarks/test_benchmarks.py::test_coupled_cavity_commands",
            "params": null,
            "param": null,
            "extra_info": {},
            "options": {
                "disable_gc": false,
                "timer": "perf_counter",
                "min_rounds": 5,
                "max_time": 1.0,
                "min_time": 5e-06,
                "warmup": false
            },
            "stats": {
                "min": 5.563366972999972,
                "max": 6.788187131000029,
                "mean": 5.959296121999989,
                "stddev": 0.47712710320925267,
                "rounds": 5,
                "median": 5.815538013999969,
                "iqr": 0.37571750550000615,
                "q1": 5.717106194749988,
                "q3": 6.092823700249994,
                "iqr_outliers": 1,
                "stddev_outliers": 1,
                "outliers": "1;1",
                "ld15iqr": 5.563366972999972,
                "hd15iqr": 6.788187131000029,
                "ops": 0.16780505273236726,
                "total": 29.796480609999946,
                "iterations": 1
            }
        },
        {
            "group": null,
            "name": "test_frequency_dependant_squeezing",
            "fullname": "tests/benchmarks/test_benchmarks.py::test_frequency_dependant_squeezing",
            "params": null,
            "param": null,
            "extra_info": {},
            "options": {
                "disable_gc": false,
                "timer": "perf_counter",
                "min_rounds": 5,
                "max_time": 1.0,
                "min_time": 5e-06,
                "warmup": false
            },
            "stats": {
                "min": 1.5905408990000183,
                "max": 1.699455348000015,
                "mean": 1.6399324690000185,
                "stddev": 0.03959205568380446,
                "rounds": 5,
                "median": 1.6317911030000118,
                "iqr": 0.04293789549997484,
                "q1": 1.6189837062500345,
                "q3": 1.6619216017500094,
                "iqr_outliers": 0,
                "stddev_outliers": 2,
                "outliers": "2;0",
                "ld15iqr": 1.5905408990000183,
                "hd15iqr": 1.699455348000015,
                "ops": 0.6097812067894295,
                "total": 8.199662345000093,
                "iterations": 1
            }
        },
        {
            "group": null,
            "name": "test_lock_actions",
            "fullname": "tests/benchmarks/test_benchmarks.py::test_lock_actions",
            "params": null,
            "param": null,
            "extra_info": {},
            "options": {
                "disable_gc": false,
                "timer": "perf_counter",
                "min_rounds": 5,
                "max_time": 1.0,
                "min_time": 5e-06,
                "warmup": false
            },
            "stats": {
                "min": 3.067794259999971,
                "max": 4.728558093999993,
                "mean": 3.416012952199992,
                "stddev": 0.7338360618702892,
                "rounds": 5,
                "median": 3.0941825029999563,
                "iqr": 0.4230615034999943,
                "q1": 3.084087006500013,
                "q3": 3.5071485100000075,
                "iqr_outliers": 1,
                "stddev_outliers": 1,
                "outliers": "1;1",
                "ld15iqr": 3.067794259999971,
                "hd15iqr": 4.728558093999993,
                "ops": 0.2927389368813654,
                "total": 17.08006476099996,
                "iterations": 1
            }
        }
    ],
    "datetime": "2024-11-16T07:36:22.092512+00:00",
    "version": "5.1.0"
}