{
    "machine_info": {
        "node": "runner-ns46nmmj-project-39604133-concurrent-0",
        "processor": "",
        "machine": "x86_64",
        "python_compiler": "GCC 12.2.0",
        "python_implementation": "CPython",
        "python_implementation_version": "3.13.1",
        "python_version": "3.13.1",
        "python_build": [
            "main",
            "Jan 14 2025 05:25:12"
        ],
        "release": "5.15.154+",
        "system": "Linux",
        "cpu": {
            "python_version": "3.13.1.final.0 (64 bit)",
            "cpuinfo_version": [
                9,
                0,
                0
            ],
            "cpuinfo_version_string": "9.0.0",
            "arch": "X86_64",
            "bits": 64,
            "count": 2,
            "arch_string_raw": "x86_64",
            "vendor_id_raw": "AuthenticAMD",
            "brand_raw": "AMD EPYC 7B13",
            "hz_advertised_friendly": "2.4500 GHz",
            "hz_actual_friendly": "2.4500 GHz",
            "hz_advertised": [
                2449998000,
                0
            ],
            "hz_actual": [
                2449998000,
                0
            ],
            "model": 1,
            "family": 25,
            "flags": [
                "3dnowext",
                "3dnowprefetch",
                "abm",
                "adx",
                "aes",
                "apic",
                "arat",
                "avx",
                "avx2",
                "bmi1",
                "bmi2",
                "clflush",
                "clflushopt",
                "clwb",
                "clzero",
                "cmov",
                "cmp_legacy",
                "constant_tsc",
                "cpuid",
                "cr8_legacy",
                "cx16",
                "cx8",
                "de",
                "erms",
                "extd_apicid",
                "f16c",
                "fma",
                "fpu",
                "fsgsbase",
                "fsrm",
                "fxsr",
                "fxsr_opt",
                "ht",
                "hypervisor",
                "ibpb",
                "ibrs",
                "invpcid",
                "invpcid_single",
                "lahf_lm",
                "lm",
                "mca",
                "mce",
                "misalignsse",
                "mmx",
                "mmxext",
                "movbe",
                "msr",
                "mtrr",
                "nonstop_tsc",
                "nopl",
                "npt",
                "nrip_save",
                "nx",
                "osvw",
                "osxsave",
                "pae",
                "pat",
                "pcid",
                "pclmulqdq",
                "pdpe1gb",
                "pge",
                "pni",
                "popcnt",
                "pse",
                "pse36",
                "rdpid",
                "rdrand",
                "rdrnd",
                "rdseed",
                "rdtscp",
                "rep_good",
                "sep",
                "sha",
                "sha_ni",
                "smap",
                "smep",
                "ssbd",
                "sse",
                "sse2",
                "sse4_1",
                "sse4_2",
                "sse4a",
                "ssse3",
                "stibp",
                "syscall",
                "topoext",
                "tsc",
                "tsc_adjust",
                "tsc_known_freq",
                "umip",
                "vaes",
                "vme",
                "vmmcall",
                "vpclmulqdq",
                "x2apic",
                "xgetbv1",
                "xsave",
                "xsavec",
                "xsaveerptr",
                "xsaveopt"
            ],
            "l3_cache_size": 524288,
            "l2_cache_size": 524288,
            "l1_data_cache_size": 32768,
            "l1_instruction_cache_size": 32768,
            "l2_cache_line_size": 512,
            "l2_cache_associativity": 6
        }
    },
    "commit_info": {
        "id": "e207525fd830193aa0221f731edbb979ef31b9d0",
        "time": "2025-01-23T12:26:29+00:00",
        "author_time": "2025-01-23T12:26:29+00:00",
        "dirty": false,
        "project": "finesse3",
        "branch": "(detached head)"
    },
    "benchmarks": [
        {
            "group": null,
            "name": "test_01_simple_cav",
            "fullname": "tests/benchmarks/test_benchmarks.py::test_01_simple_cav",
            "params": null,
            "param": null,
            "extra_info": {},
            "options": {
                "disable_gc": false,
                "timer": "perf_counter",
                "min_rounds": 5,
                "max_time": 1.0,
                "min_time": 5e-06,
                "warmup": false
            },
            "stats": {
                "min": 0.29350861800000416,
                "max": 0.555541985000005,
                "mean": 0.3512286649999993,
                "stddev": 0.11429378968723339,
                "rounds": 5,
                "median": 0.3015049389999973,
                "iqr": 0.06924954049999599,
                "q1": 0.2986019737499994,
                "q3": 0.3678515142499954,
                "iqr_outliers": 1,
                "stddev_outliers": 1,
                "outliers": "1;1",
                "ld15iqr": 0.29350861800000416,
                "hd15iqr": 0.555541985000005,
                "ops": 2.8471480253469688,
                "total": 1.7561433249999965,
                "iterations": 1
            }
        },
        {
            "group": null,
            "name": "test_02_pdh_lock",
            "fullname": "tests/benchmarks/test_benchmarks.py::test_02_pdh_lock",
            "params": null,
            "param": null,
            "extra_info": {},
            "options": {
                "disable_gc": false,
                "timer": "perf_counter",
                "min_rounds": 5,
                "max_time": 1.0,
                "min_time": 5e-06,
                "warmup": false
            },
            "stats": {
                "min": 1.338171449000015,
                "max": 1.684955500000001,
                "mean": 1.4716346840000085,
                "stddev": 0.1746539213368692,
                "rounds": 5,
                "median": 1.3509325459999957,
                "iqr": 0.307391380999988,
                "q1": 1.3432379000000196,
                "q3": 1.6506292810000076,
                "iqr_outliers": 0,
                "stddev_outliers": 1,
                "outliers": "1;0",
                "ld15iqr": 1.338171449000015,
                "hd15iqr": 1.684955500000001,
                "ops": 0.6795164661938575,
                "total": 7.358173420000043,
                "iterations": 1
            }
        },
        {
            "group": null,
            "name": "test_03_near_unstable",
            "fullname": "tests/benchmarks/test_benchmarks.py::test_03_near_unstable",
            "params": null,
            "param": null,
            "extra_info": {},
            "options": {
                "disable_gc": false,
                "timer": "perf_counter",
                "min_rounds": 5,
                "max_time": 1.0,
                "min_time": 5e-06,
                "warmup": false
            },
            "stats": {
                "min": 2.000000023372195e-06,
                "max": 8.870999999999185e-05,
                "mean": 2.1691513792891866e-06,
                "stddev": 7.638217736138906e-07,
                "rounds": 38790,
                "median": 2.080000001569715e-06,
                "iqr": 4.999998282073648e-08,
                "q1": 2.0600000141257624e-06,
                "q3": 2.109999996946499e-06,
                "iqr_outliers": 2634,
                "stddev_outliers": 1157,
                "outliers": "1157;2634",
                "ld15iqr": 2.000000023372195e-06,
                "hd15iqr": 2.1889999857194198e-06,
                "ops": 461009.7799295556,
                "total": 0.08414138200262755,
                "iterations": 1
            }
        },
        {
            "group": null,
            "name": "test_04_geometrical_params",
            "fullname": "tests/benchmarks/test_benchmarks.py::test_04_geometrical_params",
            "params": null,
            "param": null,
            "extra_info": {},
            "options": {
                "disable_gc": false,
                "timer": "perf_counter",
                "min_rounds": 5,
                "max_time": 1.0,
                "min_time": 5e-06,
                "warmup": false
            },
            "stats": {
                "min": 0.4556236189999936,
                "max": 1.0217416590000141,
                "mean": 0.5769428082000048,
                "stddev": 0.24878102365730012,
                "rounds": 5,
                "median": 0.4691463780000049,
                "iqr": 0.15333714324999193,
                "q1": 0.4598279825000091,
                "q3": 0.613165125750001,
                "iqr_outliers": 1,
                "stddev_outliers": 1,
                "outliers": "1;1",
                "ld15iqr": 0.4556236189999936,
                "hd15iqr": 1.0217416590000141,
                "ops": 1.7332740538353968,
                "total": 2.8847140410000236,
                "iterations": 1
            }
        },
        {
            "group": null,
            "name": "test_05_modulation",
            "fullname": "tests/benchmarks/test_benchmarks.py::test_05_modulation",
            "params": null,
            "param": null,
            "extra_info": {},
            "options": {
                "disable_gc": false,
                "timer": "perf_counter",
                "min_rounds": 5,
                "max_time": 1.0,
                "min_time": 5e-06,
                "warmup": false
            },
            "stats": {
                "min": 0.13501200299998573,
                "max": 0.16003498700001728,
                "mean": 0.14256479374999387,
                "stddev": 0.008230172226396201,
                "rounds": 8,
                "median": 0.13992964549998987,
                "iqr": 0.008052071500017632,
                "q1": 0.13737698149998323,
                "q3": 0.14542905300000086,
                "iqr_outliers": 1,
                "stddev_outliers": 1,
                "outliers": "1;1",
                "ld15iqr": 0.13501200299998573,
                "hd15iqr": 0.16003498700001728,
                "ops": 7.01435448189005,
                "total": 1.140518349999951,
                "iterations": 1
            }
        },
        {
            "group": null,
            "name": "test_06_radiation_pressure",
            "fullname": "tests/benchmarks/test_benchmarks.py::test_06_radiation_pressure",
            "params": null,
            "param": null,
            "extra_info": {},
            "options": {
                "disable_gc": false,
                "timer": "perf_counter",
                "min_rounds": 5,
                "max_time": 1.0,
                "min_time": 5e-06,
                "warmup": false
            },
            "stats": {
                "min": 0.27304852099999266,
                "max": 0.2856404169999962,
                "mean": 0.28024289119999823,
                "stddev": 0.004603398678528643,
                "rounds": 5,
                "median": 0.28059577999999874,
                "iqr": 0.0048926989999955595,
                "q1": 0.2781134195000021,
                "q3": 0.2830061184999977,
                "iqr_outliers": 0,
                "stddev_outliers": 2,
                "outliers": "2;0",
                "ld15iqr": 0.27304852099999266,
                "hd15iqr": 0.2856404169999962,
                "ops": 3.568333154564623,
                "total": 1.401214455999991,
                "iterations": 1
            }
        },
        {
            "group": null,
            "name": "test_07_homodyne",
            "fullname": "tests/benchmarks/test_benchmarks.py::test_07_homodyne",
            "params": null,
            "param": null,
            "extra_info": {},
            "options": {
                "disable_gc": false,
                "timer": "perf_counter",
                "min_rounds": 5,
                "max_time": 1.0,
                "min_time": 5e-06,
                "warmup": false
            },
            "stats": {
                "min": 0.09325147699999548,
                "max": 0.10050704300002167,
                "mean": 0.0982406344000026,
                "stddev": 0.003161268898552899,
                "rounds": 5,
                "median": 0.10012215399999036,
                "iqr": 0.004423252500004082,
                "q1": 0.09600412550000215,
                "q3": 0.10042737800000623,
                "iqr_outliers": 0,
                "stddev_outliers": 1,
                "outliers": "1;0",
                "ld15iqr": 0.09325147699999548,
                "hd15iqr": 0.10050704300002167,
                "ops": 10.179087361430696,
                "total": 0.49120317200001296,
                "iterations": 1
            }
        },
        {
            "group": null,
            "name": "test_08_optical_spring",
            "fullname": "tests/benchmarks/test_benchmarks.py::test_08_optical_spring",
            "params": null,
            "param": null,
            "extra_info": {},
            "options": {
                "disable_gc": false,
                "timer": "perf_counter",
                "min_rounds": 5,
                "max_time": 1.0,
                "min_time": 5e-06,
                "warmup": false
            },
            "stats": {
                "min": 0.25485693100000617,
                "max": 0.28010347999997975,
                "mean": 0.26295567559999994,
                "stddev": 0.010294516570701472,
                "rounds": 5,
                "median": 0.25817750900000647,
                "iqr": 0.012341589249963647,
                "q1": 0.2563144285000192,
                "q3": 0.2686560177499828,
                "iqr_outliers": 0,
                "stddev_outliers": 1,
                "outliers": "1;0",
                "ld15iqr": 0.25485693100000617,
                "hd15iqr": 0.28010347999997975,
                "ops": 3.802922289919192,
                "total": 1.3147783779999997,
                "iterations": 1
            }
        },
        {
            "group": null,
            "name": "test_09_aligo_sensitivity",
            "fullname": "tests/benchmarks/test_benchmarks.py::test_09_aligo_sensitivity",
            "params": null,
            "param": null,
            "extra_info": {},
            "options": {
                "disable_gc": false,
                "timer": "perf_counter",
                "min_rounds": 5,
                "max_time": 1.0,
                "min_time": 5e-06,
                "warmup": false
            },
            "stats": {
                "min": 0.2886028860000067,
                "max": 1.1871386170000164,
                "mean": 0.4734275058000037,
                "stddev": 0.3990093728848328,
                "rounds": 5,
                "median": 0.29900218099999165,
                "iqr": 0.23172331899997545,
                "q1": 0.29075372025001656,
                "q3": 0.522477039249992,
                "iqr_outliers": 1,
                "stddev_outliers": 1,
                "outliers": "1;1",
                "ld15iqr": 0.2886028860000067,
                "hd15iqr": 1.1871386170000164,
                "ops": 2.1122558105494686,
                "total": 2.3671375290000185,
                "iterations": 1
            }
        },
        {
            "group": null,
            "name": "test_10_shifted_beam",
            "fullname": "tests/benchmarks/test_benchmarks.py::test_10_shifted_beam",
            "params": null,
            "param": null,
            "extra_info": {},
            "options": {
                "disable_gc": false,
                "timer": "perf_counter",
                "min_rounds": 5,
                "max_time": 1.0,
                "min_time": 5e-06,
                "warmup": false
            },
            "stats": {
                "min": 0.7583460769999988,
                "max": 0.7859893549999981,
                "mean": 0.7745076917999938,
                "stddev": 0.010049287677431218,
                "rounds": 5,
                "median": 0.7752917089999869,
                "iqr": 0.008660913000007042,
                "q1": 0.7710532167499906,
                "q3": 0.7797141297499977,
                "iqr_outliers": 0,
                "stddev_outliers": 2,
                "outliers": "2;0",
                "ld15iqr": 0.7583460769999988,
                "hd15iqr": 0.7859893549999981,
                "ops": 1.2911427615082183,
                "total": 3.872538458999969,
                "iterations": 1
            }
        },
        {
            "group": null,
            "name": "test_angular_radiation_pressure",
            "fullname": "tests/benchmarks/test_benchmarks.py::test_angular_radiation_pressure",
            "params": null,
            "param": null,
            "extra_info": {},
            "options": {
                "disable_gc": false,
                "timer": "perf_counter",
                "min_rounds": 5,
                "max_time": 1.0,
                "min_time": 5e-06,
                "warmup": false
            },
            "stats": {
                "min": 0.32208591000002684,
                "max": 0.3359379930000159,
                "mean": 0.33117766780001145,
                "stddev": 0.006374461817580174,
                "rounds": 5,
                "median": 0.33517409399999565,
                "iqr": 0.010270010249975314,
                "q1": 0.3256268610000248,
                "q3": 0.3358968712500001,
                "iqr_outliers": 0,
                "stddev_outliers": 1,
                "outliers": "1;0",
                "ld15iqr": 0.32208591000002684,
                "hd15iqr": 0.3359379930000159,
                "ops": 3.0195272726054427,
                "total": 1.6558883390000574,
                "iterations": 1
            }
        },
        {
            "group": null,
            "name": "test_cavity_eigenmodes",
            "fullname": "tests/benchmarks/test_benchmarks.py::test_cavity_eigenmodes",
            "params": null,
            "param": null,
            "extra_info": {},
            "options": {
                "disable_gc": false,
                "timer": "perf_counter",
                "min_rounds": 5,
                "max_time": 1.0,
                "min_time": 5e-06,
                "warmup": false
            },
            "stats": {
                "min": 0.25879441900002575,
                "max": 1.3454240739999932,
                "mean": 0.4814196799999991,
                "stddev": 0.483025573291473,
                "rounds": 5,
                "median": 0.26667490599999155,
                "iqr": 0.28023906749997707,
                "q1": 0.26148465325000814,
                "q3": 0.5417237207499852,
                "iqr_outliers": 1,
                "stddev_outliers": 1,
                "outliers": "1;1",
                "ld15iqr": 0.25879441900002575,
                "hd15iqr": 1.3454240739999932,
                "ops": 2.0771896986014404,
                "total": 2.4070983999999953,
                "iterations": 1
            }
        },
        {
            "group": null,
            "name": "test_coupled_cavity_commands",
            "fullname": "tests/benchmarks/test_benchmarks.py::test_coupled_cavity_commands",
            "params": null,
            "param": null,
            "extra_info": {},
            "options": {
                "disable_gc": false,
                "timer": "perf_counter",
                "min_rounds": 5,
                "max_time": 1.0,
                "min_time": 5e-06,
                "warmup": false
            },
            "stats": {
                "min": 6.212763319999993,
                "max": 7.510680086999997,
                "mean": 6.509318296399999,
                "stddev": 0.5611291439112198,
                "rounds": 5,
                "median": 6.262246817999994,
                "iqr": 0.38245997050000824,
                "q1": 6.234538411999999,
                "q3": 6.616998382500007,
                "iqr_outliers": 1,
                "stddev_outliers": 1,
                "outliers": "1;1",
                "ld15iqr": 6.212763319999993,
                "hd15iqr": 7.510680086999997,
                "ops": 0.1536259181784141,
                "total": 32.546591482,
                "iterations": 1
            }
        },
        {
            "group": null,
            "name": "test_frequency_dependant_squeezing",
            "fullname": "tests/benchmarks/test_benchmarks.py::test_frequency_dependant_squeezing",
            "params": null,
            "param": null,
            "extra_info": {},
            "options": {
                "disable_gc": false,
                "timer": "perf_counter",
                "min_rounds": 5,
                "max_time": 1.0,
                "min_time": 5e-06,
                "warmup": false
            },
            "stats": {
                "min": 1.7134544809999852,
                "max": 1.7425254590000065,
                "mean": 1.7273296380000034,
                "stddev": 0.012184101825181084,
                "rounds": 5,
                "median": 1.7252309600000046,
                "iqr": 0.020919775499997684,
                "q1": 1.7173265885000077,
                "q3": 1.7382463640000054,
                "iqr_outliers": 0,
                "stddev_outliers": 2,
                "outliers": "2;0",
                "ld15iqr": 1.7134544809999852,
                "hd15iqr": 1.7425254590000065,
                "ops": 0.5789282937088109,
                "total": 8.636648190000017,
                "iterations": 1
            }
        },
        {
            "group": null,
            "name": "test_lock_actions",
            "fullname": "tests/benchmarks/test_benchmarks.py::test_lock_actions",
            "params": null,
            "param": null,
            "extra_info": {},
            "options": {
                "disable_gc": false,
                "timer": "perf_counter",
                "min_rounds": 5,
                "max_time": 1.0,
                "min_time": 5e-06,
                "warmup": false
            },
            "stats": {
                "min": 3.1730855869999743,
                "max": 4.918464626000002,
                "mean": 3.533206641999999,
                "stddev": 0.7745402935633341,
                "rounds": 5,
                "median": 3.1881995159999974,
                "iqr": 0.46451956499999625,
                "q1": 3.1740402995000068,
                "q3": 3.638559864500003,
                "iqr_outliers": 1,
                "stddev_outliers": 1,
                "outliers": "1;1",
                "ld15iqr": 3.1730855869999743,
                "hd15iqr": 4.918464626000002,
                "ops": 0.2830290162236144,
                "total": 17.666033209999995,
                "iterations": 1
            }
        }
    ],
    "datetime": "2025-01-23T12:37:06.430349+00:00",
    "version": "5.1.0"
}