{
    "machine_info": {
        "node": "runner-jlguopmm-project-39604133-concurrent-0",
        "processor": "",
        "machine": "x86_64",
        "python_compiler": "GCC 12.2.0",
        "python_implementation": "CPython",
        "python_implementation_version": "3.12.5",
        "python_version": "3.12.5",
        "python_build": [
            "main",
            "Aug 13 2024 02:19:05"
        ],
        "release": "5.15.154+",
        "system": "Linux",
        "cpu": {
            "python_version": "3.12.5.final.0 (64 bit)",
            "cpuinfo_version": [
                9,
                0,
                0
            ],
            "cpuinfo_version_string": "9.0.0",
            "arch": "X86_64",
            "bits": 64,
            "count": 2,
            "arch_string_raw": "x86_64",
            "vendor_id_raw": "AuthenticAMD",
            "brand_raw": "AMD EPYC 7B13",
            "hz_advertised_friendly": "2.4500 GHz",
            "hz_actual_friendly": "2.4500 GHz",
            "hz_advertised": [
                2449998000,
                0
            ],
            "hz_actual": [
                2449998000,
                0
            ],
            "model": 1,
            "family": 25,
            "flags": [
                "3dnowext",
                "3dnowprefetch",
                "abm",
                "adx",
                "aes",
                "apic",
                "arat",
                "avx",
                "avx2",
                "bmi1",
                "bmi2",
                "clflush",
                "clflushopt",
                "clwb",
                "clzero",
                "cmov",
                "cmp_legacy",
                "constant_tsc",
                "cpuid",
                "cr8_legacy",
                "cx16",
                "cx8",
                "de",
                "erms",
                "extd_apicid",
                "f16c",
                "fma",
                "fpu",
                "fsgsbase",
                "fsrm",
                "fxsr",
                "fxsr_opt",
                "ht",
                "hypervisor",
                "ibpb",
                "ibrs",
                "invpcid",
                "invpcid_single",
                "lahf_lm",
                "lm",
                "mca",
                "mce",
                "misalignsse",
                "mmx",
                "mmxext",
                "movbe",
                "msr",
                "mtrr",
                "nonstop_tsc",
                "nopl",
                "npt",
                "nrip_save",
                "nx",
                "osvw",
                "osxsave",
                "pae",
                "pat",
                "pcid",
                "pclmulqdq",
                "pdpe1gb",
                "pge",
                "pni",
                "popcnt",
                "pse",
                "pse36",
                "rdpid",
                "rdrand",
                "rdrnd",
                "rdseed",
                "rdtscp",
                "rep_good",
                "sep",
                "sha",
                "sha_ni",
                "smap",
                "smep",
                "ssbd",
                "sse",
                "sse2",
                "sse4_1",
                "sse4_2",
                "sse4a",
                "ssse3",
                "stibp",
                "syscall",
                "topoext",
                "tsc",
                "tsc_adjust",
                "tsc_known_freq",
                "umip",
                "vaes",
                "vme",
                "vmmcall",
                "vpclmulqdq",
                "x2apic",
                "xgetbv1",
                "xsave",
                "xsavec",
                "xsaveerptr",
                "xsaveopt"
            ],
            "l3_cache_size": 524288,
            "l2_cache_size": 524288,
            "l1_data_cache_size": 32768,
            "l1_instruction_cache_size": 32768,
            "l2_cache_line_size": 512,
            "l2_cache_associativity": 6
        }
    },
    "commit_info": {
        "id": "f9d6017ff72028c7d82b020f9f6f7d735543390a",
        "time": "2024-08-27T19:38:47+09:30",
        "author_time": "2024-08-27T19:38:47+09:30",
        "dirty": false,
        "project": "finesse3",
        "branch": "(detached head)"
    },
    "benchmarks": [
        {
            "group": null,
            "name": "test_01_simple_cav",
            "fullname": "tests/benchmarks/test_benchmarks.py::test_01_simple_cav",
            "params": null,
            "param": null,
            "extra_info": {},
            "options": {
                "disable_gc": false,
                "timer": "perf_counter",
                "min_rounds": 5,
                "max_time": 1.0,
                "min_time": 5e-06,
                "warmup": false
            },
            "stats": {
                "min": 0.2677221120000013,
                "max": 0.48522946399999967,
                "mean": 0.31393431879999695,
                "stddev": 0.09578476815819001,
                "rounds": 5,
                "median": 0.27318987599998934,
                "iqr": 0.05667430699999443,
                "q1": 0.26960559675000084,
                "q3": 0.32627990374999527,
                "iqr_outliers": 1,
                "stddev_outliers": 1,
                "outliers": "1;1",
                "ld15iqr": 0.2677221120000013,
                "hd15iqr": 0.48522946399999967,
                "ops": 3.18537968012693,
                "total": 1.5696715939999848,
                "iterations": 1
            }
        },
        {
            "group": null,
            "name": "test_02_pdh_lock",
            "fullname": "tests/benchmarks/test_benchmarks.py::test_02_pdh_lock",
            "params": null,
            "param": null,
            "extra_info": {},
            "options": {
                "disable_gc": false,
                "timer": "perf_counter",
                "min_rounds": 5,
                "max_time": 1.0,
                "min_time": 5e-06,
                "warmup": false
            },
            "stats": {
                "min": 1.185320603000008,
                "max": 1.503861726999986,
                "mean": 1.3009962228000034,
                "stddev": 0.14919805933510677,
                "rounds": 5,
                "median": 1.1992659690000096,
                "iqr": 0.24412389574999693,
                "q1": 1.195285649000006,
                "q3": 1.4394095447500028,
                "iqr_outliers": 0,
                "stddev_outliers": 1,
                "outliers": "1;0",
                "ld15iqr": 1.185320603000008,
                "hd15iqr": 1.503861726999986,
                "ops": 0.768641739672234,
                "total": 6.504981114000017,
                "iterations": 1
            }
        },
        {
            "group": null,
            "name": "test_03_near_unstable",
            "fullname": "tests/benchmarks/test_benchmarks.py::test_03_near_unstable",
            "params": null,
            "param": null,
            "extra_info": {},
            "options": {
                "disable_gc": false,
                "timer": "perf_counter",
                "min_rounds": 5,
                "max_time": 1.0,
                "min_time": 5e-06,
                "warmup": false
            },
            "stats": {
                "min": 1.8689999876642105e-06,
                "max": 2.5859999993826932e-05,
                "mean": 1.9985267786422915e-06,
                "stddev": 6.062308603079642e-07,
                "rounds": 58106,
                "median": 1.950000012129749e-06,
                "iqr": 4.1000021155923605e-08,
                "q1": 1.929999996264087e-06,
                "q3": 1.9710000174200104e-06,
                "iqr_outliers": 1990,
                "stddev_outliers": 516,
                "outliers": "516;1990",
                "ld15iqr": 1.8689999876642105e-06,
                "hd15iqr": 2.0399999982601003e-06,
                "ops": 500368.57683706126,
                "total": 0.116126396999789,
                "iterations": 1
            }
        },
        {
            "group": null,
            "name": "test_04_geometrical_params",
            "fullname": "tests/benchmarks/test_benchmarks.py::test_04_geometrical_params",
            "params": null,
            "param": null,
            "extra_info": {},
            "options": {
                "disable_gc": false,
                "timer": "perf_counter",
                "min_rounds": 5,
                "max_time": 1.0,
                "min_time": 5e-06,
                "warmup": false
            },
            "stats": {
                "min": 0.4634627490000014,
                "max": 0.8409203520000119,
                "mean": 0.5443217274000063,
                "stddev": 0.16592781628010486,
                "rounds": 5,
                "median": 0.4716881950000129,
                "iqr": 0.1051775400000281,
                "q1": 0.4650356204999895,
                "q3": 0.5702131605000176,
                "iqr_outliers": 1,
                "stddev_outliers": 1,
                "outliers": "1;1",
                "ld15iqr": 0.4634627490000014,
                "hd15iqr": 0.8409203520000119,
                "ops": 1.8371487847390833,
                "total": 2.721608637000031,
                "iterations": 1
            }
        },
        {
            "group": null,
            "name": "test_05_modulation",
            "fullname": "tests/benchmarks/test_benchmarks.py::test_05_modulation",
            "params": null,
            "param": null,
            "extra_info": {},
            "options": {
                "disable_gc": false,
                "timer": "perf_counter",
                "min_rounds": 5,
                "max_time": 1.0,
                "min_time": 5e-06,
                "warmup": false
            },
            "stats": {
                "min": 0.11974005700000134,
                "max": 0.12505453100001773,
                "mean": 0.1217744931111137,
                "stddev": 0.0017873811480343996,
                "rounds": 9,
                "median": 0.12092694800000459,
                "iqr": 0.0023546862500154475,
                "q1": 0.12050452299998682,
                "q3": 0.12285920925000227,
                "iqr_outliers": 0,
                "stddev_outliers": 3,
                "outliers": "3;0",
                "ld15iqr": 0.11974005700000134,
                "hd15iqr": 0.12505453100001773,
                "ops": 8.211900328647195,
                "total": 1.0959704380000233,
                "iterations": 1
            }
        },
        {
            "group": null,
            "name": "test_06_radiation_pressure",
            "fullname": "tests/benchmarks/test_benchmarks.py::test_06_radiation_pressure",
            "params": null,
            "param": null,
            "extra_info": {},
            "options": {
                "disable_gc": false,
                "timer": "perf_counter",
                "min_rounds": 5,
                "max_time": 1.0,
                "min_time": 5e-06,
                "warmup": false
            },
            "stats": {
                "min": 0.24272301700000298,
                "max": 0.7554068480000069,
                "mean": 0.3550466196000002,
                "stddev": 0.22444201837005465,
                "rounds": 5,
                "median": 0.2476406099999906,
                "iqr": 0.15706715649999836,
                "q1": 0.24478113850000227,
                "q3": 0.40184829500000063,
                "iqr_outliers": 1,
                "stddev_outliers": 1,
                "outliers": "1;1",
                "ld15iqr": 0.24272301700000298,
                "hd15iqr": 0.7554068480000069,
                "ops": 2.816531533595819,
                "total": 1.775233098000001,
                "iterations": 1
            }
        },
        {
            "group": null,
            "name": "test_07_homodyne",
            "fullname": "tests/benchmarks/test_benchmarks.py::test_07_homodyne",
            "params": null,
            "param": null,
            "extra_info": {},
            "options": {
                "disable_gc": false,
                "timer": "perf_counter",
                "min_rounds": 5,
                "max_time": 1.0,
                "min_time": 5e-06,
                "warmup": false
            },
            "stats": {
                "min": 0.08369917499999247,
                "max": 0.08839031700000533,
                "mean": 0.08577511708333911,
                "stddev": 0.001666253106706951,
                "rounds": 12,
                "median": 0.08556518000000324,
                "iqr": 0.0028668325000040795,
                "q1": 0.08422828400000526,
                "q3": 0.08709511650000934,
                "iqr_outliers": 0,
                "stddev_outliers": 5,
                "outliers": "5;0",
                "ld15iqr": 0.08369917499999247,
                "hd15iqr": 0.08839031700000533,
                "ops": 11.65839271345325,
                "total": 1.0293014050000693,
                "iterations": 1
            }
        },
        {
            "group": null,
            "name": "test_08_optical_spring",
            "fullname": "tests/benchmarks/test_benchmarks.py::test_08_optical_spring",
            "params": null,
            "param": null,
            "extra_info": {},
            "options": {
                "disable_gc": false,
                "timer": "perf_counter",
                "min_rounds": 5,
                "max_time": 1.0,
                "min_time": 5e-06,
                "warmup": false
            },
            "stats": {
                "min": 0.22730708699998559,
                "max": 0.8343942790000085,
                "mean": 0.3504055763999986,
                "stddev": 0.2705607155998022,
                "rounds": 5,
                "median": 0.22998856800001022,
                "iqr": 0.15220125549998897,
                "q1": 0.22923877350000055,
                "q3": 0.3814400289999895,
                "iqr_outliers": 1,
                "stddev_outliers": 1,
                "outliers": "1;1",
                "ld15iqr": 0.22730708699998559,
                "hd15iqr": 0.8343942790000085,
                "ops": 2.8538358615003023,
                "total": 1.752027881999993,
                "iterations": 1
            }
        },
        {
            "group": null,
            "name": "test_09_aligo_sensitivity",
            "fullname": "tests/benchmarks/test_benchmarks.py::test_09_aligo_sensitivity",
            "params": null,
            "param": null,
            "extra_info": {},
            "options": {
                "disable_gc": false,
                "timer": "perf_counter",
                "min_rounds": 5,
                "max_time": 1.0,
                "min_time": 5e-06,
                "warmup": false
            },
            "stats": {
                "min": 0.24722878800000103,
                "max": 0.2547422989999859,
                "mean": 0.2518267804000004,
                "stddev": 0.0034673924105188027,
                "rounds": 5,
                "median": 0.2535569140000007,
                "iqr": 0.006048129499980348,
                "q1": 0.2485745340000136,
                "q3": 0.25462266349999396,
                "iqr_outliers": 0,
                "stddev_outliers": 1,
                "outliers": "1;0",
                "ld15iqr": 0.24722878800000103,
                "hd15iqr": 0.2547422989999859,
                "ops": 3.9709835403987017,
                "total": 1.259133902000002,
                "iterations": 1
            }
        },
        {
            "group": null,
            "name": "test_10_shifted_beam",
            "fullname": "tests/benchmarks/test_benchmarks.py::test_10_shifted_beam",
            "params": null,
            "param": null,
            "extra_info": {},
            "options": {
                "disable_gc": false,
                "timer": "perf_counter",
                "min_rounds": 5,
                "max_time": 1.0,
                "min_time": 5e-06,
                "warmup": false
            },
            "stats": {
                "min": 0.7074811340000053,
                "max": 1.4877108990000067,
                "mean": 0.8719839148000063,
                "stddev": 0.34428329311214284,
                "rounds": 5,
                "median": 0.7199792330000037,
                "iqr": 0.20402459125001116,
                "q1": 0.7141673240000017,
                "q3": 0.9181919152500129,
                "iqr_outliers": 1,
                "stddev_outliers": 1,
                "outliers": "1;1",
                "ld15iqr": 0.7074811340000053,
                "hd15iqr": 1.4877108990000067,
                "ops": 1.1468101452643824,
                "total": 4.359919574000031,
                "iterations": 1
            }
        },
        {
            "group": null,
            "name": "test_angular_radiation_pressure",
            "fullname": "tests/benchmarks/test_benchmarks.py::test_angular_radiation_pressure",
            "params": null,
            "param": null,
            "extra_info": {},
            "options": {
                "disable_gc": false,
                "timer": "perf_counter",
                "min_rounds": 5,
                "max_time": 1.0,
                "min_time": 5e-06,
                "warmup": false
            },
            "stats": {
                "min": 0.29554170000000113,
                "max": 0.30085227000000714,
                "mean": 0.297931305599991,
                "stddev": 0.0020201897983543483,
                "rounds": 5,
                "median": 0.2976019789999782,
                "iqr": 0.002810123250000629,
                "q1": 0.2965169017499889,
                "q3": 0.29932702499998953,
                "iqr_outliers": 0,
                "stddev_outliers": 2,
                "outliers": "2;0",
                "ld15iqr": 0.29554170000000113,
                "hd15iqr": 0.30085227000000714,
                "ops": 3.3564784270862145,
                "total": 1.489656527999955,
                "iterations": 1
            }
        },
        {
            "group": null,
            "name": "test_cavity_eigenmodes",
            "fullname": "tests/benchmarks/test_benchmarks.py::test_cavity_eigenmodes",
            "params": null,
            "param": null,
            "extra_info": {},
            "options": {
                "disable_gc": false,
                "timer": "perf_counter",
                "min_rounds": 5,
                "max_time": 1.0,
                "min_time": 5e-06,
                "warmup": false
            },
            "stats": {
                "min": 0.24737887800000635,
                "max": 1.1417188179999869,
                "mean": 0.4296953882000025,
                "stddev": 0.3980468007792539,
                "rounds": 5,
                "median": 0.25278070799998886,
                "iqr": 0.22812998575000165,
                "q1": 0.24954667050000978,
                "q3": 0.47767665625001143,
                "iqr_outliers": 1,
                "stddev_outliers": 1,
                "outliers": "1;1",
                "ld15iqr": 0.24737887800000635,
                "hd15iqr": 1.1417188179999869,
                "ops": 2.3272300040012253,
                "total": 2.1484769410000126,
                "iterations": 1
            }
        },
        {
            "group": null,
            "name": "test_coupled_cavity_commands",
            "fullname": "tests/benchmarks/test_benchmarks.py::test_coupled_cavity_commands",
            "params": null,
            "param": null,
            "extra_info": {},
            "options": {
                "disable_gc": false,
                "timer": "perf_counter",
                "min_rounds": 5,
                "max_time": 1.0,
                "min_time": 5e-06,
                "warmup": false
            },
            "stats": {
                "min": 4.295414571000009,
                "max": 5.498068499999988,
                "mean": 4.729133692800002,
                "stddev": 0.5659312628019966,
                "rounds": 5,
                "median": 4.345071342000011,
                "iqr": 0.9308802974999963,
                "q1": 4.323913004250002,
                "q3": 5.254793301749999,
                "iqr_outliers": 0,
                "stddev_outliers": 1,
                "outliers": "1;0",
                "ld15iqr": 4.295414571000009,
                "hd15iqr": 5.498068499999988,
                "ops": 0.21145521885382035,
                "total": 23.64566846400001,
                "iterations": 1
            }
        },
        {
            "group": null,
            "name": "test_frequency_dependant_squeezing",
            "fullname": "tests/benchmarks/test_benchmarks.py::test_frequency_dependant_squeezing",
            "params": null,
            "param": null,
            "extra_info": {},
            "options": {
                "disable_gc": false,
                "timer": "perf_counter",
                "min_rounds": 5,
                "max_time": 1.0,
                "min_time": 5e-06,
                "warmup": false
            },
            "stats": {
                "min": 1.4712305980000053,
                "max": 2.862184514000006,
                "mean": 1.7722791780000022,
                "stddev": 0.6095526779609554,
                "rounds": 5,
                "median": 1.5134519900000214,
                "iqr": 0.36406007649998884,
                "q1": 1.490095146249999,
                "q3": 1.8541552227499878,
                "iqr_outliers": 1,
                "stddev_outliers": 1,
                "outliers": "1;1",
                "ld15iqr": 1.4712305980000053,
                "hd15iqr": 2.862184514000006,
                "ops": 0.564245189140285,
                "total": 8.861395890000011,
                "iterations": 1
            }
        },
        {
            "group": null,
            "name": "test_lock_actions",
            "fullname": "tests/benchmarks/test_benchmarks.py::test_lock_actions",
            "params": null,
            "param": null,
            "extra_info": {},
            "options": {
                "disable_gc": false,
                "timer": "perf_counter",
                "min_rounds": 5,
                "max_time": 1.0,
                "min_time": 5e-06,
                "warmup": false
            },
            "stats": {
                "min": 3.084314906000003,
                "max": 4.505768748000008,
                "mean": 3.386247289000005,
                "stddev": 0.6260027555337586,
                "rounds": 5,
                "median": 3.1193135360000213,
                "iqr": 0.3688662857500091,
                "q1": 3.097517034499994,
                "q3": 3.466383320250003,
                "iqr_outliers": 1,
                "stddev_outliers": 1,
                "outliers": "1;1",
                "ld15iqr": 3.084314906000003,
                "hd15iqr": 4.505768748000008,
                "ops": 0.29531215964304564,
                "total": 16.931236445000025,
                "iterations": 1
            }
        }
    ],
    "datetime": "2024-08-27T10:15:11.013705",
    "version": "4.0.0"
}