{
    "machine_info": {
        "node": "runner-nthfetyx-project-39604133-concurrent-0",
        "processor": "",
        "machine": "x86_64",
        "python_compiler": "GCC 12.2.0",
        "python_implementation": "CPython",
        "python_implementation_version": "3.12.4",
        "python_version": "3.12.4",
        "python_build": [
            "main",
            "Jun 27 2024 00:07:20"
        ],
        "release": "5.15.154+",
        "system": "Linux",
        "cpu": {
            "python_version": "3.12.4.final.0 (64 bit)",
            "cpuinfo_version": [
                9,
                0,
                0
            ],
            "cpuinfo_version_string": "9.0.0",
            "arch": "X86_64",
            "bits": 64,
            "count": 2,
            "arch_string_raw": "x86_64",
            "vendor_id_raw": "AuthenticAMD",
            "brand_raw": "AMD EPYC 7B13",
            "hz_advertised_friendly": "2.4500 GHz",
            "hz_actual_friendly": "2.4500 GHz",
            "hz_advertised": [
                2449998000,
                0
            ],
            "hz_actual": [
                2449998000,
                0
            ],
            "model": 1,
            "family": 25,
            "flags": [
                "3dnowext",
                "3dnowprefetch",
                "abm",
                "adx",
                "aes",
                "apic",
                "arat",
                "avx",
                "avx2",
                "bmi1",
                "bmi2",
                "clflush",
                "clflushopt",
                "clwb",
                "clzero",
                "cmov",
                "cmp_legacy",
                "constant_tsc",
                "cpuid",
                "cr8_legacy",
                "cx16",
                "cx8",
                "de",
                "erms",
                "extd_apicid",
                "f16c",
                "fma",
                "fpu",
                "fsgsbase",
                "fsrm",
                "fxsr",
                "fxsr_opt",
                "ht",
                "hypervisor",
                "ibpb",
                "ibrs",
                "invpcid",
                "invpcid_single",
                "lahf_lm",
                "lm",
                "mca",
                "mce",
                "misalignsse",
                "mmx",
                "mmxext",
                "movbe",
                "msr",
                "mtrr",
                "nonstop_tsc",
                "nopl",
                "npt",
                "nrip_save",
                "nx",
                "osvw",
                "osxsave",
                "pae",
                "pat",
                "pcid",
                "pclmulqdq",
                "pdpe1gb",
                "pge",
                "pni",
                "popcnt",
                "pse",
                "pse36",
                "rdpid",
                "rdrand",
                "rdrnd",
                "rdseed",
                "rdtscp",
                "rep_good",
                "sep",
                "sha",
                "sha_ni",
                "smap",
                "smep",
                "ssbd",
                "sse",
                "sse2",
                "sse4_1",
                "sse4_2",
                "sse4a",
                "ssse3",
                "stibp",
                "syscall",
                "topoext",
                "tsc",
                "tsc_adjust",
                "tsc_known_freq",
                "umip",
                "vaes",
                "vme",
                "vmmcall",
                "vpclmulqdq",
                "x2apic",
                "xgetbv1",
                "xsave",
                "xsavec",
                "xsaveerptr",
                "xsaveopt"
            ],
            "l3_cache_size": 524288,
            "l2_cache_size": 524288,
            "l1_data_cache_size": 32768,
            "l1_instruction_cache_size": 32768,
            "l2_cache_line_size": 512,
            "l2_cache_associativity": 6
        }
    },
    "commit_info": {
        "id": "250bca1582f7d46c5b0df6b314595e1be9707438",
        "time": "2024-06-29T05:59:36+00:00",
        "author_time": "2024-06-29T05:59:36+00:00",
        "dirty": false,
        "project": "finesse3",
        "branch": "(detached head)"
    },
    "benchmarks": [
        {
            "group": null,
            "name": "test_01_simple_cav",
            "fullname": "tests/benchmarks/test_benchmarks.py::test_01_simple_cav",
            "params": null,
            "param": null,
            "extra_info": {},
            "options": {
                "disable_gc": false,
                "timer": "perf_counter",
                "min_rounds": 5,
                "max_time": 1.0,
                "min_time": 5e-06,
                "warmup": false
            },
            "stats": {
                "min": 0.35120534400000736,
                "max": 0.5575177099999991,
                "mean": 0.3966908782000019,
                "stddev": 0.09004342492209566,
                "rounds": 5,
                "median": 0.360093906000003,
                "iqr": 0.059613743749991954,
                "q1": 0.3517725465000048,
                "q3": 0.41138629024999673,
                "iqr_outliers": 1,
                "stddev_outliers": 1,
                "outliers": "1;1",
                "ld15iqr": 0.35120534400000736,
                "hd15iqr": 0.5575177099999991,
                "ops": 2.5208545367555044,
                "total": 1.9834543910000093,
                "iterations": 1
            }
        },
        {
            "group": null,
            "name": "test_02_pdh_lock",
            "fullname": "tests/benchmarks/test_benchmarks.py::test_02_pdh_lock",
            "params": null,
            "param": null,
            "extra_info": {},
            "options": {
                "disable_gc": false,
                "timer": "perf_counter",
                "min_rounds": 5,
                "max_time": 1.0,
                "min_time": 5e-06,
                "warmup": false
            },
            "stats": {
                "min": 1.3140942050000035,
                "max": 1.5780894389999958,
                "mean": 1.3943609984000034,
                "stddev": 0.10629560282812905,
                "rounds": 5,
                "median": 1.3507858959999908,
                "iqr": 0.10430221299998976,
                "q1": 1.332685143500015,
                "q3": 1.4369873565000049,
                "iqr_outliers": 0,
                "stddev_outliers": 1,
                "outliers": "1;0",
                "ld15iqr": 1.3140942050000035,
                "hd15iqr": 1.5780894389999958,
                "ops": 0.7171743910992036,
                "total": 6.971804992000017,
                "iterations": 1
            }
        },
        {
            "group": null,
            "name": "test_03_near_unstable",
            "fullname": "tests/benchmarks/test_benchmarks.py::test_03_near_unstable",
            "params": null,
            "param": null,
            "extra_info": {},
            "options": {
                "disable_gc": false,
                "timer": "perf_counter",
                "min_rounds": 5,
                "max_time": 1.0,
                "min_time": 5e-06,
                "warmup": false
            },
            "stats": {
                "min": 1.6999999843392288e-06,
                "max": 5.28900000063004e-05,
                "mean": 2.8879495768043435e-06,
                "stddev": 1.086341771125273e-06,
                "rounds": 33080,
                "median": 3.1400000182202348e-06,
                "iqr": 2.699999868127634e-07,
                "q1": 2.920000014228208e-06,
                "q3": 3.1900000010409713e-06,
                "iqr_outliers": 8369,
                "stddev_outliers": 6932,
                "outliers": "6932;8369",
                "ld15iqr": 2.520000009553769e-06,
                "hd15iqr": 3.599999985226532e-06,
                "ops": 346266.4334695721,
                "total": 0.09553337200068768,
                "iterations": 1
            }
        },
        {
            "group": null,
            "name": "test_04_geometrical_params",
            "fullname": "tests/benchmarks/test_benchmarks.py::test_04_geometrical_params",
            "params": null,
            "param": null,
            "extra_info": {},
            "options": {
                "disable_gc": false,
                "timer": "perf_counter",
                "min_rounds": 5,
                "max_time": 1.0,
                "min_time": 5e-06,
                "warmup": false
            },
            "stats": {
                "min": 0.50565903399999,
                "max": 0.8866665859999898,
                "mean": 0.5881047677999959,
                "stddev": 0.1669669182608576,
                "rounds": 5,
                "median": 0.5159295360000158,
                "iqr": 0.09797682624999737,
                "q1": 0.5121530454999927,
                "q3": 0.6101298717499901,
                "iqr_outliers": 1,
                "stddev_outliers": 1,
                "outliers": "1;1",
                "ld15iqr": 0.50565903399999,
                "hd15iqr": 0.8866665859999898,
                "ops": 1.700377304779958,
                "total": 2.9405238389999795,
                "iterations": 1
            }
        },
        {
            "group": null,
            "name": "test_05_modulation",
            "fullname": "tests/benchmarks/test_benchmarks.py::test_05_modulation",
            "params": null,
            "param": null,
            "extra_info": {},
            "options": {
                "disable_gc": false,
                "timer": "perf_counter",
                "min_rounds": 5,
                "max_time": 1.0,
                "min_time": 5e-06,
                "warmup": false
            },
            "stats": {
                "min": 0.1734609359999979,
                "max": 0.1854326690000221,
                "mean": 0.1761256193750036,
                "stddev": 0.0038651946345804027,
                "rounds": 8,
                "median": 0.17482017700000085,
                "iqr": 0.0014164950000150611,
                "q1": 0.17440950149999424,
                "q3": 0.1758259965000093,
                "iqr_outliers": 1,
                "stddev_outliers": 1,
                "outliers": "1;1",
                "ld15iqr": 0.1734609359999979,
                "hd15iqr": 0.1854326690000221,
                "ops": 5.677765696714556,
                "total": 1.4090049550000288,
                "iterations": 1
            }
        },
        {
            "group": null,
            "name": "test_06_radiation_pressure",
            "fullname": "tests/benchmarks/test_benchmarks.py::test_06_radiation_pressure",
            "params": null,
            "param": null,
            "extra_info": {},
            "options": {
                "disable_gc": false,
                "timer": "perf_counter",
                "min_rounds": 5,
                "max_time": 1.0,
                "min_time": 5e-06,
                "warmup": false
            },
            "stats": {
                "min": 0.3014507320000064,
                "max": 0.7365017930000022,
                "mean": 0.3965710776000037,
                "stddev": 0.1901548551291311,
                "rounds": 5,
                "median": 0.31381192099999566,
                "iqr": 0.1166522837500068,
                "q1": 0.30807702700000306,
                "q3": 0.42472931075000986,
                "iqr_outliers": 1,
                "stddev_outliers": 1,
                "outliers": "1;1",
                "ld15iqr": 0.3014507320000064,
                "hd15iqr": 0.7365017930000022,
                "ops": 2.521616064519554,
                "total": 1.9828553880000186,
                "iterations": 1
            }
        },
        {
            "group": null,
            "name": "test_07_homodyne",
            "fullname": "tests/benchmarks/test_benchmarks.py::test_07_homodyne",
            "params": null,
            "param": null,
            "extra_info": {},
            "options": {
                "disable_gc": false,
                "timer": "perf_counter",
                "min_rounds": 5,
                "max_time": 1.0,
                "min_time": 5e-06,
                "warmup": false
            },
            "stats": {
                "min": 0.11814823899999283,
                "max": 0.12431122899999991,
                "mean": 0.12038416899999523,
                "stddev": 0.0020059627749835383,
                "rounds": 9,
                "median": 0.1195330090000084,
                "iqr": 0.0029193250000218995,
                "q1": 0.11884062649998128,
                "q3": 0.12175995150000318,
                "iqr_outliers": 0,
                "stddev_outliers": 2,
                "outliers": "2;0",
                "ld15iqr": 0.11814823899999283,
                "hd15iqr": 0.12431122899999991,
                "ops": 8.306740066462059,
                "total": 1.083457520999957,
                "iterations": 1
            }
        },
        {
            "group": null,
            "name": "test_08_optical_spring",
            "fullname": "tests/benchmarks/test_benchmarks.py::test_08_optical_spring",
            "params": null,
            "param": null,
            "extra_info": {},
            "options": {
                "disable_gc": false,
                "timer": "perf_counter",
                "min_rounds": 5,
                "max_time": 1.0,
                "min_time": 5e-06,
                "warmup": false
            },
            "stats": {
                "min": 0.2933182239999894,
                "max": 0.7873757980000278,
                "mean": 0.39376696219999874,
                "stddev": 0.22003971222320606,
                "rounds": 5,
                "median": 0.2965479830000106,
                "iqr": 0.12564743850001037,
                "q1": 0.29411033574998413,
                "q3": 0.4197577742499945,
                "iqr_outliers": 1,
                "stddev_outliers": 1,
                "outliers": "1;1",
                "ld15iqr": 0.2933182239999894,
                "hd15iqr": 0.7873757980000278,
                "ops": 2.539573138419085,
                "total": 1.9688348109999936,
                "iterations": 1
            }
        },
        {
            "group": null,
            "name": "test_09_aligo_sensitivity",
            "fullname": "tests/benchmarks/test_benchmarks.py::test_09_aligo_sensitivity",
            "params": null,
            "param": null,
            "extra_info": {},
            "options": {
                "disable_gc": false,
                "timer": "perf_counter",
                "min_rounds": 5,
                "max_time": 1.0,
                "min_time": 5e-06,
                "warmup": false
            },
            "stats": {
                "min": 0.312557360999989,
                "max": 0.891453327999983,
                "mean": 0.4294211885999971,
                "stddev": 0.2582894236747939,
                "rounds": 5,
                "median": 0.3132289010000022,
                "iqr": 0.14756924350000133,
                "q1": 0.31291659675000005,
                "q3": 0.4604858402500014,
                "iqr_outliers": 1,
                "stddev_outliers": 1,
                "outliers": "1;1",
                "ld15iqr": 0.312557360999989,
                "hd15iqr": 0.891453327999983,
                "ops": 2.3287160171583734,
                "total": 2.1471059429999855,
                "iterations": 1
            }
        },
        {
            "group": null,
            "name": "test_10_shifted_beam",
            "fullname": "tests/benchmarks/test_benchmarks.py::test_10_shifted_beam",
            "params": null,
            "param": null,
            "extra_info": {},
            "options": {
                "disable_gc": false,
                "timer": "perf_counter",
                "min_rounds": 5,
                "max_time": 1.0,
                "min_time": 5e-06,
                "warmup": false
            },
            "stats": {
                "min": 0.6996272960000169,
                "max": 0.7117117349999944,
                "mean": 0.7037940278000008,
                "stddev": 0.004898444005254689,
                "rounds": 5,
                "median": 0.7037606559999858,
                "iqr": 0.006205894750003438,
                "q1": 0.6997658510000022,
                "q3": 0.7059717457500057,
                "iqr_outliers": 0,
                "stddev_outliers": 1,
                "outliers": "1;0",
                "ld15iqr": 0.6996272960000169,
                "hd15iqr": 0.7117117349999944,
                "ops": 1.4208702553585364,
                "total": 3.518970139000004,
                "iterations": 1
            }
        },
        {
            "group": null,
            "name": "test_angular_radiation_pressure",
            "fullname": "tests/benchmarks/test_benchmarks.py::test_angular_radiation_pressure",
            "params": null,
            "param": null,
            "extra_info": {},
            "options": {
                "disable_gc": false,
                "timer": "perf_counter",
                "min_rounds": 5,
                "max_time": 1.0,
                "min_time": 5e-06,
                "warmup": false
            },
            "stats": {
                "min": 0.3369996790000016,
                "max": 0.9904013999999961,
                "mean": 0.4683238573999972,
                "stddev": 0.2918507576612247,
                "rounds": 5,
                "median": 0.3381455100000039,
                "iqr": 0.16401013025001276,
                "q1": 0.3374473314999875,
                "q3": 0.5014574617500003,
                "iqr_outliers": 1,
                "stddev_outliers": 1,
                "outliers": "1;1",
                "ld15iqr": 0.3369996790000016,
                "hd15iqr": 0.9904013999999961,
                "ops": 2.135274520396462,
                "total": 2.341619286999986,
                "iterations": 1
            }
        },
        {
            "group": null,
            "name": "test_cavity_eigenmodes",
            "fullname": "tests/benchmarks/test_benchmarks.py::test_cavity_eigenmodes",
            "params": null,
            "param": null,
            "extra_info": {},
            "options": {
                "disable_gc": false,
                "timer": "perf_counter",
                "min_rounds": 5,
                "max_time": 1.0,
                "min_time": 5e-06,
                "warmup": false
            },
            "stats": {
                "min": 0.2577977070000088,
                "max": 0.2658031450000067,
                "mean": 0.2616988380000066,
                "stddev": 0.0029933638876938075,
                "rounds": 5,
                "median": 0.2608411960000012,
                "iqr": 0.0037847319999997353,
                "q1": 0.2600772937500082,
                "q3": 0.26386202575000794,
                "iqr_outliers": 0,
                "stddev_outliers": 2,
                "outliers": "2;0",
                "ld15iqr": 0.2577977070000088,
                "hd15iqr": 0.2658031450000067,
                "ops": 3.8211862446251086,
                "total": 1.308494190000033,
                "iterations": 1
            }
        },
        {
            "group": null,
            "name": "test_coupled_cavity_commands",
            "fullname": "tests/benchmarks/test_benchmarks.py::test_coupled_cavity_commands",
            "params": null,
            "param": null,
            "extra_info": {},
            "options": {
                "disable_gc": false,
                "timer": "perf_counter",
                "min_rounds": 5,
                "max_time": 1.0,
                "min_time": 5e-06,
                "warmup": false
            },
            "stats": {
                "min": 4.2417274819999875,
                "max": 5.192997614999996,
                "mean": 4.475816956199997,
                "stddev": 0.40216260599579856,
                "rounds": 5,
                "median": 4.31495858400001,
                "iqr": 0.23867840574998667,
                "q1": 4.296026846750003,
                "q3": 4.53470525249999,
                "iqr_outliers": 1,
                "stddev_outliers": 1,
                "outliers": "1;1",
                "ld15iqr": 4.2417274819999875,
                "hd15iqr": 5.192997614999996,
                "ops": 0.22342289905640098,
                "total": 22.37908478099999,
                "iterations": 1
            }
        },
        {
            "group": null,
            "name": "test_frequency_dependant_squeezing",
            "fullname": "tests/benchmarks/test_benchmarks.py::test_frequency_dependant_squeezing",
            "params": null,
            "param": null,
            "extra_info": {},
            "options": {
                "disable_gc": false,
                "timer": "perf_counter",
                "min_rounds": 5,
                "max_time": 1.0,
                "min_time": 5e-06,
                "warmup": false
            },
            "stats": {
                "min": 1.4721920050000108,
                "max": 2.810108282999977,
                "mean": 1.7645447245999946,
                "stddev": 0.5848773763306391,
                "rounds": 5,
                "median": 1.511727731999997,
                "iqr": 0.3591147522500009,
                "q1": 1.4914910109999937,
                "q3": 1.8506057632499946,
                "iqr_outliers": 1,
                "stddev_outliers": 1,
                "outliers": "1;1",
                "ld15iqr": 1.4721920050000108,
                "hd15iqr": 2.810108282999977,
                "ops": 0.5667184209381206,
                "total": 8.822723622999973,
                "iterations": 1
            }
        },
        {
            "group": null,
            "name": "test_lock_actions",
            "fullname": "tests/benchmarks/test_benchmarks.py::test_lock_actions",
            "params": null,
            "param": null,
            "extra_info": {},
            "options": {
                "disable_gc": false,
                "timer": "perf_counter",
                "min_rounds": 5,
                "max_time": 1.0,
                "min_time": 5e-06,
                "warmup": false
            },
            "stats": {
                "min": 4.722694233999988,
                "max": 4.941099403999999,
                "mean": 4.850476909599996,
                "stddev": 0.08318066980412593,
                "rounds": 5,
                "median": 4.855093016000012,
                "iqr": 0.1085218569999924,
                "q1": 4.803774986499995,
                "q3": 4.912296843499988,
                "iqr_outliers": 0,
                "stddev_outliers": 2,
                "outliers": "2;0",
                "ld15iqr": 4.722694233999988,
                "hd15iqr": 4.941099403999999,
                "ops": 0.20616529439008646,
                "total": 24.25238454799998,
                "iterations": 1
            }
        }
    ],
    "datetime": "2024-06-29T06:06:21.363377",
    "version": "4.0.0"
}