{
    "machine_info": {
        "node": "runner-nthfetyx-project-39604133-concurrent-0",
        "processor": "",
        "machine": "x86_64",
        "python_compiler": "GCC 12.2.0",
        "python_implementation": "CPython",
        "python_implementation_version": "3.12.5",
        "python_version": "3.12.5",
        "python_build": [
            "main",
            "Aug 13 2024 02:19:05"
        ],
        "release": "5.15.154+",
        "system": "Linux",
        "cpu": {
            "python_version": "3.12.5.final.0 (64 bit)",
            "cpuinfo_version": [
                9,
                0,
                0
            ],
            "cpuinfo_version_string": "9.0.0",
            "arch": "X86_64",
            "bits": 64,
            "count": 2,
            "arch_string_raw": "x86_64",
            "vendor_id_raw": "AuthenticAMD",
            "brand_raw": "AMD EPYC 7B13",
            "hz_advertised_friendly": "2.4500 GHz",
            "hz_actual_friendly": "2.4500 GHz",
            "hz_advertised": [
                2450002000,
                0
            ],
            "hz_actual": [
                2450002000,
                0
            ],
            "model": 1,
            "family": 25,
            "flags": [
                "3dnowext",
                "3dnowprefetch",
                "abm",
                "adx",
                "aes",
                "apic",
                "arat",
                "avx",
                "avx2",
                "bmi1",
                "bmi2",
                "clflush",
                "clflushopt",
                "clwb",
                "clzero",
                "cmov",
                "cmp_legacy",
                "constant_tsc",
                "cpuid",
                "cr8_legacy",
                "cx16",
                "cx8",
                "de",
                "erms",
                "extd_apicid",
                "f16c",
                "fma",
                "fpu",
                "fsgsbase",
                "fsrm",
                "fxsr",
                "fxsr_opt",
                "ht",
                "hypervisor",
                "ibpb",
                "ibrs",
                "invpcid",
                "invpcid_single",
                "lahf_lm",
                "lm",
                "mca",
                "mce",
                "misalignsse",
                "mmx",
                "mmxext",
                "movbe",
                "msr",
                "mtrr",
                "nonstop_tsc",
                "nopl",
                "npt",
                "nrip_save",
                "nx",
                "osvw",
                "osxsave",
                "pae",
                "pat",
                "pcid",
                "pclmulqdq",
                "pdpe1gb",
                "pge",
                "pni",
                "popcnt",
                "pse",
                "pse36",
                "rdpid",
                "rdrand",
                "rdrnd",
                "rdseed",
                "rdtscp",
                "rep_good",
                "sep",
                "sha",
                "sha_ni",
                "smap",
                "smep",
                "ssbd",
                "sse",
                "sse2",
                "sse4_1",
                "sse4_2",
                "sse4a",
                "ssse3",
                "stibp",
                "syscall",
                "topoext",
                "tsc",
                "tsc_adjust",
                "tsc_known_freq",
                "umip",
                "vaes",
                "vme",
                "vmmcall",
                "vpclmulqdq",
                "x2apic",
                "xgetbv1",
                "xsave",
                "xsavec",
                "xsaveerptr",
                "xsaveopt"
            ],
            "l3_cache_size": 524288,
            "l2_cache_size": 524288,
            "l1_data_cache_size": 32768,
            "l1_instruction_cache_size": 32768,
            "l2_cache_line_size": 512,
            "l2_cache_associativity": 6
        }
    },
    "commit_info": {
        "id": "132a2e43df96b9a9fe70cc4530349db5be3ad5bf",
        "time": "2024-08-16T15:08:05+02:00",
        "author_time": "2024-08-16T15:08:05+02:00",
        "dirty": false,
        "project": "finesse3",
        "branch": "(detached head)"
    },
    "benchmarks": [
        {
            "group": null,
            "name": "test_01_simple_cav",
            "fullname": "tests/benchmarks/test_benchmarks.py::test_01_simple_cav",
            "params": null,
            "param": null,
            "extra_info": {},
            "options": {
                "disable_gc": false,
                "timer": "perf_counter",
                "min_rounds": 5,
                "max_time": 1.0,
                "min_time": 5e-06,
                "warmup": false
            },
            "stats": {
                "min": 0.2705202639999982,
                "max": 0.49078767099999254,
                "mean": 0.34827560539999636,
                "stddev": 0.1053767202372053,
                "rounds": 5,
                "median": 0.2757505649999956,
                "iqr": 0.17493260100000185,
                "q1": 0.27181701399999625,
                "q3": 0.4467496149999981,
                "iqr_outliers": 0,
                "stddev_outliers": 1,
                "outliers": "1;0",
                "ld15iqr": 0.2705202639999982,
                "hd15iqr": 0.49078767099999254,
                "ops": 2.8712892447677887,
                "total": 1.741378026999982,
                "iterations": 1
            }
        },
        {
            "group": null,
            "name": "test_02_pdh_lock",
            "fullname": "tests/benchmarks/test_benchmarks.py::test_02_pdh_lock",
            "params": null,
            "param": null,
            "extra_info": {},
            "options": {
                "disable_gc": false,
                "timer": "perf_counter",
                "min_rounds": 5,
                "max_time": 1.0,
                "min_time": 5e-06,
                "warmup": false
            },
            "stats": {
                "min": 1.1783292029999899,
                "max": 1.5040042139999912,
                "mean": 1.3123088247999959,
                "stddev": 0.1575266574468093,
                "rounds": 5,
                "median": 1.2122677840000051,
                "iqr": 0.2760058320000063,
                "q1": 1.197392357249992,
                "q3": 1.4733981892499983,
                "iqr_outliers": 0,
                "stddev_outliers": 1,
                "outliers": "1;0",
                "ld15iqr": 1.1783292029999899,
                "hd15iqr": 1.5040042139999912,
                "ops": 0.7620157550585749,
                "total": 6.56154412399998,
                "iterations": 1
            }
        },
        {
            "group": null,
            "name": "test_03_near_unstable",
            "fullname": "tests/benchmarks/test_benchmarks.py::test_03_near_unstable",
            "params": null,
            "param": null,
            "extra_info": {},
            "options": {
                "disable_gc": false,
                "timer": "perf_counter",
                "min_rounds": 5,
                "max_time": 1.0,
                "min_time": 5e-06,
                "warmup": false
            },
            "stats": {
                "min": 1.8800000134433503e-06,
                "max": 2.7790000018512728e-05,
                "mean": 1.985687358098396e-06,
                "stddev": 4.934764206471098e-07,
                "rounds": 51922,
                "median": 1.9499999837080395e-06,
                "iqr": 2.9000005952184438e-08,
                "q1": 1.9399999757752084e-06,
                "q3": 1.968999981727393e-06,
                "iqr_outliers": 1401,
                "stddev_outliers": 403,
                "outliers": "403;1401",
                "ld15iqr": 1.8999999724655936e-06,
                "hd15iqr": 2.019999982394438e-06,
                "ops": 503603.95150909125,
                "total": 0.10310085900718491,
                "iterations": 1
            }
        },
        {
            "group": null,
            "name": "test_04_geometrical_params",
            "fullname": "tests/benchmarks/test_benchmarks.py::test_04_geometrical_params",
            "params": null,
            "param": null,
            "extra_info": {},
            "options": {
                "disable_gc": false,
                "timer": "perf_counter",
                "min_rounds": 5,
                "max_time": 1.0,
                "min_time": 5e-06,
                "warmup": false
            },
            "stats": {
                "min": 0.45277801899999304,
                "max": 0.8283069150000131,
                "mean": 0.5358139712000025,
                "stddev": 0.16363425782976498,
                "rounds": 5,
                "median": 0.46628336400002013,
                "iqr": 0.10001096299999546,
                "q1": 0.4595182194999978,
                "q3": 0.5595291824999933,
                "iqr_outliers": 1,
                "stddev_outliers": 1,
                "outliers": "1;1",
                "ld15iqr": 0.45277801899999304,
                "hd15iqr": 0.8283069150000131,
                "ops": 1.8663193827522118,
                "total": 2.6790698560000124,
                "iterations": 1
            }
        },
        {
            "group": null,
            "name": "test_05_modulation",
            "fullname": "tests/benchmarks/test_benchmarks.py::test_05_modulation",
            "params": null,
            "param": null,
            "extra_info": {},
            "options": {
                "disable_gc": false,
                "timer": "perf_counter",
                "min_rounds": 5,
                "max_time": 1.0,
                "min_time": 5e-06,
                "warmup": false
            },
            "stats": {
                "min": 0.11963702700001022,
                "max": 0.5307276739999907,
                "mean": 0.17658962825000302,
                "stddev": 0.14322881925806855,
                "rounds": 8,
                "median": 0.127291859500005,
                "iqr": 0.013586778999979288,
                "q1": 0.12014876200001368,
                "q3": 0.13373554099999296,
                "iqr_outliers": 1,
                "stddev_outliers": 1,
                "outliers": "1;1",
                "ld15iqr": 0.11963702700001022,
                "hd15iqr": 0.5307276739999907,
                "ops": 5.662846736300227,
                "total": 1.4127170260000241,
                "iterations": 1
            }
        },
        {
            "group": null,
            "name": "test_06_radiation_pressure",
            "fullname": "tests/benchmarks/test_benchmarks.py::test_06_radiation_pressure",
            "params": null,
            "param": null,
            "extra_info": {},
            "options": {
                "disable_gc": false,
                "timer": "perf_counter",
                "min_rounds": 5,
                "max_time": 1.0,
                "min_time": 5e-06,
                "warmup": false
            },
            "stats": {
                "min": 0.2433491950000075,
                "max": 0.24848838699998055,
                "mean": 0.24635247599999843,
                "stddev": 0.0018948963619319359,
                "rounds": 5,
                "median": 0.24645528599998556,
                "iqr": 0.0020180129999829433,
                "q1": 0.245521758250014,
                "q3": 0.24753977124999693,
                "iqr_outliers": 0,
                "stddev_outliers": 2,
                "outliers": "2;0",
                "ld15iqr": 0.2433491950000075,
                "hd15iqr": 0.24848838699998055,
                "ops": 4.059224474772506,
                "total": 1.2317623799999922,
                "iterations": 1
            }
        },
        {
            "group": null,
            "name": "test_07_homodyne",
            "fullname": "tests/benchmarks/test_benchmarks.py::test_07_homodyne",
            "params": null,
            "param": null,
            "extra_info": {},
            "options": {
                "disable_gc": false,
                "timer": "perf_counter",
                "min_rounds": 5,
                "max_time": 1.0,
                "min_time": 5e-06,
                "warmup": false
            },
            "stats": {
                "min": 0.0840403560000027,
                "max": 0.6106219679999754,
                "mean": 0.13405506599999678,
                "stddev": 0.1580656073662207,
                "rounds": 11,
                "median": 0.08646277700000837,
                "iqr": 0.0024146002499918495,
                "q1": 0.08527643175000321,
                "q3": 0.08769103199999506,
                "iqr_outliers": 1,
                "stddev_outliers": 1,
                "outliers": "1;1",
                "ld15iqr": 0.0840403560000027,
                "hd15iqr": 0.6106219679999754,
                "ops": 7.459621108239386,
                "total": 1.4746057259999645,
                "iterations": 1
            }
        },
        {
            "group": null,
            "name": "test_08_optical_spring",
            "fullname": "tests/benchmarks/test_benchmarks.py::test_08_optical_spring",
            "params": null,
            "param": null,
            "extra_info": {},
            "options": {
                "disable_gc": false,
                "timer": "perf_counter",
                "min_rounds": 5,
                "max_time": 1.0,
                "min_time": 5e-06,
                "warmup": false
            },
            "stats": {
                "min": 0.23142581199999768,
                "max": 0.25040693700000816,
                "mean": 0.2389717818000065,
                "stddev": 0.006990336740326813,
                "rounds": 5,
                "median": 0.23771878300001958,
                "iqr": 0.006491364499979113,
                "q1": 0.23522367775001385,
                "q3": 0.24171504224999296,
                "iqr_outliers": 0,
                "stddev_outliers": 2,
                "outliers": "2;0",
                "ld15iqr": 0.23142581199999768,
                "hd15iqr": 0.25040693700000816,
                "ops": 4.184594484201033,
                "total": 1.1948589090000326,
                "iterations": 1
            }
        },
        {
            "group": null,
            "name": "test_09_aligo_sensitivity",
            "fullname": "tests/benchmarks/test_benchmarks.py::test_09_aligo_sensitivity",
            "params": null,
            "param": null,
            "extra_info": {},
            "options": {
                "disable_gc": false,
                "timer": "perf_counter",
                "min_rounds": 5,
                "max_time": 1.0,
                "min_time": 5e-06,
                "warmup": false
            },
            "stats": {
                "min": 0.25178659799999537,
                "max": 0.9029351589999806,
                "mean": 0.38414551299999855,
                "stddev": 0.2900217543322963,
                "rounds": 5,
                "median": 0.2557574410000143,
                "iqr": 0.1665204235000033,
                "q1": 0.25242314549999634,
                "q3": 0.4189435689999996,
                "iqr_outliers": 1,
                "stddev_outliers": 1,
                "outliers": "1;1",
                "ld15iqr": 0.25178659799999537,
                "hd15iqr": 0.9029351589999806,
                "ops": 2.603180217283974,
                "total": 1.9207275649999929,
                "iterations": 1
            }
        },
        {
            "group": null,
            "name": "test_10_shifted_beam",
            "fullname": "tests/benchmarks/test_benchmarks.py::test_10_shifted_beam",
            "params": null,
            "param": null,
            "extra_info": {},
            "options": {
                "disable_gc": false,
                "timer": "perf_counter",
                "min_rounds": 5,
                "max_time": 1.0,
                "min_time": 5e-06,
                "warmup": false
            },
            "stats": {
                "min": 0.7169730729999912,
                "max": 1.4794330310000134,
                "mean": 0.8735051714000065,
                "stddev": 0.3387534339653294,
                "rounds": 5,
                "median": 0.7223508520000053,
                "iqr": 0.19757668225002334,
                "q1": 0.7190507597499973,
                "q3": 0.9166274420000207,
                "iqr_outliers": 1,
                "stddev_outliers": 1,
                "outliers": "1;1",
                "ld15iqr": 0.7169730729999912,
                "hd15iqr": 1.4794330310000134,
                "ops": 1.1448129132392593,
                "total": 4.367525857000032,
                "iterations": 1
            }
        },
        {
            "group": null,
            "name": "test_angular_radiation_pressure",
            "fullname": "tests/benchmarks/test_benchmarks.py::test_angular_radiation_pressure",
            "params": null,
            "param": null,
            "extra_info": {},
            "options": {
                "disable_gc": false,
                "timer": "perf_counter",
                "min_rounds": 5,
                "max_time": 1.0,
                "min_time": 5e-06,
                "warmup": false
            },
            "stats": {
                "min": 0.28908350600002564,
                "max": 0.3009575220000045,
                "mean": 0.29661579380000946,
                "stddev": 0.005078008631952857,
                "rounds": 5,
                "median": 0.29904504300000667,
                "iqr": 0.007871425000004706,
                "q1": 0.2925667527500053,
                "q3": 0.30043817775001,
                "iqr_outliers": 0,
                "stddev_outliers": 1,
                "outliers": "1;0",
                "ld15iqr": 0.28908350600002564,
                "hd15iqr": 0.3009575220000045,
                "ops": 3.3713646437662086,
                "total": 1.4830789690000472,
                "iterations": 1
            }
        },
        {
            "group": null,
            "name": "test_cavity_eigenmodes",
            "fullname": "tests/benchmarks/test_benchmarks.py::test_cavity_eigenmodes",
            "params": null,
            "param": null,
            "extra_info": {},
            "options": {
                "disable_gc": false,
                "timer": "perf_counter",
                "min_rounds": 5,
                "max_time": 1.0,
                "min_time": 5e-06,
                "warmup": false
            },
            "stats": {
                "min": 0.25696164799998655,
                "max": 1.102788435000008,
                "mean": 0.429257018200002,
                "stddev": 0.3765382141538573,
                "rounds": 5,
                "median": 0.26022503600000846,
                "iqr": 0.21835193875001124,
                "q1": 0.25815903049999633,
                "q3": 0.4765109692500076,
                "iqr_outliers": 1,
                "stddev_outliers": 1,
                "outliers": "1;1",
                "ld15iqr": 0.25696164799998655,
                "hd15iqr": 1.102788435000008,
                "ops": 2.3296066403137385,
                "total": 2.14628509100001,
                "iterations": 1
            }
        },
        {
            "group": null,
            "name": "test_coupled_cavity_commands",
            "fullname": "tests/benchmarks/test_benchmarks.py::test_coupled_cavity_commands",
            "params": null,
            "param": null,
            "extra_info": {},
            "options": {
                "disable_gc": false,
                "timer": "perf_counter",
                "min_rounds": 5,
                "max_time": 1.0,
                "min_time": 5e-06,
                "warmup": false
            },
            "stats": {
                "min": 4.352617592999991,
                "max": 5.4639981549999845,
                "mean": 4.805023291000003,
                "stddev": 0.5805643766869322,
                "rounds": 5,
                "median": 4.400728026000024,
                "iqr": 1.0473164327500157,
                "q1": 4.3813335074999955,
                "q3": 5.428649940250011,
                "iqr_outliers": 0,
                "stddev_outliers": 2,
                "outliers": "2;0",
                "ld15iqr": 4.352617592999991,
                "hd15iqr": 5.4639981549999845,
                "ops": 0.2081155364788843,
                "total": 24.025116455000017,
                "iterations": 1
            }
        },
        {
            "group": null,
            "name": "test_frequency_dependant_squeezing",
            "fullname": "tests/benchmarks/test_benchmarks.py::test_frequency_dependant_squeezing",
            "params": null,
            "param": null,
            "extra_info": {},
            "options": {
                "disable_gc": false,
                "timer": "perf_counter",
                "min_rounds": 5,
                "max_time": 1.0,
                "min_time": 5e-06,
                "warmup": false
            },
            "stats": {
                "min": 1.4823207700000012,
                "max": 2.7480904969999926,
                "mean": 1.7401312634000021,
                "stddev": 0.5634948980786214,
                "rounds": 5,
                "median": 1.490471446000015,
                "iqr": 0.32612459125000015,
                "q1": 1.4831542142499998,
                "q3": 1.8092788055,
                "iqr_outliers": 1,
                "stddev_outliers": 1,
                "outliers": "1;1",
                "ld15iqr": 1.4823207700000012,
                "hd15iqr": 2.7480904969999926,
                "ops": 0.5746692913534138,
                "total": 8.70065631700001,
                "iterations": 1
            }
        },
        {
            "group": null,
            "name": "test_lock_actions",
            "fullname": "tests/benchmarks/test_benchmarks.py::test_lock_actions",
            "params": null,
            "param": null,
            "extra_info": {},
            "options": {
                "disable_gc": false,
                "timer": "perf_counter",
                "min_rounds": 5,
                "max_time": 1.0,
                "min_time": 5e-06,
                "warmup": false
            },
            "stats": {
                "min": 3.081227761000008,
                "max": 4.447531899000012,
                "mean": 3.3726161904000036,
                "stddev": 0.6010833288740975,
                "rounds": 5,
                "median": 3.1089373679999994,
                "iqr": 0.3567973475000201,
                "q1": 3.097215255249992,
                "q3": 3.454012602750012,
                "iqr_outliers": 1,
                "stddev_outliers": 1,
                "outliers": "1;1",
                "ld15iqr": 3.081227761000008,
                "hd15iqr": 4.447531899000012,
                "ops": 0.2965057224259475,
                "total": 16.86308095200002,
                "iterations": 1
            }
        }
    ],
    "datetime": "2024-08-16T13:16:46.924662",
    "version": "4.0.0"
}