{
    "machine_info": {
        "node": "runner--azerasq-project-39604133-concurrent-0",
        "processor": "",
        "machine": "x86_64",
        "python_compiler": "GCC 12.2.0",
        "python_implementation": "CPython",
        "python_implementation_version": "3.12.3",
        "python_version": "3.12.3",
        "python_build": [
            "main",
            "Apr 24 2024 11:17:35"
        ],
        "release": "5.4.109+",
        "system": "Linux",
        "cpu": {
            "python_version": "3.12.3.final.0 (64 bit)",
            "cpuinfo_version": [
                9,
                0,
                0
            ],
            "cpuinfo_version_string": "9.0.0",
            "arch": "X86_64",
            "bits": 64,
            "count": 2,
            "arch_string_raw": "x86_64",
            "vendor_id_raw": "AuthenticAMD",
            "brand_raw": "AMD EPYC 7B13",
            "hz_advertised_friendly": "2.4500 GHz",
            "hz_actual_friendly": "2.4500 GHz",
            "hz_advertised": [
                2449998000,
                0
            ],
            "hz_actual": [
                2449998000,
                0
            ],
            "model": 1,
            "family": 25,
            "flags": [
                "3dnowext",
                "3dnowprefetch",
                "abm",
                "adx",
                "aes",
                "apic",
                "arat",
                "avx",
                "avx2",
                "bmi1",
                "bmi2",
                "clflush",
                "clflushopt",
                "clwb",
                "clzero",
                "cmov",
                "cmp_legacy",
                "constant_tsc",
                "cpuid",
                "cr8_legacy",
                "cx16",
                "cx8",
                "de",
                "erms",
                "extd_apicid",
                "f16c",
                "fma",
                "fpu",
                "fsgsbase",
                "fxsr",
                "fxsr_opt",
                "ht",
                "hypervisor",
                "ibpb",
                "ibrs",
                "invpcid",
                "invpcid_single",
                "lahf_lm",
                "lm",
                "mca",
                "mce",
                "misalignsse",
                "mmx",
                "mmxext",
                "movbe",
                "msr",
                "mtrr",
                "nonstop_tsc",
                "nopl",
                "npt",
                "nrip_save",
                "nx",
                "osvw",
                "osxsave",
                "pae",
                "pat",
                "pcid",
                "pclmulqdq",
                "pdpe1gb",
                "pge",
                "pni",
                "popcnt",
                "pse",
                "pse36",
                "rdpid",
                "rdrand",
                "rdrnd",
                "rdseed",
                "rdtscp",
                "rep_good",
                "sep",
                "sha",
                "sha_ni",
                "smap",
                "smep",
                "ssbd",
                "sse",
                "sse2",
                "sse4_1",
                "sse4_2",
                "sse4a",
                "ssse3",
                "stibp",
                "syscall",
                "topoext",
                "tsc",
                "tsc_adjust",
                "tsc_known_freq",
                "umip",
                "vaes",
                "vme",
                "vmmcall",
                "vpclmulqdq",
                "x2apic",
                "xgetbv1",
                "xsave",
                "xsavec",
                "xsaveerptr",
                "xsaveopt"
            ],
            "l3_cache_size": 524288,
            "l2_cache_size": 524288,
            "l1_data_cache_size": 32768,
            "l1_instruction_cache_size": 32768,
            "l2_cache_line_size": 512,
            "l2_cache_associativity": 6
        }
    },
    "commit_info": {
        "id": "ef680c99c09706b3ae7dde3f79bede9b28916b1d",
        "time": "2024-04-26T06:48:49+00:00",
        "author_time": "2024-04-26T06:48:49+00:00",
        "dirty": false,
        "project": "finesse3",
        "branch": "(detached head)"
    },
    "benchmarks": [
        {
            "group": null,
            "name": "test_01_simple_cav",
            "fullname": "tests/benchmarks/test_benchmarks.py::test_01_simple_cav",
            "params": null,
            "param": null,
            "extra_info": {},
            "options": {
                "disable_gc": false,
                "timer": "perf_counter",
                "min_rounds": 5,
                "max_time": 1.0,
                "min_time": 5e-06,
                "warmup": false
            },
            "stats": {
                "min": 0.38022208199998886,
                "max": 0.6140475260000073,
                "mean": 0.4660566924000079,
                "stddev": 0.11138294746772145,
                "rounds": 5,
                "median": 0.39777031600002033,
                "iqr": 0.1912464319999998,
                "q1": 0.3805018117500083,
                "q3": 0.5717482437500081,
                "iqr_outliers": 0,
                "stddev_outliers": 1,
                "outliers": "1;0",
                "ld15iqr": 0.38022208199998886,
                "hd15iqr": 0.6140475260000073,
                "ops": 2.145661710918461,
                "total": 2.3302834620000397,
                "iterations": 1
            }
        },
        {
            "group": null,
            "name": "test_02_pdh_lock",
            "fullname": "tests/benchmarks/test_benchmarks.py::test_02_pdh_lock",
            "params": null,
            "param": null,
            "extra_info": {},
            "options": {
                "disable_gc": false,
                "timer": "perf_counter",
                "min_rounds": 5,
                "max_time": 1.0,
                "min_time": 5e-06,
                "warmup": false
            },
            "stats": {
                "min": 1.3455027200000131,
                "max": 1.7072649620000107,
                "mean": 1.4934248290000027,
                "stddev": 0.17910530838382785,
                "rounds": 5,
                "median": 1.3751796769999771,
                "iqr": 0.31632709649996826,
                "q1": 1.3631237067500237,
                "q3": 1.679450803249992,
                "iqr_outliers": 0,
                "stddev_outliers": 1,
                "outliers": "1;0",
                "ld15iqr": 1.3455027200000131,
                "hd15iqr": 1.7072649620000107,
                "ops": 0.6696018310272771,
                "total": 7.467124145000014,
                "iterations": 1
            }
        },
        {
            "group": null,
            "name": "test_03_near_unstable",
            "fullname": "tests/benchmarks/test_benchmarks.py::test_03_near_unstable",
            "params": null,
            "param": null,
            "extra_info": {},
            "options": {
                "disable_gc": false,
                "timer": "perf_counter",
                "min_rounds": 5,
                "max_time": 1.0,
                "min_time": 5e-06,
                "warmup": false
            },
            "stats": {
                "min": 1.7299999797160126e-06,
                "max": 0.00010498999998276304,
                "mean": 2.6654446624868482e-06,
                "stddev": 1.278790411449159e-06,
                "rounds": 44346,
                "median": 3.1300000102874037e-06,
                "iqr": 1.3699999783511885e-06,
                "q1": 1.8300000022009044e-06,
                "q3": 3.199999980552093e-06,
                "iqr_outliers": 324,
                "stddev_outliers": 562,
                "outliers": "562;324",
                "ld15iqr": 1.7299999797160126e-06,
                "hd15iqr": 5.259999994677855e-06,
                "ops": 375171.923121827,
                "total": 0.11820180900264177,
                "iterations": 1
            }
        },
        {
            "group": null,
            "name": "test_04_geometrical_params",
            "fullname": "tests/benchmarks/test_benchmarks.py::test_04_geometrical_params",
            "params": null,
            "param": null,
            "extra_info": {},
            "options": {
                "disable_gc": false,
                "timer": "perf_counter",
                "min_rounds": 5,
                "max_time": 1.0,
                "min_time": 5e-06,
                "warmup": false
            },
            "stats": {
                "min": 0.5383763179999903,
                "max": 0.9623256490000074,
                "mean": 0.6296046902000058,
                "stddev": 0.18606884143572813,
                "rounds": 5,
                "median": 0.5491908550000062,
                "iqr": 0.11085202100001368,
                "q1": 0.5439607212500022,
                "q3": 0.6548127422500158,
                "iqr_outliers": 1,
                "stddev_outliers": 1,
                "outliers": "1;1",
                "ld15iqr": 0.5383763179999903,
                "hd15iqr": 0.9623256490000074,
                "ops": 1.5882982061050581,
                "total": 3.1480234510000287,
                "iterations": 1
            }
        },
        {
            "group": null,
            "name": "test_05_modulation",
            "fullname": "tests/benchmarks/test_benchmarks.py::test_05_modulation",
            "params": null,
            "param": null,
            "extra_info": {},
            "options": {
                "disable_gc": false,
                "timer": "perf_counter",
                "min_rounds": 5,
                "max_time": 1.0,
                "min_time": 5e-06,
                "warmup": false
            },
            "stats": {
                "min": 0.17262602700000684,
                "max": 0.6709667009999976,
                "mean": 0.23934189625000712,
                "stddev": 0.17445460290041206,
                "rounds": 8,
                "median": 0.17925758100001588,
                "iqr": 0.009505322000009642,
                "q1": 0.1734041590000004,
                "q3": 0.18290948100001003,
                "iqr_outliers": 1,
                "stddev_outliers": 1,
                "outliers": "1;1",
                "ld15iqr": 0.17262602700000684,
                "hd15iqr": 0.6709667009999976,
                "ops": 4.178123494749283,
                "total": 1.914735170000057,
                "iterations": 1
            }
        },
        {
            "group": null,
            "name": "test_06_radiation_pressure",
            "fullname": "tests/benchmarks/test_benchmarks.py::test_06_radiation_pressure",
            "params": null,
            "param": null,
            "extra_info": {},
            "options": {
                "disable_gc": false,
                "timer": "perf_counter",
                "min_rounds": 5,
                "max_time": 1.0,
                "min_time": 5e-06,
                "warmup": false
            },
            "stats": {
                "min": 0.24635674400002472,
                "max": 0.2527915359999895,
                "mean": 0.25040328680000246,
                "stddev": 0.002624899333901144,
                "rounds": 5,
                "median": 0.25060597800001005,
                "iqr": 0.003828918499984013,
                "q1": 0.24882739175000523,
                "q3": 0.25265631024998925,
                "iqr_outliers": 0,
                "stddev_outliers": 1,
                "outliers": "1;0",
                "ld15iqr": 0.24635674400002472,
                "hd15iqr": 0.2527915359999895,
                "ops": 3.99355780341135,
                "total": 1.2520164340000122,
                "iterations": 1
            }
        },
        {
            "group": null,
            "name": "test_07_homodyne",
            "fullname": "tests/benchmarks/test_benchmarks.py::test_07_homodyne",
            "params": null,
            "param": null,
            "extra_info": {},
            "options": {
                "disable_gc": false,
                "timer": "perf_counter",
                "min_rounds": 5,
                "max_time": 1.0,
                "min_time": 5e-06,
                "warmup": false
            },
            "stats": {
                "min": 0.11412517400000866,
                "max": 0.7104825309999967,
                "mean": 0.18196041789999812,
                "stddev": 0.1858141806627404,
                "rounds": 10,
                "median": 0.12244619099999454,
                "iqr": 0.011211839999987205,
                "q1": 0.12110991099999069,
                "q3": 0.1323217509999779,
                "iqr_outliers": 1,
                "stddev_outliers": 1,
                "outliers": "1;1",
                "ld15iqr": 0.11412517400000866,
                "hd15iqr": 0.7104825309999967,
                "ops": 5.495700721843695,
                "total": 1.819604178999981,
                "iterations": 1
            }
        },
        {
            "group": null,
            "name": "test_08_optical_spring",
            "fullname": "tests/benchmarks/test_benchmarks.py::test_08_optical_spring",
            "params": null,
            "param": null,
            "extra_info": {},
            "options": {
                "disable_gc": false,
                "timer": "perf_counter",
                "min_rounds": 5,
                "max_time": 1.0,
                "min_time": 5e-06,
                "warmup": false
            },
            "stats": {
                "min": 0.2993719330000033,
                "max": 0.3159896280000112,
                "mean": 0.30738037579999966,
                "stddev": 0.0068932863668491875,
                "rounds": 5,
                "median": 0.30473223599997823,
                "iqr": 0.011085883250004258,
                "q1": 0.3026802842500018,
                "q3": 0.3137661675000061,
                "iqr_outliers": 0,
                "stddev_outliers": 2,
                "outliers": "2;0",
                "ld15iqr": 0.2993719330000033,
                "hd15iqr": 0.3159896280000112,
                "ops": 3.2532981241803824,
                "total": 1.5369018789999984,
                "iterations": 1
            }
        },
        {
            "group": null,
            "name": "test_09_aligo_sensitivity",
            "fullname": "tests/benchmarks/test_benchmarks.py::test_09_aligo_sensitivity",
            "params": null,
            "param": null,
            "extra_info": {},
            "options": {
                "disable_gc": false,
                "timer": "perf_counter",
                "min_rounds": 5,
                "max_time": 1.0,
                "min_time": 5e-06,
                "warmup": false
            },
            "stats": {
                "min": 0.33058850699998743,
                "max": 1.1644501359999992,
                "mean": 0.5066089791999957,
                "stddev": 0.367913437769875,
                "rounds": 5,
                "median": 0.3394531079999865,
                "iqr": 0.2254007620000067,
                "q1": 0.336136878749997,
                "q3": 0.5615376407500037,
                "iqr_outliers": 1,
                "stddev_outliers": 1,
                "outliers": "1;1",
                "ld15iqr": 0.33058850699998743,
                "hd15iqr": 1.1644501359999992,
                "ops": 1.973908953566389,
                "total": 2.5330448959999785,
                "iterations": 1
            }
        },
        {
            "group": null,
            "name": "test_10_shifted_beam",
            "fullname": "tests/benchmarks/test_benchmarks.py::test_10_shifted_beam",
            "params": null,
            "param": null,
            "extra_info": {},
            "options": {
                "disable_gc": false,
                "timer": "perf_counter",
                "min_rounds": 5,
                "max_time": 1.0,
                "min_time": 5e-06,
                "warmup": false
            },
            "stats": {
                "min": 0.7387743200000045,
                "max": 0.7534208190000129,
                "mean": 0.7475256970000033,
                "stddev": 0.005521853034832653,
                "rounds": 5,
                "median": 0.7473995899999863,
                "iqr": 0.006294378249990018,
                "q1": 0.7451398617500118,
                "q3": 0.7514342400000018,
                "iqr_outliers": 0,
                "stddev_outliers": 2,
                "outliers": "2;0",
                "ld15iqr": 0.7387743200000045,
                "hd15iqr": 0.7534208190000129,
                "ops": 1.3377466540792318,
                "total": 3.737628485000016,
                "iterations": 1
            }
        },
        {
            "group": null,
            "name": "test_angular_radiation_pressure",
            "fullname": "tests/benchmarks/test_benchmarks.py::test_angular_radiation_pressure",
            "params": null,
            "param": null,
            "extra_info": {},
            "options": {
                "disable_gc": false,
                "timer": "perf_counter",
                "min_rounds": 5,
                "max_time": 1.0,
                "min_time": 5e-06,
                "warmup": false
            },
            "stats": {
                "min": 0.34981647200001476,
                "max": 0.3582671800000128,
                "mean": 0.3536109848000081,
                "stddev": 0.004144314160937276,
                "rounds": 5,
                "median": 0.3515266560000043,
                "iqr": 0.00767796199998827,
                "q1": 0.35033820650001246,
                "q3": 0.35801616850000073,
                "iqr_outliers": 0,
                "stddev_outliers": 2,
                "outliers": "2;0",
                "ld15iqr": 0.34981647200001476,
                "hd15iqr": 0.3582671800000128,
                "ops": 2.8279664461373293,
                "total": 1.7680549240000403,
                "iterations": 1
            }
        },
        {
            "group": null,
            "name": "test_cavity_eigenmodes",
            "fullname": "tests/benchmarks/test_benchmarks.py::test_cavity_eigenmodes",
            "params": null,
            "param": null,
            "extra_info": {},
            "options": {
                "disable_gc": false,
                "timer": "perf_counter",
                "min_rounds": 5,
                "max_time": 1.0,
                "min_time": 5e-06,
                "warmup": false
            },
            "stats": {
                "min": 0.2798663760000011,
                "max": 1.346185356999996,
                "mean": 0.496023299400008,
                "stddev": 0.4752928141431235,
                "rounds": 5,
                "median": 0.28013213799999903,
                "iqr": 0.2769208442500002,
                "q1": 0.280020779250016,
                "q3": 0.5569416235000162,
                "iqr_outliers": 1,
                "stddev_outliers": 1,
                "outliers": "1;1",
                "ld15iqr": 0.2798663760000011,
                "hd15iqr": 1.346185356999996,
                "ops": 2.016034329858304,
                "total": 2.48011649700004,
                "iterations": 1
            }
        },
        {
            "group": null,
            "name": "test_coupled_cavity_commands",
            "fullname": "tests/benchmarks/test_benchmarks.py::test_coupled_cavity_commands",
            "params": null,
            "param": null,
            "extra_info": {},
            "options": {
                "disable_gc": false,
                "timer": "perf_counter",
                "min_rounds": 5,
                "max_time": 1.0,
                "min_time": 5e-06,
                "warmup": false
            },
            "stats": {
                "min": 4.624873347999994,
                "max": 6.099055911000022,
                "mean": 5.257799089200006,
                "stddev": 0.7357139897423619,
                "rounds": 5,
                "median": 4.849501226000001,
                "iqr": 1.3579157600000116,
                "q1": 4.679870137750001,
                "q3": 6.0377858977500125,
                "iqr_outliers": 0,
                "stddev_outliers": 2,
                "outliers": "2;0",
                "ld15iqr": 4.624873347999994,
                "hd15iqr": 6.099055911000022,
                "ops": 0.19019365004914135,
                "total": 26.28899544600003,
                "iterations": 1
            }
        },
        {
            "group": null,
            "name": "test_frequency_dependant_squeezing",
            "fullname": "tests/benchmarks/test_benchmarks.py::test_frequency_dependant_squeezing",
            "params": null,
            "param": null,
            "extra_info": {},
            "options": {
                "disable_gc": false,
                "timer": "perf_counter",
                "min_rounds": 5,
                "max_time": 1.0,
                "min_time": 5e-06,
                "warmup": false
            },
            "stats": {
                "min": 1.564194630000003,
                "max": 3.1516282169999954,
                "mean": 1.9161653099999967,
                "stddev": 0.6911053629177598,
                "rounds": 5,
                "median": 1.618460414999987,
                "iqr": 0.40457522175001515,
                "q1": 1.6046439779999915,
                "q3": 2.0092191997500066,
                "iqr_outliers": 1,
                "stddev_outliers": 1,
                "outliers": "1;1",
                "ld15iqr": 1.564194630000003,
                "hd15iqr": 3.1516282169999954,
                "ops": 0.521875641303621,
                "total": 9.580826549999983,
                "iterations": 1
            }
        },
        {
            "group": null,
            "name": "test_lock_actions",
            "fullname": "tests/benchmarks/test_benchmarks.py::test_lock_actions",
            "params": null,
            "param": null,
            "extra_info": {},
            "options": {
                "disable_gc": false,
                "timer": "perf_counter",
                "min_rounds": 5,
                "max_time": 1.0,
                "min_time": 5e-06,
                "warmup": false
            },
            "stats": {
                "min": 4.9251096590000145,
                "max": 7.476101220999993,
                "mean": 5.555247376200009,
                "stddev": 1.0793731906363948,
                "rounds": 5,
                "median": 5.176650529,
                "iqr": 0.7637681539999974,
                "q1": 4.992658085000016,
                "q3": 5.756426239000014,
                "iqr_outliers": 1,
                "stddev_outliers": 1,
                "outliers": "1;1",
                "ld15iqr": 4.9251096590000145,
                "hd15iqr": 7.476101220999993,
                "ops": 0.1800099855650418,
                "total": 27.776236881000045,
                "iterations": 1
            }
        }
    ],
    "datetime": "2024-04-29T07:09:29.210144",
    "version": "4.0.0"
}