{
    "machine_info": {
        "node": "runner-xs6vzpvo-project-39604133-concurrent-0",
        "processor": "",
        "machine": "x86_64",
        "python_compiler": "GCC 12.2.0",
        "python_implementation": "CPython",
        "python_implementation_version": "3.13.2",
        "python_version": "3.13.2",
        "python_build": [
            "main",
            "Feb  6 2025 22:37:13"
        ],
        "release": "5.15.154+",
        "system": "Linux",
        "cpu": {
            "python_version": "3.13.2.final.0 (64 bit)",
            "cpuinfo_version": [
                9,
                0,
                0
            ],
            "cpuinfo_version_string": "9.0.0",
            "arch": "X86_64",
            "bits": 64,
            "count": 2,
            "arch_string_raw": "x86_64",
            "vendor_id_raw": "AuthenticAMD",
            "brand_raw": "AMD EPYC 7B13",
            "hz_advertised_friendly": "2.4500 GHz",
            "hz_actual_friendly": "2.4500 GHz",
            "hz_advertised": [
                2449998000,
                0
            ],
            "hz_actual": [
                2449998000,
                0
            ],
            "model": 1,
            "family": 25,
            "flags": [
                "3dnowext",
                "3dnowprefetch",
                "abm",
                "adx",
                "aes",
                "apic",
                "arat",
                "avx",
                "avx2",
                "bmi1",
                "bmi2",
                "clflush",
                "clflushopt",
                "clwb",
                "clzero",
                "cmov",
                "cmp_legacy",
                "constant_tsc",
                "cpuid",
                "cr8_legacy",
                "cx16",
                "cx8",
                "de",
                "erms",
                "extd_apicid",
                "f16c",
                "fma",
                "fpu",
                "fsgsbase",
                "fsrm",
                "fxsr",
                "fxsr_opt",
                "ht",
                "hypervisor",
                "ibpb",
                "ibrs",
                "invpcid",
                "invpcid_single",
                "lahf_lm",
                "lm",
                "mca",
                "mce",
                "misalignsse",
                "mmx",
                "mmxext",
                "movbe",
                "msr",
                "mtrr",
                "nonstop_tsc",
                "nopl",
                "npt",
                "nrip_save",
                "nx",
                "osvw",
                "osxsave",
                "pae",
                "pat",
                "pcid",
                "pclmulqdq",
                "pdpe1gb",
                "pge",
                "pni",
                "popcnt",
                "pse",
                "pse36",
                "rdpid",
                "rdrand",
                "rdrnd",
                "rdseed",
                "rdtscp",
                "rep_good",
                "sep",
                "sha",
                "sha_ni",
                "smap",
                "smep",
                "ssbd",
                "sse",
                "sse2",
                "sse4_1",
                "sse4_2",
                "sse4a",
                "ssse3",
                "stibp",
                "syscall",
                "topoext",
                "tsc",
                "tsc_adjust",
                "tsc_known_freq",
                "umip",
                "vaes",
                "vme",
                "vmmcall",
                "vpclmulqdq",
                "x2apic",
                "xgetbv1",
                "xsave",
                "xsavec",
                "xsaveerptr",
                "xsaveopt"
            ],
            "l3_cache_size": 524288,
            "l2_cache_size": 524288,
            "l1_data_cache_size": 32768,
            "l1_instruction_cache_size": 32768,
            "l2_cache_line_size": 512,
            "l2_cache_associativity": 6
        }
    },
    "commit_info": {
        "id": "80e8cf83eea6d5819c0c59259991a5db2587dabf",
        "time": "2025-02-17T10:04:48+00:00",
        "author_time": "2025-02-17T10:04:48+00:00",
        "dirty": false,
        "project": "finesse3",
        "branch": "(detached head)"
    },
    "benchmarks": [
        {
            "group": null,
            "name": "test_01_simple_cav",
            "fullname": "tests/benchmarks/test_benchmarks.py::test_01_simple_cav",
            "params": null,
            "param": null,
            "extra_info": {},
            "options": {
                "disable_gc": false,
                "timer": "perf_counter",
                "min_rounds": 5,
                "max_time": 1.0,
                "min_time": 5e-06,
                "warmup": false
            },
            "stats": {
                "min": 0.28673061900001073,
                "max": 0.5098525229999922,
                "mean": 0.33300886620000086,
                "stddev": 0.09889312945656735,
                "rounds": 5,
                "median": 0.28806894000000227,
                "iqr": 0.06035368424999632,
                "q1": 0.28704314400000186,
                "q3": 0.3473968282499982,
                "iqr_outliers": 1,
                "stddev_outliers": 1,
                "outliers": "1;1",
                "ld15iqr": 0.28673061900001073,
                "hd15iqr": 0.5098525229999922,
                "ops": 3.002923049500468,
                "total": 1.6650443310000043,
                "iterations": 1
            }
        },
        {
            "group": null,
            "name": "test_02_pdh_lock",
            "fullname": "tests/benchmarks/test_benchmarks.py::test_02_pdh_lock",
            "params": null,
            "param": null,
            "extra_info": {},
            "options": {
                "disable_gc": false,
                "timer": "perf_counter",
                "min_rounds": 5,
                "max_time": 1.0,
                "min_time": 5e-06,
                "warmup": false
            },
            "stats": {
                "min": 1.3312690959999998,
                "max": 1.6424027930000022,
                "mean": 1.4556778705999989,
                "stddev": 0.15748724290788127,
                "rounds": 5,
                "median": 1.3540106239999972,
                "iqr": 0.28387573675000866,
                "q1": 1.3362861827499941,
                "q3": 1.6201619195000028,
                "iqr_outliers": 0,
                "stddev_outliers": 1,
                "outliers": "1;0",
                "ld15iqr": 1.3312690959999998,
                "hd15iqr": 1.6424027930000022,
                "ops": 0.6869651728564244,
                "total": 7.278389352999994,
                "iterations": 1
            }
        },
        {
            "group": null,
            "name": "test_03_near_unstable",
            "fullname": "tests/benchmarks/test_benchmarks.py::test_03_near_unstable",
            "params": null,
            "param": null,
            "extra_info": {},
            "options": {
                "disable_gc": false,
                "timer": "perf_counter",
                "min_rounds": 5,
                "max_time": 1.0,
                "min_time": 5e-06,
                "warmup": false
            },
            "stats": {
                "min": 2.0399999982601003e-06,
                "max": 2.462000000491571e-05,
                "mean": 2.2103438102850454e-06,
                "stddev": 4.531687816484073e-07,
                "rounds": 77822,
                "median": 2.1799999956328975e-06,
                "iqr": 5.000001124244591e-08,
                "q1": 2.1500000002561137e-06,
                "q3": 2.2000000114985596e-06,
                "iqr_outliers": 2471,
                "stddev_outliers": 691,
                "outliers": "691;2471",
                "ld15iqr": 2.0790000121451158e-06,
                "hd15iqr": 2.27999998969608e-06,
                "ops": 452418.3049473377,
                "total": 0.1720133760040028,
                "iterations": 1
            }
        },
        {
            "group": null,
            "name": "test_04_geometrical_params",
            "fullname": "tests/benchmarks/test_benchmarks.py::test_04_geometrical_params",
            "params": null,
            "param": null,
            "extra_info": {},
            "options": {
                "disable_gc": false,
                "timer": "perf_counter",
                "min_rounds": 5,
                "max_time": 1.0,
                "min_time": 5e-06,
                "warmup": false
            },
            "stats": {
                "min": 0.4388124689999984,
                "max": 0.9845775209999772,
                "mean": 0.5624291541999924,
                "stddev": 0.2362772263189178,
                "rounds": 5,
                "median": 0.46549182700002234,
                "iqr": 0.14706879149999708,
                "q1": 0.45061333574998486,
                "q3": 0.5976821272499819,
                "iqr_outliers": 1,
                "stddev_outliers": 1,
                "outliers": "1;1",
                "ld15iqr": 0.4388124689999984,
                "hd15iqr": 0.9845775209999772,
                "ops": 1.7780017136956832,
                "total": 2.8121457709999618,
                "iterations": 1
            }
        },
        {
            "group": null,
            "name": "test_05_modulation",
            "fullname": "tests/benchmarks/test_benchmarks.py::test_05_modulation",
            "params": null,
            "param": null,
            "extra_info": {},
            "options": {
                "disable_gc": false,
                "timer": "perf_counter",
                "min_rounds": 5,
                "max_time": 1.0,
                "min_time": 5e-06,
                "warmup": false
            },
            "stats": {
                "min": 0.13606497999998624,
                "max": 0.16601394899998922,
                "mean": 0.14589605128571342,
                "stddev": 0.011445222504184723,
                "rounds": 7,
                "median": 0.1401610400000095,
                "iqr": 0.01700173099999347,
                "q1": 0.13710520575000373,
                "q3": 0.1541069367499972,
                "iqr_outliers": 0,
                "stddev_outliers": 1,
                "outliers": "1;0",
                "ld15iqr": 0.13606497999998624,
                "hd15iqr": 0.16601394899998922,
                "ops": 6.854195101152289,
                "total": 1.021272358999994,
                "iterations": 1
            }
        },
        {
            "group": null,
            "name": "test_06_radiation_pressure",
            "fullname": "tests/benchmarks/test_benchmarks.py::test_06_radiation_pressure",
            "params": null,
            "param": null,
            "extra_info": {},
            "options": {
                "disable_gc": false,
                "timer": "perf_counter",
                "min_rounds": 5,
                "max_time": 1.0,
                "min_time": 5e-06,
                "warmup": false
            },
            "stats": {
                "min": 0.2689309410000078,
                "max": 0.2806702400000063,
                "mean": 0.275658476600006,
                "stddev": 0.005195410984456792,
                "rounds": 5,
                "median": 0.27832831000000624,
                "iqr": 0.008745127249994766,
                "q1": 0.270713668500008,
                "q3": 0.27945879575000276,
                "iqr_outliers": 0,
                "stddev_outliers": 1,
                "outliers": "1;0",
                "ld15iqr": 0.2689309410000078,
                "hd15iqr": 0.2806702400000063,
                "ops": 3.627677306840265,
                "total": 1.37829238300003,
                "iterations": 1
            }
        },
        {
            "group": null,
            "name": "test_07_homodyne",
            "fullname": "tests/benchmarks/test_benchmarks.py::test_07_homodyne",
            "params": null,
            "param": null,
            "extra_info": {},
            "options": {
                "disable_gc": false,
                "timer": "perf_counter",
                "min_rounds": 5,
                "max_time": 1.0,
                "min_time": 5e-06,
                "warmup": false
            },
            "stats": {
                "min": 0.09363481299999421,
                "max": 0.09944497200001479,
                "mean": 0.09617803479999906,
                "stddev": 0.0024762845264319766,
                "rounds": 5,
                "median": 0.09699684299999944,
                "iqr": 0.003946094750013174,
                "q1": 0.09371700549998963,
                "q3": 0.0976631002500028,
                "iqr_outliers": 0,
                "stddev_outliers": 2,
                "outliers": "2;0",
                "ld15iqr": 0.09363481299999421,
                "hd15iqr": 0.09944497200001479,
                "ops": 10.397384414013933,
                "total": 0.48089017399999534,
                "iterations": 1
            }
        },
        {
            "group": null,
            "name": "test_08_optical_spring",
            "fullname": "tests/benchmarks/test_benchmarks.py::test_08_optical_spring",
            "params": null,
            "param": null,
            "extra_info": {},
            "options": {
                "disable_gc": false,
                "timer": "perf_counter",
                "min_rounds": 5,
                "max_time": 1.0,
                "min_time": 5e-06,
                "warmup": false
            },
            "stats": {
                "min": 0.24739006200002223,
                "max": 0.2529663219999918,
                "mean": 0.24974190199999952,
                "stddev": 0.0026241738820119574,
                "rounds": 5,
                "median": 0.24884307199999967,
                "iqr": 0.004881182500007242,
                "q1": 0.2474202269999921,
                "q3": 0.25230140949999935,
                "iqr_outliers": 0,
                "stddev_outliers": 1,
                "outliers": "1;0",
                "ld15iqr": 0.24739006200002223,
                "hd15iqr": 0.2529663219999918,
                "ops": 4.004133835738954,
                "total": 1.2487095099999976,
                "iterations": 1
            }
        },
        {
            "group": null,
            "name": "test_09_aligo_sensitivity",
            "fullname": "tests/benchmarks/test_benchmarks.py::test_09_aligo_sensitivity",
            "params": null,
            "param": null,
            "extra_info": {},
            "options": {
                "disable_gc": false,
                "timer": "perf_counter",
                "min_rounds": 5,
                "max_time": 1.0,
                "min_time": 5e-06,
                "warmup": false
            },
            "stats": {
                "min": 0.2855212169999959,
                "max": 1.0618346819999829,
                "mean": 0.44331902799999623,
                "stddev": 0.3457660601588791,
                "rounds": 5,
                "median": 0.2896989470000051,
                "iqr": 0.1952703862499945,
                "q1": 0.2881119044999991,
                "q3": 0.4833822907499936,
                "iqr_outliers": 1,
                "stddev_outliers": 1,
                "outliers": "1;1",
                "ld15iqr": 0.2855212169999959,
                "hd15iqr": 1.0618346819999829,
                "ops": 2.2557118843092123,
                "total": 2.2165951399999813,
                "iterations": 1
            }
        },
        {
            "group": null,
            "name": "test_10_shifted_beam",
            "fullname": "tests/benchmarks/test_benchmarks.py::test_10_shifted_beam",
            "params": null,
            "param": null,
            "extra_info": {},
            "options": {
                "disable_gc": false,
                "timer": "perf_counter",
                "min_rounds": 5,
                "max_time": 1.0,
                "min_time": 5e-06,
                "warmup": false
            },
            "stats": {
                "min": 0.7563645740000027,
                "max": 0.7701094359999843,
                "mean": 0.7618614845999957,
                "stddev": 0.00529508016444635,
                "rounds": 5,
                "median": 0.7606163940000101,
                "iqr": 0.00698943875000424,
                "q1": 0.7581459139999893,
                "q3": 0.7651353527499936,
                "iqr_outliers": 0,
                "stddev_outliers": 2,
                "outliers": "2;0",
                "ld15iqr": 0.7563645740000027,
                "hd15iqr": 0.7701094359999843,
                "ops": 1.3125745561544373,
                "total": 3.8093074229999786,
                "iterations": 1
            }
        },
        {
            "group": null,
            "name": "test_angular_radiation_pressure",
            "fullname": "tests/benchmarks/test_benchmarks.py::test_angular_radiation_pressure",
            "params": null,
            "param": null,
            "extra_info": {},
            "options": {
                "disable_gc": false,
                "timer": "perf_counter",
                "min_rounds": 5,
                "max_time": 1.0,
                "min_time": 5e-06,
                "warmup": false
            },
            "stats": {
                "min": 0.33951300999999035,
                "max": 0.3492945410000061,
                "mean": 0.34416008219999983,
                "stddev": 0.004144999388853553,
                "rounds": 5,
                "median": 0.3435468300000082,
                "iqr": 0.007233900249985936,
                "q1": 0.3406512550000045,
                "q3": 0.3478851552499904,
                "iqr_outliers": 0,
                "stddev_outliers": 2,
                "outliers": "2;0",
                "ld15iqr": 0.33951300999999035,
                "hd15iqr": 0.3492945410000061,
                "ops": 2.9056245965761818,
                "total": 1.720800410999999,
                "iterations": 1
            }
        },
        {
            "group": null,
            "name": "test_cavity_eigenmodes",
            "fullname": "tests/benchmarks/test_benchmarks.py::test_cavity_eigenmodes",
            "params": null,
            "param": null,
            "extra_info": {},
            "options": {
                "disable_gc": false,
                "timer": "perf_counter",
                "min_rounds": 5,
                "max_time": 1.0,
                "min_time": 5e-06,
                "warmup": false
            },
            "stats": {
                "min": 0.25258005399999206,
                "max": 1.2048386609999966,
                "mean": 0.45003543840000476,
                "stddev": 0.42197925261800867,
                "rounds": 5,
                "median": 0.2638306550000209,
                "iqr": 0.24008268425001944,
                "q1": 0.2604839304999942,
                "q3": 0.5005666147500136,
                "iqr_outliers": 1,
                "stddev_outliers": 1,
                "outliers": "1;1",
                "ld15iqr": 0.25258005399999206,
                "hd15iqr": 1.2048386609999966,
                "ops": 2.2220472315586193,
                "total": 2.2501771920000238,
                "iterations": 1
            }
        },
        {
            "group": null,
            "name": "test_coupled_cavity_commands",
            "fullname": "tests/benchmarks/test_benchmarks.py::test_coupled_cavity_commands",
            "params": null,
            "param": null,
            "extra_info": {},
            "options": {
                "disable_gc": false,
                "timer": "perf_counter",
                "min_rounds": 5,
                "max_time": 1.0,
                "min_time": 5e-06,
                "warmup": false
            },
            "stats": {
                "min": 5.978826811000005,
                "max": 7.267158787,
                "mean": 6.289587201400002,
                "stddev": 0.548030882138605,
                "rounds": 5,
                "median": 6.060453426000009,
                "iqr": 0.3530084137499969,
                "q1": 6.032305361500001,
                "q3": 6.3853137752499975,
                "iqr_outliers": 1,
                "stddev_outliers": 1,
                "outliers": "1;1",
                "ld15iqr": 5.978826811000005,
                "hd15iqr": 7.267158787,
                "ops": 0.15899294627434524,
                "total": 31.44793600700001,
                "iterations": 1
            }
        },
        {
            "group": null,
            "name": "test_frequency_dependant_squeezing",
            "fullname": "tests/benchmarks/test_benchmarks.py::test_frequency_dependant_squeezing",
            "params": null,
            "param": null,
            "extra_info": {},
            "options": {
                "disable_gc": false,
                "timer": "perf_counter",
                "min_rounds": 5,
                "max_time": 1.0,
                "min_time": 5e-06,
                "warmup": false
            },
            "stats": {
                "min": 1.6903859490000173,
                "max": 1.747332092999983,
                "mean": 1.7102374689999977,
                "stddev": 0.021756976243380854,
                "rounds": 5,
                "median": 1.7055063509999968,
                "iqr": 0.01929130350000463,
                "q1": 1.6980552104999944,
                "q3": 1.717346513999999,
                "iqr_outliers": 1,
                "stddev_outliers": 1,
                "outliers": "1;1",
                "ld15iqr": 1.6903859490000173,
                "hd15iqr": 1.747332092999983,
                "ops": 0.584714121942794,
                "total": 8.551187344999988,
                "iterations": 1
            }
        },
        {
            "group": null,
            "name": "test_lock_actions",
            "fullname": "tests/benchmarks/test_benchmarks.py::test_lock_actions",
            "params": null,
            "param": null,
            "extra_info": {},
            "options": {
                "disable_gc": false,
                "timer": "perf_counter",
                "min_rounds": 5,
                "max_time": 1.0,
                "min_time": 5e-06,
                "warmup": false
            },
            "stats": {
                "min": 3.2923505239999997,
                "max": 5.007993596000006,
                "mean": 3.6569915321999984,
                "stddev": 0.755989430629204,
                "rounds": 5,
                "median": 3.3038323349999814,
                "iqr": 0.4841946750000048,
                "q1": 3.3007386297500005,
                "q3": 3.7849333047500053,
                "iqr_outliers": 1,
                "stddev_outliers": 1,
                "outliers": "1;1",
                "ld15iqr": 3.2923505239999997,
                "hd15iqr": 5.007993596000006,
                "ops": 0.27344881474155697,
                "total": 18.284957660999993,
                "iterations": 1
            }
        }
    ],
    "datetime": "2025-02-17T10:12:39.698509+00:00",
    "version": "5.1.0"
}