{
    "machine_info": {
        "node": "runner-ns46nmmj-project-39604133-concurrent-0",
        "processor": "",
        "machine": "x86_64",
        "python_compiler": "GCC 12.2.0",
        "python_implementation": "CPython",
        "python_implementation_version": "3.12.5",
        "python_version": "3.12.5",
        "python_build": [
            "main",
            "Aug 13 2024 02:19:05"
        ],
        "release": "5.15.154+",
        "system": "Linux",
        "cpu": {
            "python_version": "3.12.5.final.0 (64 bit)",
            "cpuinfo_version": [
                9,
                0,
                0
            ],
            "cpuinfo_version_string": "9.0.0",
            "arch": "X86_64",
            "bits": 64,
            "count": 2,
            "arch_string_raw": "x86_64",
            "vendor_id_raw": "AuthenticAMD",
            "brand_raw": "AMD EPYC 7B13",
            "hz_advertised_friendly": "2.4500 GHz",
            "hz_actual_friendly": "2.4500 GHz",
            "hz_advertised": [
                2449998000,
                0
            ],
            "hz_actual": [
                2449998000,
                0
            ],
            "model": 1,
            "family": 25,
            "flags": [
                "3dnowext",
                "3dnowprefetch",
                "abm",
                "adx",
                "aes",
                "apic",
                "arat",
                "avx",
                "avx2",
                "bmi1",
                "bmi2",
                "clflush",
                "clflushopt",
                "clwb",
                "clzero",
                "cmov",
                "cmp_legacy",
                "constant_tsc",
                "cpuid",
                "cr8_legacy",
                "cx16",
                "cx8",
                "de",
                "erms",
                "extd_apicid",
                "f16c",
                "fma",
                "fpu",
                "fsgsbase",
                "fsrm",
                "fxsr",
                "fxsr_opt",
                "ht",
                "hypervisor",
                "ibpb",
                "ibrs",
                "invpcid",
                "invpcid_single",
                "lahf_lm",
                "lm",
                "mca",
                "mce",
                "misalignsse",
                "mmx",
                "mmxext",
                "movbe",
                "msr",
                "mtrr",
                "nonstop_tsc",
                "nopl",
                "npt",
                "nrip_save",
                "nx",
                "osvw",
                "osxsave",
                "pae",
                "pat",
                "pcid",
                "pclmulqdq",
                "pdpe1gb",
                "pge",
                "pni",
                "popcnt",
                "pse",
                "pse36",
                "rdpid",
                "rdrand",
                "rdrnd",
                "rdseed",
                "rdtscp",
                "rep_good",
                "sep",
                "sha",
                "sha_ni",
                "smap",
                "smep",
                "ssbd",
                "sse",
                "sse2",
                "sse4_1",
                "sse4_2",
                "sse4a",
                "ssse3",
                "stibp",
                "syscall",
                "topoext",
                "tsc",
                "tsc_adjust",
                "tsc_known_freq",
                "umip",
                "vaes",
                "vme",
                "vmmcall",
                "vpclmulqdq",
                "x2apic",
                "xgetbv1",
                "xsave",
                "xsavec",
                "xsaveerptr",
                "xsaveopt"
            ],
            "l3_cache_size": 524288,
            "l2_cache_size": 524288,
            "l1_data_cache_size": 32768,
            "l1_instruction_cache_size": 32768,
            "l2_cache_line_size": 512,
            "l2_cache_associativity": 6
        }
    },
    "commit_info": {
        "id": "988a9ecfe37b2960f4391e1e3757f69b0c920417",
        "time": "2024-08-23T14:02:11+09:00",
        "author_time": "2024-08-23T14:02:11+09:00",
        "dirty": false,
        "project": "finesse3",
        "branch": "(detached head)"
    },
    "benchmarks": [
        {
            "group": null,
            "name": "test_01_simple_cav",
            "fullname": "tests/benchmarks/test_benchmarks.py::test_01_simple_cav",
            "params": null,
            "param": null,
            "extra_info": {},
            "options": {
                "disable_gc": false,
                "timer": "perf_counter",
                "min_rounds": 5,
                "max_time": 1.0,
                "min_time": 5e-06,
                "warmup": false
            },
            "stats": {
                "min": 0.2628240500000061,
                "max": 0.4573757710000024,
                "mean": 0.3336546716000015,
                "stddev": 0.09660238454005586,
                "rounds": 5,
                "median": 0.2654385090000062,
                "iqr": 0.16595151124999674,
                "q1": 0.2630373575,
                "q3": 0.42898886874999675,
                "iqr_outliers": 0,
                "stddev_outliers": 1,
                "outliers": "1;0",
                "ld15iqr": 0.2628240500000061,
                "hd15iqr": 0.4573757710000024,
                "ops": 2.997110740888531,
                "total": 1.6682733580000075,
                "iterations": 1
            }
        },
        {
            "group": null,
            "name": "test_02_pdh_lock",
            "fullname": "tests/benchmarks/test_benchmarks.py::test_02_pdh_lock",
            "params": null,
            "param": null,
            "extra_info": {},
            "options": {
                "disable_gc": false,
                "timer": "perf_counter",
                "min_rounds": 5,
                "max_time": 1.0,
                "min_time": 5e-06,
                "warmup": false
            },
            "stats": {
                "min": 1.1629657889999976,
                "max": 1.4893816500000128,
                "mean": 1.2859990429999981,
                "stddev": 0.15958933695812053,
                "rounds": 5,
                "median": 1.1853990390000035,
                "iqr": 0.2801712045000144,
                "q1": 1.1635511039999855,
                "q3": 1.4437223085,
                "iqr_outliers": 0,
                "stddev_outliers": 1,
                "outliers": "1;0",
                "ld15iqr": 1.1629657889999976,
                "hd15iqr": 1.4893816500000128,
                "ops": 0.7776055553409936,
                "total": 6.429995214999991,
                "iterations": 1
            }
        },
        {
            "group": null,
            "name": "test_03_near_unstable",
            "fullname": "tests/benchmarks/test_benchmarks.py::test_03_near_unstable",
            "params": null,
            "param": null,
            "extra_info": {},
            "options": {
                "disable_gc": false,
                "timer": "perf_counter",
                "min_rounds": 5,
                "max_time": 1.0,
                "min_time": 5e-06,
                "warmup": false
            },
            "stats": {
                "min": 1.7799999909584585e-06,
                "max": 2.7569999986098992e-05,
                "mean": 1.9667207569022257e-06,
                "stddev": 4.912939669787965e-07,
                "rounds": 57176,
                "median": 1.940000004196918e-06,
                "iqr": 4.000003173132427e-08,
                "q1": 1.9199999883312557e-06,
                "q3": 1.96000002006258e-06,
                "iqr_outliers": 6326,
                "stddev_outliers": 375,
                "outliers": "375;6326",
                "ld15iqr": 1.8599999975776882e-06,
                "hd15iqr": 2.0289999724809604e-06,
                "ops": 508460.59182041493,
                "total": 0.11244922599664164,
                "iterations": 1
            }
        },
        {
            "group": null,
            "name": "test_04_geometrical_params",
            "fullname": "tests/benchmarks/test_benchmarks.py::test_04_geometrical_params",
            "params": null,
            "param": null,
            "extra_info": {},
            "options": {
                "disable_gc": false,
                "timer": "perf_counter",
                "min_rounds": 5,
                "max_time": 1.0,
                "min_time": 5e-06,
                "warmup": false
            },
            "stats": {
                "min": 0.4552526720000003,
                "max": 0.8353233379999949,
                "mean": 0.5347997975999987,
                "stddev": 0.1680368303317706,
                "rounds": 5,
                "median": 0.46293130899999824,
                "iqr": 0.09995804174997147,
                "q1": 0.45652735625001384,
                "q3": 0.5564853979999853,
                "iqr_outliers": 1,
                "stddev_outliers": 1,
                "outliers": "1;1",
                "ld15iqr": 0.4552526720000003,
                "hd15iqr": 0.8353233379999949,
                "ops": 1.869858598465562,
                "total": 2.673998987999994,
                "iterations": 1
            }
        },
        {
            "group": null,
            "name": "test_05_modulation",
            "fullname": "tests/benchmarks/test_benchmarks.py::test_05_modulation",
            "params": null,
            "param": null,
            "extra_info": {},
            "options": {
                "disable_gc": false,
                "timer": "perf_counter",
                "min_rounds": 5,
                "max_time": 1.0,
                "min_time": 5e-06,
                "warmup": false
            },
            "stats": {
                "min": 0.11680253599999446,
                "max": 0.5987794060000056,
                "mean": 0.1756421463333374,
                "stddev": 0.15874535220027985,
                "rounds": 9,
                "median": 0.1226113939999891,
                "iqr": 0.0082575982499975,
                "q1": 0.11968783325001198,
                "q3": 0.12794543150000948,
                "iqr_outliers": 1,
                "stddev_outliers": 1,
                "outliers": "1;1",
                "ld15iqr": 0.11680253599999446,
                "hd15iqr": 0.5987794060000056,
                "ops": 5.693394329753741,
                "total": 1.5807793170000366,
                "iterations": 1
            }
        },
        {
            "group": null,
            "name": "test_06_radiation_pressure",
            "fullname": "tests/benchmarks/test_benchmarks.py::test_06_radiation_pressure",
            "params": null,
            "param": null,
            "extra_info": {},
            "options": {
                "disable_gc": false,
                "timer": "perf_counter",
                "min_rounds": 5,
                "max_time": 1.0,
                "min_time": 5e-06,
                "warmup": false
            },
            "stats": {
                "min": 0.23358240300001398,
                "max": 0.24243670900000325,
                "mean": 0.23922414480001067,
                "stddev": 0.004101745172335008,
                "rounds": 5,
                "median": 0.24173518000000627,
                "iqr": 0.006817230999999424,
                "q1": 0.23548118550001362,
                "q3": 0.24229841650001305,
                "iqr_outliers": 0,
                "stddev_outliers": 1,
                "outliers": "1;0",
                "ld15iqr": 0.23358240300001398,
                "hd15iqr": 0.24243670900000325,
                "ops": 4.180180060152337,
                "total": 1.1961207240000533,
                "iterations": 1
            }
        },
        {
            "group": null,
            "name": "test_07_homodyne",
            "fullname": "tests/benchmarks/test_benchmarks.py::test_07_homodyne",
            "params": null,
            "param": null,
            "extra_info": {},
            "options": {
                "disable_gc": false,
                "timer": "perf_counter",
                "min_rounds": 5,
                "max_time": 1.0,
                "min_time": 5e-06,
                "warmup": false
            },
            "stats": {
                "min": 0.08031650300000592,
                "max": 0.596544477000009,
                "mean": 0.12742582024999885,
                "stddev": 0.14775235854527452,
                "rounds": 12,
                "median": 0.08543312599999808,
                "iqr": 0.002555713999996101,
                "q1": 0.08407825199999763,
                "q3": 0.08663396599999373,
                "iqr_outliers": 1,
                "stddev_outliers": 1,
                "outliers": "1;1",
                "ld15iqr": 0.08031650300000592,
                "hd15iqr": 0.596544477000009,
                "ops": 7.84770306393228,
                "total": 1.5291098429999863,
                "iterations": 1
            }
        },
        {
            "group": null,
            "name": "test_08_optical_spring",
            "fullname": "tests/benchmarks/test_benchmarks.py::test_08_optical_spring",
            "params": null,
            "param": null,
            "extra_info": {},
            "options": {
                "disable_gc": false,
                "timer": "perf_counter",
                "min_rounds": 5,
                "max_time": 1.0,
                "min_time": 5e-06,
                "warmup": false
            },
            "stats": {
                "min": 0.2209989460000088,
                "max": 0.22817026100000248,
                "mean": 0.2242510349999975,
                "stddev": 0.002580633796265316,
                "rounds": 5,
                "median": 0.22409861299999534,
                "iqr": 0.002576978499995164,
                "q1": 0.22285291974999666,
                "q3": 0.22542989824999182,
                "iqr_outliers": 0,
                "stddev_outliers": 2,
                "outliers": "2;0",
                "ld15iqr": 0.2209989460000088,
                "hd15iqr": 0.22817026100000248,
                "ops": 4.459288225804671,
                "total": 1.1212551749999875,
                "iterations": 1
            }
        },
        {
            "group": null,
            "name": "test_09_aligo_sensitivity",
            "fullname": "tests/benchmarks/test_benchmarks.py::test_09_aligo_sensitivity",
            "params": null,
            "param": null,
            "extra_info": {},
            "options": {
                "disable_gc": false,
                "timer": "perf_counter",
                "min_rounds": 5,
                "max_time": 1.0,
                "min_time": 5e-06,
                "warmup": false
            },
            "stats": {
                "min": 0.24770696899997802,
                "max": 0.902751784000003,
                "mean": 0.3836786841999924,
                "stddev": 0.2902217373833294,
                "rounds": 5,
                "median": 0.2569909780000046,
                "iqr": 0.17235680524999708,
                "q1": 0.24923282524999024,
                "q3": 0.4215896304999873,
                "iqr_outliers": 1,
                "stddev_outliers": 1,
                "outliers": "1;1",
                "ld15iqr": 0.24770696899997802,
                "hd15iqr": 0.902751784000003,
                "ops": 2.6063475537743197,
                "total": 1.918393420999962,
                "iterations": 1
            }
        },
        {
            "group": null,
            "name": "test_10_shifted_beam",
            "fullname": "tests/benchmarks/test_benchmarks.py::test_10_shifted_beam",
            "params": null,
            "param": null,
            "extra_info": {},
            "options": {
                "disable_gc": false,
                "timer": "perf_counter",
                "min_rounds": 5,
                "max_time": 1.0,
                "min_time": 5e-06,
                "warmup": false
            },
            "stats": {
                "min": 0.6970119380000028,
                "max": 1.4845019930000092,
                "mean": 0.8627766510000014,
                "stddev": 0.347613510551578,
                "rounds": 5,
                "median": 0.7108028250000018,
                "iqr": 0.20164406100003163,
                "q1": 0.7049546479999833,
                "q3": 0.9065987090000149,
                "iqr_outliers": 1,
                "stddev_outliers": 1,
                "outliers": "1;1",
                "ld15iqr": 0.6970119380000028,
                "hd15iqr": 1.4845019930000092,
                "ops": 1.1590485194991655,
                "total": 4.3138832550000075,
                "iterations": 1
            }
        },
        {
            "group": null,
            "name": "test_angular_radiation_pressure",
            "fullname": "tests/benchmarks/test_benchmarks.py::test_angular_radiation_pressure",
            "params": null,
            "param": null,
            "extra_info": {},
            "options": {
                "disable_gc": false,
                "timer": "perf_counter",
                "min_rounds": 5,
                "max_time": 1.0,
                "min_time": 5e-06,
                "warmup": false
            },
            "stats": {
                "min": 0.2911325449999822,
                "max": 0.29451142199999936,
                "mean": 0.2927375483999981,
                "stddev": 0.0016143138629398375,
                "rounds": 5,
                "median": 0.2924855480000019,
                "iqr": 0.0031280755000011595,
                "q1": 0.29122579324999975,
                "q3": 0.2943538687500009,
                "iqr_outliers": 0,
                "stddev_outliers": 1,
                "outliers": "1;0",
                "ld15iqr": 0.2911325449999822,
                "hd15iqr": 0.29451142199999936,
                "ops": 3.416029154666537,
                "total": 1.4636877419999905,
                "iterations": 1
            }
        },
        {
            "group": null,
            "name": "test_cavity_eigenmodes",
            "fullname": "tests/benchmarks/test_benchmarks.py::test_cavity_eigenmodes",
            "params": null,
            "param": null,
            "extra_info": {},
            "options": {
                "disable_gc": false,
                "timer": "perf_counter",
                "min_rounds": 5,
                "max_time": 1.0,
                "min_time": 5e-06,
                "warmup": false
            },
            "stats": {
                "min": 0.25103952599999957,
                "max": 1.1253537529999846,
                "mean": 0.4297007691999909,
                "stddev": 0.3889347571087393,
                "rounds": 5,
                "median": 0.2531913109999948,
                "iqr": 0.22962095675001137,
                "q1": 0.2518334024999831,
                "q3": 0.48145435924999447,
                "iqr_outliers": 1,
                "stddev_outliers": 1,
                "outliers": "1;1",
                "ld15iqr": 0.25103952599999957,
                "hd15iqr": 1.1253537529999846,
                "ops": 2.327200860872979,
                "total": 2.1485038459999544,
                "iterations": 1
            }
        },
        {
            "group": null,
            "name": "test_coupled_cavity_commands",
            "fullname": "tests/benchmarks/test_benchmarks.py::test_coupled_cavity_commands",
            "params": null,
            "param": null,
            "extra_info": {},
            "options": {
                "disable_gc": false,
                "timer": "perf_counter",
                "min_rounds": 5,
                "max_time": 1.0,
                "min_time": 5e-06,
                "warmup": false
            },
            "stats": {
                "min": 4.119794280999997,
                "max": 5.2574326489999805,
                "mean": 4.6179343347999975,
                "stddev": 0.5733170506579166,
                "rounds": 5,
                "median": 4.255630639000003,
                "iqr": 1.035904909750002,
                "q1": 4.200506200749999,
                "q3": 5.236411110500001,
                "iqr_outliers": 0,
                "stddev_outliers": 2,
                "outliers": "2;0",
                "ld15iqr": 4.119794280999997,
                "hd15iqr": 5.2574326489999805,
                "ops": 0.2165470375930129,
                "total": 23.089671673999987,
                "iterations": 1
            }
        },
        {
            "group": null,
            "name": "test_frequency_dependant_squeezing",
            "fullname": "tests/benchmarks/test_benchmarks.py::test_frequency_dependant_squeezing",
            "params": null,
            "param": null,
            "extra_info": {},
            "options": {
                "disable_gc": false,
                "timer": "perf_counter",
                "min_rounds": 5,
                "max_time": 1.0,
                "min_time": 5e-06,
                "warmup": false
            },
            "stats": {
                "min": 1.4709030530000007,
                "max": 2.792728371999999,
                "mean": 1.736767167200003,
                "stddev": 0.5903016726259375,
                "rounds": 5,
                "median": 1.4731314730000236,
                "iqr": 0.33191270224999414,
                "q1": 1.4721499287499995,
                "q3": 1.8040626309999936,
                "iqr_outliers": 1,
                "stddev_outliers": 1,
                "outliers": "1;1",
                "ld15iqr": 1.4709030530000007,
                "hd15iqr": 2.792728371999999,
                "ops": 0.5757824185565352,
                "total": 8.683835836000014,
                "iterations": 1
            }
        },
        {
            "group": null,
            "name": "test_lock_actions",
            "fullname": "tests/benchmarks/test_benchmarks.py::test_lock_actions",
            "params": null,
            "param": null,
            "extra_info": {},
            "options": {
                "disable_gc": false,
                "timer": "perf_counter",
                "min_rounds": 5,
                "max_time": 1.0,
                "min_time": 5e-06,
                "warmup": false
            },
            "stats": {
                "min": 3.0619069599999875,
                "max": 4.439220742999993,
                "mean": 3.3513904352,
                "stddev": 0.60833504274031,
                "rounds": 5,
                "median": 3.075550948,
                "iqr": 0.3684278545000197,
                "q1": 3.0710296074999945,
                "q3": 3.4394574620000142,
                "iqr_outliers": 1,
                "stddev_outliers": 1,
                "outliers": "1;1",
                "ld15iqr": 3.0619069599999875,
                "hd15iqr": 4.439220742999993,
                "ops": 0.29838361698980126,
                "total": 16.756952176,
                "iterations": 1
            }
        }
    ],
    "datetime": "2024-08-23T05:10:14.255744",
    "version": "4.0.0"
}