{
    "machine_info": {
        "node": "runner-j1aldqxs-project-39604133-concurrent-0",
        "processor": "",
        "machine": "x86_64",
        "python_compiler": "GCC 12.2.0",
        "python_implementation": "CPython",
        "python_implementation_version": "3.12.2",
        "python_version": "3.12.2",
        "python_build": [
            "main",
            "Mar 12 2024 11:02:14"
        ],
        "release": "5.4.109+",
        "system": "Linux",
        "cpu": {
            "python_version": "3.12.2.final.0 (64 bit)",
            "cpuinfo_version": [
                9,
                0,
                0
            ],
            "cpuinfo_version_string": "9.0.0",
            "arch": "X86_64",
            "bits": 64,
            "count": 2,
            "arch_string_raw": "x86_64",
            "vendor_id_raw": "AuthenticAMD",
            "brand_raw": "AMD EPYC 7B12",
            "hz_advertised_friendly": "2.2500 GHz",
            "hz_actual_friendly": "2.2500 GHz",
            "hz_advertised": [
                2249998000,
                0
            ],
            "hz_actual": [
                2249998000,
                0
            ],
            "model": 49,
            "family": 23,
            "flags": [
                "3dnowext",
                "3dnowprefetch",
                "abm",
                "adx",
                "aes",
                "apic",
                "arat",
                "avx",
                "avx2",
                "bmi1",
                "bmi2",
                "clflush",
                "clflushopt",
                "clwb",
                "clzero",
                "cmov",
                "cmp_legacy",
                "constant_tsc",
                "cpuid",
                "cr8_legacy",
                "cx16",
                "cx8",
                "de",
                "extd_apicid",
                "f16c",
                "fma",
                "fpu",
                "fsgsbase",
                "fxsr",
                "fxsr_opt",
                "ht",
                "hypervisor",
                "ibpb",
                "ibrs",
                "lahf_lm",
                "lm",
                "mca",
                "mce",
                "misalignsse",
                "mmx",
                "mmxext",
                "movbe",
                "msr",
                "mtrr",
                "nonstop_tsc",
                "nopl",
                "npt",
                "nrip_save",
                "nx",
                "osvw",
                "osxsave",
                "pae",
                "pat",
                "pclmulqdq",
                "pdpe1gb",
                "pge",
                "pni",
                "popcnt",
                "pse",
                "pse36",
                "rdpid",
                "rdrand",
                "rdrnd",
                "rdseed",
                "rdtscp",
                "rep_good",
                "sep",
                "sha",
                "sha_ni",
                "smap",
                "smep",
                "ssbd",
                "sse",
                "sse2",
                "sse4_1",
                "sse4_2",
                "sse4a",
                "ssse3",
                "stibp",
                "syscall",
                "topoext",
                "tsc",
                "tsc_adjust",
                "tsc_known_freq",
                "umip",
                "vme",
                "vmmcall",
                "x2apic",
                "xgetbv1",
                "xsave",
                "xsavec",
                "xsaveerptr",
                "xsaveopt"
            ],
            "l3_cache_size": 524288,
            "l2_cache_size": 524288,
            "l1_data_cache_size": 32768,
            "l1_instruction_cache_size": 32768,
            "l2_cache_line_size": 512,
            "l2_cache_associativity": 6
        }
    },
    "commit_info": {
        "id": "40bc353c20049a2abdb9c37514e11950d90db71e",
        "time": "2024-04-08T13:29:40+00:00",
        "author_time": "2024-04-08T13:29:40+00:00",
        "dirty": false,
        "project": "finesse3",
        "branch": "(detached head)"
    },
    "benchmarks": [
        {
            "group": null,
            "name": "test_01_simple_cav",
            "fullname": "tests/benchmarks/test_benchmarks.py::test_01_simple_cav",
            "params": null,
            "param": null,
            "extra_info": {},
            "options": {
                "disable_gc": false,
                "timer": "perf_counter",
                "min_rounds": 5,
                "max_time": 1.0,
                "min_time": 5e-06,
                "warmup": false
            },
            "stats": {
                "min": 0.39004072499999154,
                "max": 0.5892094139999955,
                "mean": 0.4615145671999983,
                "stddev": 0.09701264006779324,
                "rounds": 5,
                "median": 0.39413088099999527,
                "iqr": 0.1641688267500072,
                "q1": 0.3906437849999982,
                "q3": 0.5548126117500054,
                "iqr_outliers": 0,
                "stddev_outliers": 1,
                "outliers": "1;0",
                "ld15iqr": 0.39004072499999154,
                "hd15iqr": 0.5892094139999955,
                "ops": 2.166778843118614,
                "total": 2.3075728359999914,
                "iterations": 1
            }
        },
        {
            "group": null,
            "name": "test_02_pdh_lock",
            "fullname": "tests/benchmarks/test_benchmarks.py::test_02_pdh_lock",
            "params": null,
            "param": null,
            "extra_info": {},
            "options": {
                "disable_gc": false,
                "timer": "perf_counter",
                "min_rounds": 5,
                "max_time": 1.0,
                "min_time": 5e-06,
                "warmup": false
            },
            "stats": {
                "min": 1.2924331139999907,
                "max": 1.6121208240000016,
                "mean": 1.416870076799998,
                "stddev": 0.1481618613457436,
                "rounds": 5,
                "median": 1.3365158000000008,
                "iqr": 0.2564446409999981,
                "q1": 1.3010771639999987,
                "q3": 1.5575218049999968,
                "iqr_outliers": 0,
                "stddev_outliers": 1,
                "outliers": "1;0",
                "ld15iqr": 1.2924331139999907,
                "hd15iqr": 1.6121208240000016,
                "ops": 0.7057810143457195,
                "total": 7.08435038399999,
                "iterations": 1
            }
        },
        {
            "group": null,
            "name": "test_03_near_unstable",
            "fullname": "tests/benchmarks/test_benchmarks.py::test_03_near_unstable",
            "params": null,
            "param": null,
            "extra_info": {},
            "options": {
                "disable_gc": false,
                "timer": "perf_counter",
                "min_rounds": 5,
                "max_time": 1.0,
                "min_time": 5e-06,
                "warmup": false
            },
            "stats": {
                "min": 1.720000000204891e-06,
                "max": 9.208899999180176e-05,
                "mean": 2.602997404891834e-06,
                "stddev": 1.1319815626205202e-06,
                "rounds": 50865,
                "median": 3.1099999944217416e-06,
                "iqr": 1.3599999988400668e-06,
                "q1": 1.810000000546097e-06,
                "q3": 3.169999999386164e-06,
                "iqr_outliers": 309,
                "stddev_outliers": 401,
                "outliers": "401;309",
                "ld15iqr": 1.720000000204891e-06,
                "hd15iqr": 5.310000005920301e-06,
                "ops": 384172.4921126283,
                "total": 0.13240146299982314,
                "iterations": 1
            }
        },
        {
            "group": null,
            "name": "test_04_geometrical_params",
            "fullname": "tests/benchmarks/test_benchmarks.py::test_04_geometrical_params",
            "params": null,
            "param": null,
            "extra_info": {},
            "options": {
                "disable_gc": false,
                "timer": "perf_counter",
                "min_rounds": 5,
                "max_time": 1.0,
                "min_time": 5e-06,
                "warmup": false
            },
            "stats": {
                "min": 0.5111493490000072,
                "max": 0.8516920080000006,
                "mean": 0.5868678839999972,
                "stddev": 0.1484399148188378,
                "rounds": 5,
                "median": 0.5189364579999847,
                "iqr": 0.10399790450001944,
                "q1": 0.513066819249989,
                "q3": 0.6170647237500084,
                "iqr_outliers": 1,
                "stddev_outliers": 1,
                "outliers": "1;1",
                "ld15iqr": 0.5111493490000072,
                "hd15iqr": 0.8516920080000006,
                "ops": 1.7039610230230364,
                "total": 2.9343394199999864,
                "iterations": 1
            }
        },
        {
            "group": null,
            "name": "test_05_modulation",
            "fullname": "tests/benchmarks/test_benchmarks.py::test_05_modulation",
            "params": null,
            "param": null,
            "extra_info": {},
            "options": {
                "disable_gc": false,
                "timer": "perf_counter",
                "min_rounds": 5,
                "max_time": 1.0,
                "min_time": 5e-06,
                "warmup": false
            },
            "stats": {
                "min": 0.1728228420000164,
                "max": 0.6082832159999896,
                "mean": 0.22919633537500061,
                "stddev": 0.1531862167351078,
                "rounds": 8,
                "median": 0.17544921249999845,
                "iqr": 0.004357308999999532,
                "q1": 0.17321289550000074,
                "q3": 0.17757020450000027,
                "iqr_outliers": 1,
                "stddev_outliers": 1,
                "outliers": "1;1",
                "ld15iqr": 0.1728228420000164,
                "hd15iqr": 0.6082832159999896,
                "ops": 4.363071505326843,
                "total": 1.833570683000005,
                "iterations": 1
            }
        },
        {
            "group": null,
            "name": "test_06_radiation_pressure",
            "fullname": "tests/benchmarks/test_benchmarks.py::test_06_radiation_pressure",
            "params": null,
            "param": null,
            "extra_info": {},
            "options": {
                "disable_gc": false,
                "timer": "perf_counter",
                "min_rounds": 5,
                "max_time": 1.0,
                "min_time": 5e-06,
                "warmup": false
            },
            "stats": {
                "min": 0.23546913599997765,
                "max": 0.24724879300001135,
                "mean": 0.23961452620000614,
                "stddev": 0.004510516291426588,
                "rounds": 5,
                "median": 0.23802483299999722,
                "iqr": 0.0042790570000121875,
                "q1": 0.2371989135000092,
                "q3": 0.2414779705000214,
                "iqr_outliers": 0,
                "stddev_outliers": 1,
                "outliers": "1;0",
                "ld15iqr": 0.23546913599997765,
                "hd15iqr": 0.24724879300001135,
                "ops": 4.173369686132052,
                "total": 1.1980726310000307,
                "iterations": 1
            }
        },
        {
            "group": null,
            "name": "test_07_homodyne",
            "fullname": "tests/benchmarks/test_benchmarks.py::test_07_homodyne",
            "params": null,
            "param": null,
            "extra_info": {},
            "options": {
                "disable_gc": false,
                "timer": "perf_counter",
                "min_rounds": 5,
                "max_time": 1.0,
                "min_time": 5e-06,
                "warmup": false
            },
            "stats": {
                "min": 0.11107841399999074,
                "max": 0.5919568279999794,
                "mean": 0.16044812429999525,
                "stddev": 0.15162363385411878,
                "rounds": 10,
                "median": 0.11232792299999517,
                "iqr": 0.002083583000000999,
                "q1": 0.11134041200000411,
                "q3": 0.1134239950000051,
                "iqr_outliers": 1,
                "stddev_outliers": 1,
                "outliers": "1;1",
                "ld15iqr": 0.11107841399999074,
                "hd15iqr": 0.5919568279999794,
                "ops": 6.2325440347951115,
                "total": 1.6044812429999524,
                "iterations": 1
            }
        },
        {
            "group": null,
            "name": "test_08_optical_spring",
            "fullname": "tests/benchmarks/test_benchmarks.py::test_08_optical_spring",
            "params": null,
            "param": null,
            "extra_info": {},
            "options": {
                "disable_gc": false,
                "timer": "perf_counter",
                "min_rounds": 5,
                "max_time": 1.0,
                "min_time": 5e-06,
                "warmup": false
            },
            "stats": {
                "min": 0.289386004999983,
                "max": 0.29932632499998135,
                "mean": 0.2939518511999893,
                "stddev": 0.0035357323861656327,
                "rounds": 5,
                "median": 0.29365693899998746,
                "iqr": 0.002733303749991478,
                "q1": 0.29249363449999777,
                "q3": 0.29522693824998925,
                "iqr_outliers": 0,
                "stddev_outliers": 2,
                "outliers": "2;0",
                "ld15iqr": 0.289386004999983,
                "hd15iqr": 0.29932632499998135,
                "ops": 3.401917681136333,
                "total": 1.4697592559999464,
                "iterations": 1
            }
        },
        {
            "group": null,
            "name": "test_09_aligo_sensitivity",
            "fullname": "tests/benchmarks/test_benchmarks.py::test_09_aligo_sensitivity",
            "params": null,
            "param": null,
            "extra_info": {},
            "options": {
                "disable_gc": false,
                "timer": "perf_counter",
                "min_rounds": 5,
                "max_time": 1.0,
                "min_time": 5e-06,
                "warmup": false
            },
            "stats": {
                "min": 0.3146209429999942,
                "max": 0.8930209199999979,
                "mean": 0.4371375893999982,
                "stddev": 0.2548954225209446,
                "rounds": 5,
                "median": 0.3254978349999931,
                "iqr": 0.14606795049999732,
                "q1": 0.32262685100000255,
                "q3": 0.46869480149999987,
                "iqr_outliers": 1,
                "stddev_outliers": 1,
                "outliers": "1;1",
                "ld15iqr": 0.3146209429999942,
                "hd15iqr": 0.8930209199999979,
                "ops": 2.287609265935171,
                "total": 2.185687946999991,
                "iterations": 1
            }
        },
        {
            "group": null,
            "name": "test_10_shifted_beam",
            "fullname": "tests/benchmarks/test_benchmarks.py::test_10_shifted_beam",
            "params": null,
            "param": null,
            "extra_info": {},
            "options": {
                "disable_gc": false,
                "timer": "perf_counter",
                "min_rounds": 5,
                "max_time": 1.0,
                "min_time": 5e-06,
                "warmup": false
            },
            "stats": {
                "min": 5.182552805,
                "max": 5.267833999000004,
                "mean": 5.2262128926,
                "stddev": 0.038359594430247626,
                "rounds": 5,
                "median": 5.214429007999996,
                "iqr": 0.06890741075000051,
                "q1": 5.196687889250001,
                "q3": 5.265595300000001,
                "iqr_outliers": 0,
                "stddev_outliers": 3,
                "outliers": "3;0",
                "ld15iqr": 5.182552805,
                "hd15iqr": 5.267833999000004,
                "ops": 0.1913431428359796,
                "total": 26.131064463,
                "iterations": 1
            }
        },
        {
            "group": null,
            "name": "test_angular_radiation_pressure",
            "fullname": "tests/benchmarks/test_benchmarks.py::test_angular_radiation_pressure",
            "params": null,
            "param": null,
            "extra_info": {},
            "options": {
                "disable_gc": false,
                "timer": "perf_counter",
                "min_rounds": 5,
                "max_time": 1.0,
                "min_time": 5e-06,
                "warmup": false
            },
            "stats": {
                "min": 0.3524030039999957,
                "max": 0.3761262879999947,
                "mean": 0.36526188579999824,
                "stddev": 0.010589613227171352,
                "rounds": 5,
                "median": 0.3706937249999953,
                "iqr": 0.018013084000010338,
                "q1": 0.3547170239999957,
                "q3": 0.37273010800000606,
                "iqr_outliers": 0,
                "stddev_outliers": 2,
                "outliers": "2;0",
                "ld15iqr": 0.3524030039999957,
                "hd15iqr": 0.3761262879999947,
                "ops": 2.7377616961315177,
                "total": 1.8263094289999913,
                "iterations": 1
            }
        },
        {
            "group": null,
            "name": "test_cavity_eigenmodes",
            "fullname": "tests/benchmarks/test_benchmarks.py::test_cavity_eigenmodes",
            "params": null,
            "param": null,
            "extra_info": {},
            "options": {
                "disable_gc": false,
                "timer": "perf_counter",
                "min_rounds": 5,
                "max_time": 1.0,
                "min_time": 5e-06,
                "warmup": false
            },
            "stats": {
                "min": 0.27606292499999086,
                "max": 1.1349436159999868,
                "mean": 0.45013181599999824,
                "stddev": 0.38283073105036614,
                "rounds": 5,
                "median": 0.27907817600001295,
                "iqr": 0.2190347029999984,
                "q1": 0.27707385224999825,
                "q3": 0.49610855524999664,
                "iqr_outliers": 1,
                "stddev_outliers": 1,
                "outliers": "1;1",
                "ld15iqr": 0.27606292499999086,
                "hd15iqr": 1.1349436159999868,
                "ops": 2.2215714696336946,
                "total": 2.2506590799999913,
                "iterations": 1
            }
        },
        {
            "group": null,
            "name": "test_coupled_cavity_commands",
            "fullname": "tests/benchmarks/test_benchmarks.py::test_coupled_cavity_commands",
            "params": null,
            "param": null,
            "extra_info": {},
            "options": {
                "disable_gc": false,
                "timer": "perf_counter",
                "min_rounds": 5,
                "max_time": 1.0,
                "min_time": 5e-06,
                "warmup": false
            },
            "stats": {
                "min": 5.748856840999991,
                "max": 7.106217103000006,
                "mean": 6.291167962599997,
                "stddev": 0.6347772398289985,
                "rounds": 5,
                "median": 5.98261345200001,
                "iqr": 1.1313022992500024,
                "q1": 5.7730402497499895,
                "q3": 6.904342548999992,
                "iqr_outliers": 0,
                "stddev_outliers": 1,
                "outliers": "1;0",
                "ld15iqr": 5.748856840999991,
                "hd15iqr": 7.106217103000006,
                "ops": 0.15895299663668855,
                "total": 31.455839812999983,
                "iterations": 1
            }
        },
        {
            "group": null,
            "name": "test_frequency_dependant_squeezing",
            "fullname": "tests/benchmarks/test_benchmarks.py::test_frequency_dependant_squeezing",
            "params": null,
            "param": null,
            "extra_info": {},
            "options": {
                "disable_gc": false,
                "timer": "perf_counter",
                "min_rounds": 5,
                "max_time": 1.0,
                "min_time": 5e-06,
                "warmup": false
            },
            "stats": {
                "min": 1.5080237399999987,
                "max": 2.802035372000006,
                "mean": 1.7726111593999974,
                "stddev": 0.5755097762267969,
                "rounds": 5,
                "median": 1.5207716500000004,
                "iqr": 0.33507592325001667,
                "q1": 1.5083038154999855,
                "q3": 1.8433797387500022,
                "iqr_outliers": 1,
                "stddev_outliers": 1,
                "outliers": "1;1",
                "ld15iqr": 1.5080237399999987,
                "hd15iqr": 2.802035372000006,
                "ops": 0.564139515142444,
                "total": 8.863055796999987,
                "iterations": 1
            }
        },
        {
            "group": null,
            "name": "test_lock_actions",
            "fullname": "tests/benchmarks/test_benchmarks.py::test_lock_actions",
            "params": null,
            "param": null,
            "extra_info": {},
            "options": {
                "disable_gc": false,
                "timer": "perf_counter",
                "min_rounds": 5,
                "max_time": 1.0,
                "min_time": 5e-06,
                "warmup": false
            },
            "stats": {
                "min": 5.2062622440000155,
                "max": 6.7143611839999835,
                "mean": 5.595971757799998,
                "stddev": 0.6318834021531378,
                "rounds": 5,
                "median": 5.403821751999999,
                "iqr": 0.500646608750003,
                "q1": 5.235534727499996,
                "q3": 5.736181336249999,
                "iqr_outliers": 1,
                "stddev_outliers": 1,
                "outliers": "1;1",
                "ld15iqr": 5.2062622440000155,
                "hd15iqr": 6.7143611839999835,
                "ops": 0.17869997263766396,
                "total": 27.97985878899999,
                "iterations": 1
            }
        }
    ],
    "datetime": "2024-04-08T13:37:12.779172",
    "version": "4.0.0"
}