{
    "machine_info": {
        "node": "runner-xxurkrix-project-39604133-concurrent-0",
        "processor": "",
        "machine": "x86_64",
        "python_compiler": "GCC 12.2.0",
        "python_implementation": "CPython",
        "python_implementation_version": "3.12.1",
        "python_version": "3.12.1",
        "python_build": [
            "main",
            "Feb  1 2024 04:22:19"
        ],
        "release": "5.4.109+",
        "system": "Linux",
        "cpu": {
            "python_version": "3.12.1.final.0 (64 bit)",
            "cpuinfo_version": [
                9,
                0,
                0
            ],
            "cpuinfo_version_string": "9.0.0",
            "arch": "X86_64",
            "bits": 64,
            "count": 2,
            "arch_string_raw": "x86_64",
            "vendor_id_raw": "AuthenticAMD",
            "brand_raw": "AMD EPYC 7B12",
            "hz_advertised_friendly": "2.2500 GHz",
            "hz_actual_friendly": "2.2500 GHz",
            "hz_advertised": [
                2249998000,
                0
            ],
            "hz_actual": [
                2249998000,
                0
            ],
            "model": 49,
            "family": 23,
            "flags": [
                "3dnowext",
                "3dnowprefetch",
                "abm",
                "adx",
                "aes",
                "apic",
                "arat",
                "avx",
                "avx2",
                "bmi1",
                "bmi2",
                "clflush",
                "clflushopt",
                "clwb",
                "clzero",
                "cmov",
                "cmp_legacy",
                "constant_tsc",
                "cpuid",
                "cr8_legacy",
                "cx16",
                "cx8",
                "de",
                "extd_apicid",
                "f16c",
                "fma",
                "fpu",
                "fsgsbase",
                "fxsr",
                "fxsr_opt",
                "ht",
                "hypervisor",
                "ibpb",
                "ibrs",
                "lahf_lm",
                "lm",
                "mca",
                "mce",
                "misalignsse",
                "mmx",
                "mmxext",
                "movbe",
                "msr",
                "mtrr",
                "nonstop_tsc",
                "nopl",
                "npt",
                "nrip_save",
                "nx",
                "osvw",
                "osxsave",
                "pae",
                "pat",
                "pclmulqdq",
                "pdpe1gb",
                "pge",
                "pni",
                "popcnt",
                "pse",
                "pse36",
                "rdpid",
                "rdrand",
                "rdrnd",
                "rdseed",
                "rdtscp",
                "rep_good",
                "sep",
                "sha",
                "sha_ni",
                "smap",
                "smep",
                "ssbd",
                "sse",
                "sse2",
                "sse4_1",
                "sse4_2",
                "sse4a",
                "ssse3",
                "stibp",
                "syscall",
                "topoext",
                "tsc",
                "tsc_adjust",
                "tsc_known_freq",
                "umip",
                "vme",
                "vmmcall",
                "x2apic",
                "xgetbv1",
                "xsave",
                "xsavec",
                "xsaveerptr",
                "xsaveopt"
            ],
            "l3_cache_size": 524288,
            "l2_cache_size": 524288,
            "l1_data_cache_size": 32768,
            "l1_instruction_cache_size": 32768,
            "l2_cache_line_size": 512,
            "l2_cache_associativity": 6
        }
    },
    "commit_info": {
        "id": "6fbd7124da8e45b263c12747a25ba3b3916c5b5f",
        "time": "2024-02-06T15:54:35+01:00",
        "author_time": "2024-02-06T15:54:35+01:00",
        "dirty": false,
        "project": "finesse3",
        "branch": "(detached head)"
    },
    "benchmarks": [
        {
            "group": null,
            "name": "test_01_simple_cav",
            "fullname": "tests/benchmarks/test_benchmarks.py::test_01_simple_cav",
            "params": null,
            "param": null,
            "extra_info": {},
            "options": {
                "disable_gc": false,
                "timer": "perf_counter",
                "min_rounds": 5,
                "max_time": 1.0,
                "min_time": 5e-06,
                "warmup": false
            },
            "stats": {
                "min": 0.3671863219999949,
                "max": 0.5445875649999863,
                "mean": 0.406623291799994,
                "stddev": 0.07734148028374085,
                "rounds": 5,
                "median": 0.3723155149999968,
                "iqr": 0.05486667349999763,
                "q1": 0.3674235454999959,
                "q3": 0.4222902189999935,
                "iqr_outliers": 1,
                "stddev_outliers": 1,
                "outliers": "1;1",
                "ld15iqr": 0.3671863219999949,
                "hd15iqr": 0.5445875649999863,
                "ops": 2.4592786988992024,
                "total": 2.03311645899997,
                "iterations": 1
            }
        },
        {
            "group": null,
            "name": "test_02_pdh_lock",
            "fullname": "tests/benchmarks/test_benchmarks.py::test_02_pdh_lock",
            "params": null,
            "param": null,
            "extra_info": {},
            "options": {
                "disable_gc": false,
                "timer": "perf_counter",
                "min_rounds": 5,
                "max_time": 1.0,
                "min_time": 5e-06,
                "warmup": false
            },
            "stats": {
                "min": 1.3063404350000098,
                "max": 1.583835166,
                "mean": 1.3682643722000023,
                "stddev": 0.12064361819040617,
                "rounds": 5,
                "median": 1.3192543490000048,
                "iqr": 0.07589251400001018,
                "q1": 1.310285159749995,
                "q3": 1.3861776737500051,
                "iqr_outliers": 1,
                "stddev_outliers": 1,
                "outliers": "1;1",
                "ld15iqr": 1.3063404350000098,
                "hd15iqr": 1.583835166,
                "ops": 0.7308529114093075,
                "total": 6.8413218610000115,
                "iterations": 1
            }
        },
        {
            "group": null,
            "name": "test_03_near_unstable",
            "fullname": "tests/benchmarks/test_benchmarks.py::test_03_near_unstable",
            "params": null,
            "param": null,
            "extra_info": {},
            "options": {
                "disable_gc": false,
                "timer": "perf_counter",
                "min_rounds": 5,
                "max_time": 1.0,
                "min_time": 5e-06,
                "warmup": false
            },
            "stats": {
                "min": 1.7499999955816747e-06,
                "max": 4.323000000283628e-05,
                "mean": 2.6100787142297482e-06,
                "stddev": 9.900087637131638e-07,
                "rounds": 51922,
                "median": 3.1300000102874037e-06,
                "iqr": 1.370000006772898e-06,
                "q1": 1.8499999896448571e-06,
                "q3": 3.219999996417755e-06,
                "iqr_outliers": 314,
                "stddev_outliers": 456,
                "outliers": "456;314",
                "ld15iqr": 1.7499999955816747e-06,
                "hd15iqr": 5.329999993364254e-06,
                "ops": 383130.2077397718,
                "total": 0.135520507000237,
                "iterations": 1
            }
        },
        {
            "group": null,
            "name": "test_04_geometrical_params",
            "fullname": "tests/benchmarks/test_benchmarks.py::test_04_geometrical_params",
            "params": null,
            "param": null,
            "extra_info": {},
            "options": {
                "disable_gc": false,
                "timer": "perf_counter",
                "min_rounds": 5,
                "max_time": 1.0,
                "min_time": 5e-06,
                "warmup": false
            },
            "stats": {
                "min": 0.5021817070000054,
                "max": 0.8575153010000065,
                "mean": 0.5797882874000038,
                "stddev": 0.15540569357770911,
                "rounds": 5,
                "median": 0.5151465889999827,
                "iqr": 0.09905378350001115,
                "q1": 0.5044719242500051,
                "q3": 0.6035257077500162,
                "iqr_outliers": 1,
                "stddev_outliers": 1,
                "outliers": "1;1",
                "ld15iqr": 0.5021817070000054,
                "hd15iqr": 0.8575153010000065,
                "ops": 1.7247675086442138,
                "total": 2.898941437000019,
                "iterations": 1
            }
        },
        {
            "group": null,
            "name": "test_05_modulation",
            "fullname": "tests/benchmarks/test_benchmarks.py::test_05_modulation",
            "params": null,
            "param": null,
            "extra_info": {},
            "options": {
                "disable_gc": false,
                "timer": "perf_counter",
                "min_rounds": 5,
                "max_time": 1.0,
                "min_time": 5e-06,
                "warmup": false
            },
            "stats": {
                "min": 0.17359015299999214,
                "max": 0.5814324929999941,
                "mean": 0.22861855549999888,
                "stddev": 0.14259175365145552,
                "rounds": 8,
                "median": 0.17936392299999682,
                "iqr": 0.00569921500000703,
                "q1": 0.17594988049999927,
                "q3": 0.1816490955000063,
                "iqr_outliers": 1,
                "stddev_outliers": 1,
                "outliers": "1;1",
                "ld15iqr": 0.17359015299999214,
                "hd15iqr": 0.5814324929999941,
                "ops": 4.374098147077151,
                "total": 1.828948443999991,
                "iterations": 1
            }
        },
        {
            "group": null,
            "name": "test_06_radiation_pressure",
            "fullname": "tests/benchmarks/test_benchmarks.py::test_06_radiation_pressure",
            "params": null,
            "param": null,
            "extra_info": {},
            "options": {
                "disable_gc": false,
                "timer": "perf_counter",
                "min_rounds": 5,
                "max_time": 1.0,
                "min_time": 5e-06,
                "warmup": false
            },
            "stats": {
                "min": 0.23512777100000903,
                "max": 0.24082170199997677,
                "mean": 0.23747542539999814,
                "stddev": 0.0021936523029474795,
                "rounds": 5,
                "median": 0.2375392490000081,
                "iqr": 0.0029125395000022536,
                "q1": 0.23574556624999587,
                "q3": 0.23865810574999813,
                "iqr_outliers": 0,
                "stddev_outliers": 2,
                "outliers": "2;0",
                "ld15iqr": 0.23512777100000903,
                "hd15iqr": 0.24082170199997677,
                "ops": 4.210962032452929,
                "total": 1.1873771269999907,
                "iterations": 1
            }
        },
        {
            "group": null,
            "name": "test_07_homodyne",
            "fullname": "tests/benchmarks/test_benchmarks.py::test_07_homodyne",
            "params": null,
            "param": null,
            "extra_info": {},
            "options": {
                "disable_gc": false,
                "timer": "perf_counter",
                "min_rounds": 5,
                "max_time": 1.0,
                "min_time": 5e-06,
                "warmup": false
            },
            "stats": {
                "min": 0.11123520900000017,
                "max": 0.11689298900000722,
                "mean": 0.11326549040000486,
                "stddev": 0.001724495937274479,
                "rounds": 10,
                "median": 0.11292101000000798,
                "iqr": 0.002621266000005562,
                "q1": 0.11201535500001114,
                "q3": 0.1146366210000167,
                "iqr_outliers": 0,
                "stddev_outliers": 3,
                "outliers": "3;0",
                "ld15iqr": 0.11123520900000017,
                "hd15iqr": 0.11689298900000722,
                "ops": 8.82881446474501,
                "total": 1.1326549040000486,
                "iterations": 1
            }
        },
        {
            "group": null,
            "name": "test_08_optical_spring",
            "fullname": "tests/benchmarks/test_benchmarks.py::test_08_optical_spring",
            "params": null,
            "param": null,
            "extra_info": {},
            "options": {
                "disable_gc": false,
                "timer": "perf_counter",
                "min_rounds": 5,
                "max_time": 1.0,
                "min_time": 5e-06,
                "warmup": false
            },
            "stats": {
                "min": 0.29519439799997826,
                "max": 0.3070349959999987,
                "mean": 0.3004129065999962,
                "stddev": 0.005580782243239519,
                "rounds": 5,
                "median": 0.2989713679999966,
                "iqr": 0.01056567225002425,
                "q1": 0.29531975224998774,
                "q3": 0.305885424500012,
                "iqr_outliers": 0,
                "stddev_outliers": 1,
                "outliers": "1;0",
                "ld15iqr": 0.29519439799997826,
                "hd15iqr": 0.3070349959999987,
                "ops": 3.3287517880565414,
                "total": 1.5020645329999809,
                "iterations": 1
            }
        },
        {
            "group": null,
            "name": "test_09_aligo_sensitivity",
            "fullname": "tests/benchmarks/test_benchmarks.py::test_09_aligo_sensitivity",
            "params": null,
            "param": null,
            "extra_info": {},
            "options": {
                "disable_gc": false,
                "timer": "perf_counter",
                "min_rounds": 5,
                "max_time": 1.0,
                "min_time": 5e-06,
                "warmup": false
            },
            "stats": {
                "min": 0.3255887090000158,
                "max": 0.977139864999998,
                "mean": 0.45818836820000686,
                "stddev": 0.290126552820708,
                "rounds": 5,
                "median": 0.326707803000005,
                "iqr": 0.16902856099999042,
                "q1": 0.32639134025001226,
                "q3": 0.4954199012500027,
                "iqr_outliers": 1,
                "stddev_outliers": 1,
                "outliers": "1;1",
                "ld15iqr": 0.3255887090000158,
                "hd15iqr": 0.977139864999998,
                "ops": 2.182508482108571,
                "total": 2.290941841000034,
                "iterations": 1
            }
        },
        {
            "group": null,
            "name": "test_10_shifted_beam",
            "fullname": "tests/benchmarks/test_benchmarks.py::test_10_shifted_beam",
            "params": null,
            "param": null,
            "extra_info": {},
            "options": {
                "disable_gc": false,
                "timer": "perf_counter",
                "min_rounds": 5,
                "max_time": 1.0,
                "min_time": 5e-06,
                "warmup": false
            },
            "stats": {
                "min": 0.7220325430000116,
                "max": 0.7265519439999935,
                "mean": 0.7243573249999997,
                "stddev": 0.0017794093154167622,
                "rounds": 5,
                "median": 0.7245056820000002,
                "iqr": 0.002780549249990827,
                "q1": 0.7229439572500027,
                "q3": 0.7257245064999935,
                "iqr_outliers": 0,
                "stddev_outliers": 2,
                "outliers": "2;0",
                "ld15iqr": 0.7220325430000116,
                "hd15iqr": 0.7265519439999935,
                "ops": 1.3805341169152952,
                "total": 3.6217866249999986,
                "iterations": 1
            }
        },
        {
            "group": null,
            "name": "test_angular_radiation_pressure",
            "fullname": "tests/benchmarks/test_benchmarks.py::test_angular_radiation_pressure",
            "params": null,
            "param": null,
            "extra_info": {},
            "options": {
                "disable_gc": false,
                "timer": "perf_counter",
                "min_rounds": 5,
                "max_time": 1.0,
                "min_time": 5e-06,
                "warmup": false
            },
            "stats": {
                "min": 0.3328387150000083,
                "max": 0.33831953800000747,
                "mean": 0.3352953098000057,
                "stddev": 0.002042651080855396,
                "rounds": 5,
                "median": 0.3353751930000044,
                "iqr": 0.00257621849999623,
                "q1": 0.33383533600000703,
                "q3": 0.33641155450000326,
                "iqr_outliers": 0,
                "stddev_outliers": 2,
                "outliers": "2;0",
                "ld15iqr": 0.3328387150000083,
                "hd15iqr": 0.33831953800000747,
                "ops": 2.9824455361349136,
                "total": 1.6764765490000286,
                "iterations": 1
            }
        },
        {
            "group": null,
            "name": "test_cavity_eigenmodes",
            "fullname": "tests/benchmarks/test_benchmarks.py::test_cavity_eigenmodes",
            "params": null,
            "param": null,
            "extra_info": {},
            "options": {
                "disable_gc": false,
                "timer": "perf_counter",
                "min_rounds": 5,
                "max_time": 1.0,
                "min_time": 5e-06,
                "warmup": false
            },
            "stats": {
                "min": 0.2654851069999893,
                "max": 1.127862666999988,
                "mean": 0.43898988400000005,
                "stddev": 0.38509234510460383,
                "rounds": 5,
                "median": 0.26725885100000824,
                "iqr": 0.21593960375000165,
                "q1": 0.2665772180000019,
                "q3": 0.48251682175000354,
                "iqr_outliers": 1,
                "stddev_outliers": 1,
                "outliers": "1;1",
                "ld15iqr": 0.2654851069999893,
                "hd15iqr": 1.127862666999988,
                "ops": 2.2779568196154605,
                "total": 2.1949494200000004,
                "iterations": 1
            }
        },
        {
            "group": null,
            "name": "test_coupled_cavity_commands",
            "fullname": "tests/benchmarks/test_benchmarks.py::test_coupled_cavity_commands",
            "params": null,
            "param": null,
            "extra_info": {},
            "options": {
                "disable_gc": false,
                "timer": "perf_counter",
                "min_rounds": 5,
                "max_time": 1.0,
                "min_time": 5e-06,
                "warmup": false
            },
            "stats": {
                "min": 4.329869166999998,
                "max": 5.761505021000005,
                "mean": 4.911296651400005,
                "stddev": 0.6858891801656658,
                "rounds": 5,
                "median": 4.544549794000005,
                "iqr": 1.233555567250015,
                "q1": 4.364853717999999,
                "q3": 5.598409285250014,
                "iqr_outliers": 0,
                "stddev_outliers": 1,
                "outliers": "1;0",
                "ld15iqr": 4.329869166999998,
                "hd15iqr": 5.761505021000005,
                "ops": 0.203612217094429,
                "total": 24.556483257000025,
                "iterations": 1
            }
        },
        {
            "group": null,
            "name": "test_frequency_dependant_squeezing",
            "fullname": "tests/benchmarks/test_benchmarks.py::test_frequency_dependant_squeezing",
            "params": null,
            "param": null,
            "extra_info": {},
            "options": {
                "disable_gc": false,
                "timer": "perf_counter",
                "min_rounds": 5,
                "max_time": 1.0,
                "min_time": 5e-06,
                "warmup": false
            },
            "stats": {
                "min": 1.5237453790000188,
                "max": 2.9174073789999966,
                "mean": 1.8343066114000066,
                "stddev": 0.6061651808213846,
                "rounds": 5,
                "median": 1.5631544880000092,
                "iqr": 0.3814701967500014,
                "q1": 1.5521186755000045,
                "q3": 1.9335888722500059,
                "iqr_outliers": 1,
                "stddev_outliers": 1,
                "outliers": "1;1",
                "ld15iqr": 1.5237453790000188,
                "hd15iqr": 2.9174073789999966,
                "ops": 0.5451651287658856,
                "total": 9.171533057000033,
                "iterations": 1
            }
        },
        {
            "group": null,
            "name": "test_lock_actions",
            "fullname": "tests/benchmarks/test_benchmarks.py::test_lock_actions",
            "params": null,
            "param": null,
            "extra_info": {},
            "options": {
                "disable_gc": false,
                "timer": "perf_counter",
                "min_rounds": 5,
                "max_time": 1.0,
                "min_time": 5e-06,
                "warmup": false
            },
            "stats": {
                "min": 5.1559087250000175,
                "max": 5.513780668999999,
                "mean": 5.323722857600001,
                "stddev": 0.15341336859507837,
                "rounds": 5,
                "median": 5.247382146999996,
                "iqr": 0.24880704675000231,
                "q1": 5.222386180999997,
                "q3": 5.47119322775,
                "iqr_outliers": 0,
                "stddev_outliers": 2,
                "outliers": "2;0",
                "ld15iqr": 5.1559087250000175,
                "hd15iqr": 5.513780668999999,
                "ops": 0.1878384782131225,
                "total": 26.618614288000003,
                "iterations": 1
            }
        }
    ],
    "datetime": "2024-02-06T15:01:19.158885",
    "version": "4.0.0"
}