{
    "machine_info": {
        "node": "runner-ns46nmmj-project-39604133-concurrent-0",
        "processor": "",
        "machine": "x86_64",
        "python_compiler": "GCC 12.2.0",
        "python_implementation": "CPython",
        "python_implementation_version": "3.12.3",
        "python_version": "3.12.3",
        "python_build": [
            "main",
            "May 14 2024 07:23:41"
        ],
        "release": "5.15.154+",
        "system": "Linux",
        "cpu": {
            "python_version": "3.12.3.final.0 (64 bit)",
            "cpuinfo_version": [
                9,
                0,
                0
            ],
            "cpuinfo_version_string": "9.0.0",
            "arch": "X86_64",
            "bits": 64,
            "count": 2,
            "arch_string_raw": "x86_64",
            "vendor_id_raw": "AuthenticAMD",
            "brand_raw": "AMD EPYC 7B13",
            "hz_advertised_friendly": "2.4500 GHz",
            "hz_actual_friendly": "2.4500 GHz",
            "hz_advertised": [
                2449998000,
                0
            ],
            "hz_actual": [
                2449998000,
                0
            ],
            "model": 1,
            "family": 25,
            "flags": [
                "3dnowext",
                "3dnowprefetch",
                "abm",
                "adx",
                "aes",
                "apic",
                "arat",
                "avx",
                "avx2",
                "bmi1",
                "bmi2",
                "clflush",
                "clflushopt",
                "clwb",
                "clzero",
                "cmov",
                "cmp_legacy",
                "constant_tsc",
                "cpuid",
                "cr8_legacy",
                "cx16",
                "cx8",
                "de",
                "erms",
                "extd_apicid",
                "f16c",
                "fma",
                "fpu",
                "fsgsbase",
                "fsrm",
                "fxsr",
                "fxsr_opt",
                "ht",
                "hypervisor",
                "ibpb",
                "ibrs",
                "invpcid",
                "invpcid_single",
                "lahf_lm",
                "lm",
                "mca",
                "mce",
                "misalignsse",
                "mmx",
                "mmxext",
                "movbe",
                "msr",
                "mtrr",
                "nonstop_tsc",
                "nopl",
                "npt",
                "nrip_save",
                "nx",
                "osvw",
                "osxsave",
                "pae",
                "pat",
                "pcid",
                "pclmulqdq",
                "pdpe1gb",
                "pge",
                "pni",
                "popcnt",
                "pse",
                "pse36",
                "rdpid",
                "rdrand",
                "rdrnd",
                "rdseed",
                "rdtscp",
                "rep_good",
                "sep",
                "sha",
                "sha_ni",
                "smap",
                "smep",
                "ssbd",
                "sse",
                "sse2",
                "sse4_1",
                "sse4_2",
                "sse4a",
                "ssse3",
                "stibp",
                "syscall",
                "topoext",
                "tsc",
                "tsc_adjust",
                "tsc_known_freq",
                "umip",
                "vaes",
                "vme",
                "vmmcall",
                "vpclmulqdq",
                "x2apic",
                "xgetbv1",
                "xsave",
                "xsavec",
                "xsaveerptr",
                "xsaveopt"
            ],
            "l3_cache_size": 524288,
            "l2_cache_size": 524288,
            "l1_data_cache_size": 32768,
            "l1_instruction_cache_size": 32768,
            "l2_cache_line_size": 512,
            "l2_cache_associativity": 6
        }
    },
    "commit_info": {
        "id": "f0d72341cc052f49d430ba67394aa624f3c3711d",
        "time": "2024-05-28T11:53:51+02:00",
        "author_time": "2024-05-28T11:53:51+02:00",
        "dirty": false,
        "project": "finesse3",
        "branch": "(detached head)"
    },
    "benchmarks": [
        {
            "group": null,
            "name": "test_01_simple_cav",
            "fullname": "tests/benchmarks/test_benchmarks.py::test_01_simple_cav",
            "params": null,
            "param": null,
            "extra_info": {},
            "options": {
                "disable_gc": false,
                "timer": "perf_counter",
                "min_rounds": 5,
                "max_time": 1.0,
                "min_time": 5e-06,
                "warmup": false
            },
            "stats": {
                "min": 0.37534494299998755,
                "max": 0.5838186910000047,
                "mean": 0.45971439799999986,
                "stddev": 0.11049362931558575,
                "rounds": 5,
                "median": 0.3843521930000122,
                "iqr": 0.20212282975001017,
                "q1": 0.376980100499992,
                "q3": 0.5791029302500021,
                "iqr_outliers": 0,
                "stddev_outliers": 2,
                "outliers": "2;0",
                "ld15iqr": 0.37534494299998755,
                "hd15iqr": 0.5838186910000047,
                "ops": 2.1752636079064036,
                "total": 2.2985719899999992,
                "iterations": 1
            }
        },
        {
            "group": null,
            "name": "test_02_pdh_lock",
            "fullname": "tests/benchmarks/test_benchmarks.py::test_02_pdh_lock",
            "params": null,
            "param": null,
            "extra_info": {},
            "options": {
                "disable_gc": false,
                "timer": "perf_counter",
                "min_rounds": 5,
                "max_time": 1.0,
                "min_time": 5e-06,
                "warmup": false
            },
            "stats": {
                "min": 1.347684586999975,
                "max": 1.693894878000009,
                "mean": 1.4816853572000013,
                "stddev": 0.17476714196331863,
                "rounds": 5,
                "median": 1.3683387470000241,
                "iqr": 0.31334627275000315,
                "q1": 1.347965011999996,
                "q3": 1.6613112847499991,
                "iqr_outliers": 0,
                "stddev_outliers": 1,
                "outliers": "1;0",
                "ld15iqr": 1.347684586999975,
                "hd15iqr": 1.693894878000009,
                "ops": 0.6749071219072712,
                "total": 7.408426786000007,
                "iterations": 1
            }
        },
        {
            "group": null,
            "name": "test_03_near_unstable",
            "fullname": "tests/benchmarks/test_benchmarks.py::test_03_near_unstable",
            "params": null,
            "param": null,
            "extra_info": {},
            "options": {
                "disable_gc": false,
                "timer": "perf_counter",
                "min_rounds": 5,
                "max_time": 1.0,
                "min_time": 5e-06,
                "warmup": false
            },
            "stats": {
                "min": 1.6500000015184924e-06,
                "max": 8.834999999862703e-05,
                "mean": 2.500163483787419e-06,
                "stddev": 1.0955827440086465e-06,
                "rounds": 49901,
                "median": 3.019999979869681e-06,
                "iqr": 1.4299999975264654e-06,
                "q1": 1.720000000204891e-06,
                "q3": 3.1499999977313564e-06,
                "iqr_outliers": 357,
                "stddev_outliers": 517,
                "outliers": "517;357",
                "ld15iqr": 1.6500000015184924e-06,
                "hd15iqr": 5.29999999798747e-06,
                "ops": 399973.8443044258,
                "total": 0.124760658004476,
                "iterations": 1
            }
        },
        {
            "group": null,
            "name": "test_04_geometrical_params",
            "fullname": "tests/benchmarks/test_benchmarks.py::test_04_geometrical_params",
            "params": null,
            "param": null,
            "extra_info": {},
            "options": {
                "disable_gc": false,
                "timer": "perf_counter",
                "min_rounds": 5,
                "max_time": 1.0,
                "min_time": 5e-06,
                "warmup": false
            },
            "stats": {
                "min": 0.5294069379999939,
                "max": 0.9307695820000106,
                "mean": 0.6142425852000031,
                "stddev": 0.17707849670225465,
                "rounds": 5,
                "median": 0.5325277389999883,
                "iqr": 0.11181136424999494,
                "q1": 0.5310571330000116,
                "q3": 0.6428684972500065,
                "iqr_outliers": 1,
                "stddev_outliers": 1,
                "outliers": "1;1",
                "ld15iqr": 0.5294069379999939,
                "hd15iqr": 0.9307695820000106,
                "ops": 1.6280212803454368,
                "total": 3.0712129260000154,
                "iterations": 1
            }
        },
        {
            "group": null,
            "name": "test_05_modulation",
            "fullname": "tests/benchmarks/test_benchmarks.py::test_05_modulation",
            "params": null,
            "param": null,
            "extra_info": {},
            "options": {
                "disable_gc": false,
                "timer": "perf_counter",
                "min_rounds": 5,
                "max_time": 1.0,
                "min_time": 5e-06,
                "warmup": false
            },
            "stats": {
                "min": 0.17799514600000066,
                "max": 0.6351405919999991,
                "mean": 0.23577594437499627,
                "stddev": 0.16137052303184582,
                "rounds": 8,
                "median": 0.1784496909999973,
                "iqr": 0.0018672854999977062,
                "q1": 0.1781094659999951,
                "q3": 0.17997675149999282,
                "iqr_outliers": 1,
                "stddev_outliers": 1,
                "outliers": "1;1",
                "ld15iqr": 0.17799514600000066,
                "hd15iqr": 0.6351405919999991,
                "ops": 4.241314789983505,
                "total": 1.8862075549999702,
                "iterations": 1
            }
        },
        {
            "group": null,
            "name": "test_06_radiation_pressure",
            "fullname": "tests/benchmarks/test_benchmarks.py::test_06_radiation_pressure",
            "params": null,
            "param": null,
            "extra_info": {},
            "options": {
                "disable_gc": false,
                "timer": "perf_counter",
                "min_rounds": 5,
                "max_time": 1.0,
                "min_time": 5e-06,
                "warmup": false
            },
            "stats": {
                "min": 0.3101064700000222,
                "max": 0.32389008100000183,
                "mean": 0.3185991270000102,
                "stddev": 0.005143690264714043,
                "rounds": 5,
                "median": 0.31927760100001024,
                "iqr": 0.004970861999986198,
                "q1": 0.31665969400001615,
                "q3": 0.32163055600000234,
                "iqr_outliers": 0,
                "stddev_outliers": 2,
                "outliers": "2;0",
                "ld15iqr": 0.3101064700000222,
                "hd15iqr": 0.32389008100000183,
                "ops": 3.138740552794949,
                "total": 1.592995635000051,
                "iterations": 1
            }
        },
        {
            "group": null,
            "name": "test_07_homodyne",
            "fullname": "tests/benchmarks/test_benchmarks.py::test_07_homodyne",
            "params": null,
            "param": null,
            "extra_info": {},
            "options": {
                "disable_gc": false,
                "timer": "perf_counter",
                "min_rounds": 5,
                "max_time": 1.0,
                "min_time": 5e-06,
                "warmup": false
            },
            "stats": {
                "min": 0.11445571400000176,
                "max": 0.12108706399999392,
                "mean": 0.11739314999999521,
                "stddev": 0.0019678639650592927,
                "rounds": 10,
                "median": 0.11754465649998735,
                "iqr": 0.0028903480000224135,
                "q1": 0.11594610599999555,
                "q3": 0.11883645400001797,
                "iqr_outliers": 0,
                "stddev_outliers": 2,
                "outliers": "2;0",
                "ld15iqr": 0.11445571400000176,
                "hd15iqr": 0.12108706399999392,
                "ops": 8.518384590583358,
                "total": 1.1739314999999522,
                "iterations": 1
            }
        },
        {
            "group": null,
            "name": "test_08_optical_spring",
            "fullname": "tests/benchmarks/test_benchmarks.py::test_08_optical_spring",
            "params": null,
            "param": null,
            "extra_info": {},
            "options": {
                "disable_gc": false,
                "timer": "perf_counter",
                "min_rounds": 5,
                "max_time": 1.0,
                "min_time": 5e-06,
                "warmup": false
            },
            "stats": {
                "min": 0.30077449399999523,
                "max": 0.3078710929999886,
                "mean": 0.30300376859999006,
                "stddev": 0.003041442258324039,
                "rounds": 5,
                "median": 0.301363723999998,
                "iqr": 0.004181922750007061,
                "q1": 0.3008683114999826,
                "q3": 0.30505023424998967,
                "iqr_outliers": 0,
                "stddev_outliers": 1,
                "outliers": "1;0",
                "ld15iqr": 0.30077449399999523,
                "hd15iqr": 0.3078710929999886,
                "ops": 3.300288985250703,
                "total": 1.5150188429999503,
                "iterations": 1
            }
        },
        {
            "group": null,
            "name": "test_09_aligo_sensitivity",
            "fullname": "tests/benchmarks/test_benchmarks.py::test_09_aligo_sensitivity",
            "params": null,
            "param": null,
            "extra_info": {},
            "options": {
                "disable_gc": false,
                "timer": "perf_counter",
                "min_rounds": 5,
                "max_time": 1.0,
                "min_time": 5e-06,
                "warmup": false
            },
            "stats": {
                "min": 0.32529130700001474,
                "max": 0.3359429310000053,
                "mean": 0.33088518440000597,
                "stddev": 0.004506214304858968,
                "rounds": 5,
                "median": 0.3306936440000072,
                "iqr": 0.007864486000002557,
                "q1": 0.3271588017500022,
                "q3": 0.3350232877500048,
                "iqr_outliers": 0,
                "stddev_outliers": 2,
                "outliers": "2;0",
                "ld15iqr": 0.32529130700001474,
                "hd15iqr": 0.3359429310000053,
                "ops": 3.022196360387969,
                "total": 1.65442592200003,
                "iterations": 1
            }
        },
        {
            "group": null,
            "name": "test_10_shifted_beam",
            "fullname": "tests/benchmarks/test_benchmarks.py::test_10_shifted_beam",
            "params": null,
            "param": null,
            "extra_info": {},
            "options": {
                "disable_gc": false,
                "timer": "perf_counter",
                "min_rounds": 5,
                "max_time": 1.0,
                "min_time": 5e-06,
                "warmup": false
            },
            "stats": {
                "min": 0.7174003730000038,
                "max": 1.5668480829999964,
                "mean": 0.8934009947999982,
                "stddev": 0.3765389226143374,
                "rounds": 5,
                "median": 0.7309170500000164,
                "iqr": 0.2238867575000043,
                "q1": 0.7180274787499883,
                "q3": 0.9419142362499926,
                "iqr_outliers": 1,
                "stddev_outliers": 1,
                "outliers": "1;1",
                "ld15iqr": 0.7174003730000038,
                "hd15iqr": 1.5668480829999964,
                "ops": 1.1193182074124124,
                "total": 4.467004973999991,
                "iterations": 1
            }
        },
        {
            "group": null,
            "name": "test_angular_radiation_pressure",
            "fullname": "tests/benchmarks/test_benchmarks.py::test_angular_radiation_pressure",
            "params": null,
            "param": null,
            "extra_info": {},
            "options": {
                "disable_gc": false,
                "timer": "perf_counter",
                "min_rounds": 5,
                "max_time": 1.0,
                "min_time": 5e-06,
                "warmup": false
            },
            "stats": {
                "min": 0.34193490900000256,
                "max": 0.34695397499999103,
                "mean": 0.34559131759999673,
                "stddev": 0.0020957779417523463,
                "rounds": 5,
                "median": 0.34656072499998913,
                "iqr": 0.0020242297499990514,
                "q1": 0.34478911275,
                "q3": 0.34681334249999907,
                "iqr_outliers": 0,
                "stddev_outliers": 1,
                "outliers": "1;0",
                "ld15iqr": 0.34193490900000256,
                "hd15iqr": 0.34695397499999103,
                "ops": 2.8935912132996524,
                "total": 1.7279565879999836,
                "iterations": 1
            }
        },
        {
            "group": null,
            "name": "test_cavity_eigenmodes",
            "fullname": "tests/benchmarks/test_benchmarks.py::test_cavity_eigenmodes",
            "params": null,
            "param": null,
            "extra_info": {},
            "options": {
                "disable_gc": false,
                "timer": "perf_counter",
                "min_rounds": 5,
                "max_time": 1.0,
                "min_time": 5e-06,
                "warmup": false
            },
            "stats": {
                "min": 0.28526719199999206,
                "max": 1.2570754570000133,
                "mean": 0.4816344664000042,
                "stddev": 0.4334905644406502,
                "rounds": 5,
                "median": 0.2881517170000052,
                "iqr": 0.24657547825001558,
                "q1": 0.2861343292499967,
                "q3": 0.5327098075000123,
                "iqr_outliers": 1,
                "stddev_outliers": 1,
                "outliers": "1;1",
                "ld15iqr": 0.28526719199999206,
                "hd15iqr": 1.2570754570000133,
                "ops": 2.0762633693442654,
                "total": 2.408172332000021,
                "iterations": 1
            }
        },
        {
            "group": null,
            "name": "test_coupled_cavity_commands",
            "fullname": "tests/benchmarks/test_benchmarks.py::test_coupled_cavity_commands",
            "params": null,
            "param": null,
            "extra_info": {},
            "options": {
                "disable_gc": false,
                "timer": "perf_counter",
                "min_rounds": 5,
                "max_time": 1.0,
                "min_time": 5e-06,
                "warmup": false
            },
            "stats": {
                "min": 4.483563937000014,
                "max": 5.734094744999993,
                "mean": 5.003468600600013,
                "stddev": 0.6479949050797557,
                "rounds": 5,
                "median": 4.57085406500002,
                "iqr": 1.1767294190000044,
                "q1": 4.524653971750013,
                "q3": 5.701383390750017,
                "iqr_outliers": 0,
                "stddev_outliers": 2,
                "outliers": "2;0",
                "ld15iqr": 4.483563937000014,
                "hd15iqr": 5.734094744999993,
                "ops": 0.19986135215879652,
                "total": 25.017343003000065,
                "iterations": 1
            }
        },
        {
            "group": null,
            "name": "test_frequency_dependant_squeezing",
            "fullname": "tests/benchmarks/test_benchmarks.py::test_frequency_dependant_squeezing",
            "params": null,
            "param": null,
            "extra_info": {},
            "options": {
                "disable_gc": false,
                "timer": "perf_counter",
                "min_rounds": 5,
                "max_time": 1.0,
                "min_time": 5e-06,
                "warmup": false
            },
            "stats": {
                "min": 1.573391571000002,
                "max": 2.996668891000013,
                "mean": 1.8639942854000082,
                "stddev": 0.6332161602514655,
                "rounds": 5,
                "median": 1.5865849799999978,
                "iqr": 0.3647743427500245,
                "q1": 1.5751176307500003,
                "q3": 1.9398919735000248,
                "iqr_outliers": 1,
                "stddev_outliers": 1,
                "outliers": "1;1",
                "ld15iqr": 1.573391571000002,
                "hd15iqr": 2.996668891000013,
                "ops": 0.5364823314280723,
                "total": 9.319971427000041,
                "iterations": 1
            }
        },
        {
            "group": null,
            "name": "test_lock_actions",
            "fullname": "tests/benchmarks/test_benchmarks.py::test_lock_actions",
            "params": null,
            "param": null,
            "extra_info": {},
            "options": {
                "disable_gc": false,
                "timer": "perf_counter",
                "min_rounds": 5,
                "max_time": 1.0,
                "min_time": 5e-06,
                "warmup": false
            },
            "stats": {
                "min": 4.924312149999992,
                "max": 6.547654216000012,
                "mean": 5.290154454399999,
                "stddev": 0.7061822091952099,
                "rounds": 5,
                "median": 4.964065301000005,
                "iqr": 0.5284283752500016,
                "q1": 4.925309334999994,
                "q3": 5.453737710249996,
                "iqr_outliers": 1,
                "stddev_outliers": 1,
                "outliers": "1;1",
                "ld15iqr": 4.924312149999992,
                "hd15iqr": 6.547654216000012,
                "ops": 0.18903039762256213,
                "total": 26.450772271999995,
                "iterations": 1
            }
        }
    ],
    "datetime": "2024-05-29T13:36:31.495770",
    "version": "4.0.0"
}