{
    "machine_info": {
        "node": "runner-zxwgkjap-project-39604133-concurrent-0",
        "processor": "",
        "machine": "x86_64",
        "python_compiler": "GCC 12.2.0",
        "python_implementation": "CPython",
        "python_implementation_version": "3.12.6",
        "python_version": "3.12.6",
        "python_build": [
            "main",
            "Sep 12 2024 21:12:04"
        ],
        "release": "5.15.154+",
        "system": "Linux",
        "cpu": {
            "python_version": "3.12.6.final.0 (64 bit)",
            "cpuinfo_version": [
                9,
                0,
                0
            ],
            "cpuinfo_version_string": "9.0.0",
            "arch": "X86_64",
            "bits": 64,
            "count": 2,
            "arch_string_raw": "x86_64",
            "vendor_id_raw": "AuthenticAMD",
            "brand_raw": "AMD EPYC 7B13",
            "hz_advertised_friendly": "2.4500 GHz",
            "hz_actual_friendly": "2.4500 GHz",
            "hz_advertised": [
                2449998000,
                0
            ],
            "hz_actual": [
                2449998000,
                0
            ],
            "model": 1,
            "family": 25,
            "flags": [
                "3dnowext",
                "3dnowprefetch",
                "abm",
                "adx",
                "aes",
                "apic",
                "arat",
                "avx",
                "avx2",
                "bmi1",
                "bmi2",
                "clflush",
                "clflushopt",
                "clwb",
                "clzero",
                "cmov",
                "cmp_legacy",
                "constant_tsc",
                "cpuid",
                "cr8_legacy",
                "cx16",
                "cx8",
                "de",
                "erms",
                "extd_apicid",
                "f16c",
                "fma",
                "fpu",
                "fsgsbase",
                "fsrm",
                "fxsr",
                "fxsr_opt",
                "ht",
                "hypervisor",
                "ibpb",
                "ibrs",
                "invpcid",
                "invpcid_single",
                "lahf_lm",
                "lm",
                "mca",
                "mce",
                "misalignsse",
                "mmx",
                "mmxext",
                "movbe",
                "msr",
                "mtrr",
                "nonstop_tsc",
                "nopl",
                "npt",
                "nrip_save",
                "nx",
                "osvw",
                "osxsave",
                "pae",
                "pat",
                "pcid",
                "pclmulqdq",
                "pdpe1gb",
                "pge",
                "pni",
                "popcnt",
                "pse",
                "pse36",
                "rdpid",
                "rdrand",
                "rdrnd",
                "rdseed",
                "rdtscp",
                "rep_good",
                "sep",
                "sha",
                "sha_ni",
                "smap",
                "smep",
                "ssbd",
                "sse",
                "sse2",
                "sse4_1",
                "sse4_2",
                "sse4a",
                "ssse3",
                "stibp",
                "syscall",
                "topoext",
                "tsc",
                "tsc_adjust",
                "tsc_known_freq",
                "umip",
                "vaes",
                "vme",
                "vmmcall",
                "vpclmulqdq",
                "x2apic",
                "xgetbv1",
                "xsave",
                "xsavec",
                "xsaveerptr",
                "xsaveopt"
            ],
            "l3_cache_size": 524288,
            "l2_cache_size": 524288,
            "l1_data_cache_size": 32768,
            "l1_instruction_cache_size": 32768,
            "l2_cache_line_size": 512,
            "l2_cache_associativity": 6
        }
    },
    "commit_info": {
        "id": "a856e13c91f597fc1f80b67cb5b2e5a3900dce80",
        "time": "2024-09-23T09:10:42+02:00",
        "author_time": "2024-09-23T09:10:42+02:00",
        "dirty": false,
        "project": "finesse3",
        "branch": "(detached head)"
    },
    "benchmarks": [
        {
            "group": null,
            "name": "test_01_simple_cav",
            "fullname": "tests/benchmarks/test_benchmarks.py::test_01_simple_cav",
            "params": null,
            "param": null,
            "extra_info": {},
            "options": {
                "disable_gc": false,
                "timer": "perf_counter",
                "min_rounds": 5,
                "max_time": 1.0,
                "min_time": 5e-06,
                "warmup": false
            },
            "stats": {
                "min": 0.26298210799998856,
                "max": 0.46946586800001455,
                "mean": 0.30575245580000115,
                "stddev": 0.09152941045676197,
                "rounds": 5,
                "median": 0.26551638799998045,
                "iqr": 0.05357587425000787,
                "q1": 0.26381727800000476,
                "q3": 0.31739315225001263,
                "iqr_outliers": 1,
                "stddev_outliers": 1,
                "outliers": "1;1",
                "ld15iqr": 0.26298210799998856,
                "hd15iqr": 0.46946586800001455,
                "ops": 3.2706196827871765,
                "total": 1.5287622790000057,
                "iterations": 1
            }
        },
        {
            "group": null,
            "name": "test_02_pdh_lock",
            "fullname": "tests/benchmarks/test_benchmarks.py::test_02_pdh_lock",
            "params": null,
            "param": null,
            "extra_info": {},
            "options": {
                "disable_gc": false,
                "timer": "perf_counter",
                "min_rounds": 5,
                "max_time": 1.0,
                "min_time": 5e-06,
                "warmup": false
            },
            "stats": {
                "min": 1.1871464470000035,
                "max": 1.4823371290000011,
                "mean": 1.2972226255999941,
                "stddev": 0.14335668478405295,
                "rounds": 5,
                "median": 1.1990454949999787,
                "iqr": 0.24454076924999413,
                "q1": 1.193009083749999,
                "q3": 1.437549852999993,
                "iqr_outliers": 0,
                "stddev_outliers": 1,
                "outliers": "1;0",
                "ld15iqr": 1.1871464470000035,
                "hd15iqr": 1.4823371290000011,
                "ops": 0.7708777046171839,
                "total": 6.486113127999971,
                "iterations": 1
            }
        },
        {
            "group": null,
            "name": "test_03_near_unstable",
            "fullname": "tests/benchmarks/test_benchmarks.py::test_03_near_unstable",
            "params": null,
            "param": null,
            "extra_info": {},
            "options": {
                "disable_gc": false,
                "timer": "perf_counter",
                "min_rounds": 5,
                "max_time": 1.0,
                "min_time": 5e-06,
                "warmup": false
            },
            "stats": {
                "min": 1.940000004196918e-06,
                "max": 2.2799999982225927e-05,
                "mean": 2.048811731461271e-06,
                "stddev": 4.702773916719259e-07,
                "rounds": 60828,
                "median": 2.0100000028833165e-06,
                "iqr": 3.999997488790541e-08,
                "q1": 1.9900000154393638e-06,
                "q3": 2.029999990327269e-06,
                "iqr_outliers": 1832,
                "stddev_outliers": 650,
                "outliers": "650;1832",
                "ld15iqr": 1.940000004196918e-06,
                "hd15iqr": 2.0899999810808367e-06,
                "ops": 488087.79481498356,
                "total": 0.1246251200013262,
                "iterations": 1
            }
        },
        {
            "group": null,
            "name": "test_04_geometrical_params",
            "fullname": "tests/benchmarks/test_benchmarks.py::test_04_geometrical_params",
            "params": null,
            "param": null,
            "extra_info": {},
            "options": {
                "disable_gc": false,
                "timer": "perf_counter",
                "min_rounds": 5,
                "max_time": 1.0,
                "min_time": 5e-06,
                "warmup": false
            },
            "stats": {
                "min": 0.45826663900001563,
                "max": 0.7867130759999839,
                "mean": 0.5307022500000016,
                "stddev": 0.14328535537446452,
                "rounds": 5,
                "median": 0.4685034880000103,
                "iqr": 0.09269186449999722,
                "q1": 0.46178704975000073,
                "q3": 0.554478914249998,
                "iqr_outliers": 1,
                "stddev_outliers": 1,
                "outliers": "1;1",
                "ld15iqr": 0.45826663900001563,
                "hd15iqr": 0.7867130759999839,
                "ops": 1.8842957609469282,
                "total": 2.653511250000008,
                "iterations": 1
            }
        },
        {
            "group": null,
            "name": "test_05_modulation",
            "fullname": "tests/benchmarks/test_benchmarks.py::test_05_modulation",
            "params": null,
            "param": null,
            "extra_info": {},
            "options": {
                "disable_gc": false,
                "timer": "perf_counter",
                "min_rounds": 5,
                "max_time": 1.0,
                "min_time": 5e-06,
                "warmup": false
            },
            "stats": {
                "min": 0.1196450870000092,
                "max": 0.1336832640000125,
                "mean": 0.12470533175000398,
                "stddev": 0.005369929453277455,
                "rounds": 8,
                "median": 0.12267102100000216,
                "iqr": 0.008252478500025973,
                "q1": 0.12061682599998846,
                "q3": 0.12886930450001444,
                "iqr_outliers": 0,
                "stddev_outliers": 2,
                "outliers": "2;0",
                "ld15iqr": 0.1196450870000092,
                "hd15iqr": 0.1336832640000125,
                "ops": 8.018903329688372,
                "total": 0.9976426540000318,
                "iterations": 1
            }
        },
        {
            "group": null,
            "name": "test_06_radiation_pressure",
            "fullname": "tests/benchmarks/test_benchmarks.py::test_06_radiation_pressure",
            "params": null,
            "param": null,
            "extra_info": {},
            "options": {
                "disable_gc": false,
                "timer": "perf_counter",
                "min_rounds": 5,
                "max_time": 1.0,
                "min_time": 5e-06,
                "warmup": false
            },
            "stats": {
                "min": 0.23972366200001716,
                "max": 0.753260632000007,
                "mean": 0.3451276384000096,
                "stddev": 0.22816598073990493,
                "rounds": 5,
                "median": 0.2434185730000138,
                "iqr": 0.131205651749994,
                "q1": 0.24198345775000973,
                "q3": 0.3731891095000037,
                "iqr_outliers": 1,
                "stddev_outliers": 1,
                "outliers": "1;1",
                "ld15iqr": 0.23972366200001716,
                "hd15iqr": 0.753260632000007,
                "ops": 2.8974787549207544,
                "total": 1.7256381920000479,
                "iterations": 1
            }
        },
        {
            "group": null,
            "name": "test_07_homodyne",
            "fullname": "tests/benchmarks/test_benchmarks.py::test_07_homodyne",
            "params": null,
            "param": null,
            "extra_info": {},
            "options": {
                "disable_gc": false,
                "timer": "perf_counter",
                "min_rounds": 5,
                "max_time": 1.0,
                "min_time": 5e-06,
                "warmup": false
            },
            "stats": {
                "min": 0.08211851400000114,
                "max": 0.0862320729999908,
                "mean": 0.08389674850000262,
                "stddev": 0.001363108414705786,
                "rounds": 12,
                "median": 0.08385363349999864,
                "iqr": 0.002248984000004839,
                "q1": 0.08266061400000524,
                "q3": 0.08490959800001008,
                "iqr_outliers": 0,
                "stddev_outliers": 4,
                "outliers": "4;0",
                "ld15iqr": 0.08211851400000114,
                "hd15iqr": 0.0862320729999908,
                "ops": 11.919413062831259,
                "total": 1.0067609820000314,
                "iterations": 1
            }
        },
        {
            "group": null,
            "name": "test_08_optical_spring",
            "fullname": "tests/benchmarks/test_benchmarks.py::test_08_optical_spring",
            "params": null,
            "param": null,
            "extra_info": {},
            "options": {
                "disable_gc": false,
                "timer": "perf_counter",
                "min_rounds": 5,
                "max_time": 1.0,
                "min_time": 5e-06,
                "warmup": false
            },
            "stats": {
                "min": 0.22461631600000942,
                "max": 0.8587800720000018,
                "mean": 0.357480602000004,
                "stddev": 0.2803062765474811,
                "rounds": 5,
                "median": 0.23159270499999707,
                "iqr": 0.1674151692499919,
                "q1": 0.22887218275000976,
                "q3": 0.39628735200000165,
                "iqr_outliers": 1,
                "stddev_outliers": 1,
                "outliers": "1;1",
                "ld15iqr": 0.22461631600000942,
                "hd15iqr": 0.8587800720000018,
                "ops": 2.797354582053627,
                "total": 1.7874030100000198,
                "iterations": 1
            }
        },
        {
            "group": null,
            "name": "test_09_aligo_sensitivity",
            "fullname": "tests/benchmarks/test_benchmarks.py::test_09_aligo_sensitivity",
            "params": null,
            "param": null,
            "extra_info": {},
            "options": {
                "disable_gc": false,
                "timer": "perf_counter",
                "min_rounds": 5,
                "max_time": 1.0,
                "min_time": 5e-06,
                "warmup": false
            },
            "stats": {
                "min": 0.2541726199999914,
                "max": 0.26312951899998893,
                "mean": 0.256856165399995,
                "stddev": 0.003710757441570219,
                "rounds": 5,
                "median": 0.2555841889999897,
                "iqr": 0.0044176889999931745,
                "q1": 0.25422686000000283,
                "q3": 0.258644548999996,
                "iqr_outliers": 0,
                "stddev_outliers": 1,
                "outliers": "1;0",
                "ld15iqr": 0.2541726199999914,
                "hd15iqr": 0.26312951899998893,
                "ops": 3.8932294984733096,
                "total": 1.284280826999975,
                "iterations": 1
            }
        },
        {
            "group": null,
            "name": "test_10_shifted_beam",
            "fullname": "tests/benchmarks/test_benchmarks.py::test_10_shifted_beam",
            "params": null,
            "param": null,
            "extra_info": {},
            "options": {
                "disable_gc": false,
                "timer": "perf_counter",
                "min_rounds": 5,
                "max_time": 1.0,
                "min_time": 5e-06,
                "warmup": false
            },
            "stats": {
                "min": 0.7063567620000128,
                "max": 1.429015929000002,
                "mean": 0.8635100405999993,
                "stddev": 0.3162739398170815,
                "rounds": 5,
                "median": 0.7284072979999792,
                "iqr": 0.1871392702499719,
                "q1": 0.7185157815000167,
                "q3": 0.9056550517499886,
                "iqr_outliers": 1,
                "stddev_outliers": 1,
                "outliers": "1;1",
                "ld15iqr": 0.7063567620000128,
                "hd15iqr": 1.429015929000002,
                "ops": 1.1580641254676811,
                "total": 4.317550202999996,
                "iterations": 1
            }
        },
        {
            "group": null,
            "name": "test_angular_radiation_pressure",
            "fullname": "tests/benchmarks/test_benchmarks.py::test_angular_radiation_pressure",
            "params": null,
            "param": null,
            "extra_info": {},
            "options": {
                "disable_gc": false,
                "timer": "perf_counter",
                "min_rounds": 5,
                "max_time": 1.0,
                "min_time": 5e-06,
                "warmup": false
            },
            "stats": {
                "min": 0.29569964200001664,
                "max": 0.30154134,
                "mean": 0.29925244720000704,
                "stddev": 0.002415596579759246,
                "rounds": 5,
                "median": 0.29954792200001634,
                "iqr": 0.0038137354999747686,
                "q1": 0.29755075450001556,
                "q3": 0.3013644899999903,
                "iqr_outliers": 0,
                "stddev_outliers": 1,
                "outliers": "1;0",
                "ld15iqr": 0.29569964200001664,
                "hd15iqr": 0.30154134,
                "ops": 3.3416602248590617,
                "total": 1.4962622360000353,
                "iterations": 1
            }
        },
        {
            "group": null,
            "name": "test_cavity_eigenmodes",
            "fullname": "tests/benchmarks/test_benchmarks.py::test_cavity_eigenmodes",
            "params": null,
            "param": null,
            "extra_info": {},
            "options": {
                "disable_gc": false,
                "timer": "perf_counter",
                "min_rounds": 5,
                "max_time": 1.0,
                "min_time": 5e-06,
                "warmup": false
            },
            "stats": {
                "min": 0.25271836000001713,
                "max": 1.052812934000002,
                "mean": 0.41575711639999896,
                "stddev": 0.35614750918699,
                "rounds": 5,
                "median": 0.25693741999998565,
                "iqr": 0.20706382450000405,
                "q1": 0.2532783249999966,
                "q3": 0.46034214950000063,
                "iqr_outliers": 1,
                "stddev_outliers": 1,
                "outliers": "1;1",
                "ld15iqr": 0.25271836000001713,
                "hd15iqr": 1.052812934000002,
                "ops": 2.4052504708972977,
                "total": 2.0787855819999947,
                "iterations": 1
            }
        },
        {
            "group": null,
            "name": "test_coupled_cavity_commands",
            "fullname": "tests/benchmarks/test_benchmarks.py::test_coupled_cavity_commands",
            "params": null,
            "param": null,
            "extra_info": {},
            "options": {
                "disable_gc": false,
                "timer": "perf_counter",
                "min_rounds": 5,
                "max_time": 1.0,
                "min_time": 5e-06,
                "warmup": false
            },
            "stats": {
                "min": 5.674428972000015,
                "max": 6.74800489399999,
                "mean": 6.1083494016000035,
                "stddev": 0.5656313942735811,
                "rounds": 5,
                "median": 5.733618987,
                "iqr": 1.0388209152500139,
                "q1": 5.678029083749998,
                "q3": 6.7168499990000115,
                "iqr_outliers": 0,
                "stddev_outliers": 2,
                "outliers": "2;0",
                "ld15iqr": 5.674428972000015,
                "hd15iqr": 6.74800489399999,
                "ops": 0.16371034697819725,
                "total": 30.541747008000016,
                "iterations": 1
            }
        },
        {
            "group": null,
            "name": "test_frequency_dependant_squeezing",
            "fullname": "tests/benchmarks/test_benchmarks.py::test_frequency_dependant_squeezing",
            "params": null,
            "param": null,
            "extra_info": {},
            "options": {
                "disable_gc": false,
                "timer": "perf_counter",
                "min_rounds": 5,
                "max_time": 1.0,
                "min_time": 5e-06,
                "warmup": false
            },
            "stats": {
                "min": 1.5001799210000115,
                "max": 2.796743445000004,
                "mean": 1.7720297930000073,
                "stddev": 0.5729072316020223,
                "rounds": 5,
                "median": 1.5216701859999944,
                "iqr": 0.3282771602499892,
                "q1": 1.513560120500017,
                "q3": 1.8418372807500063,
                "iqr_outliers": 1,
                "stddev_outliers": 1,
                "outliers": "1;1",
                "ld15iqr": 1.5001799210000115,
                "hd15iqr": 2.796743445000004,
                "ops": 0.5643245976733958,
                "total": 8.860148965000036,
                "iterations": 1
            }
        },
        {
            "group": null,
            "name": "test_lock_actions",
            "fullname": "tests/benchmarks/test_benchmarks.py::test_lock_actions",
            "params": null,
            "param": null,
            "extra_info": {},
            "options": {
                "disable_gc": false,
                "timer": "perf_counter",
                "min_rounds": 5,
                "max_time": 1.0,
                "min_time": 5e-06,
                "warmup": false
            },
            "stats": {
                "min": 3.0422720020000042,
                "max": 4.415123250999983,
                "mean": 3.322808468799991,
                "stddev": 0.6106558771561681,
                "rounds": 5,
                "median": 3.0509541600000034,
                "iqr": 0.35307050249999605,
                "q1": 3.045274004499987,
                "q3": 3.398344506999983,
                "iqr_outliers": 1,
                "stddev_outliers": 1,
                "outliers": "1;1",
                "ld15iqr": 3.0422720020000042,
                "hd15iqr": 4.415123250999983,
                "ops": 0.30095023814633015,
                "total": 16.614042343999955,
                "iterations": 1
            }
        }
    ],
    "datetime": "2024-09-23T07:17:13.266099",
    "version": "4.0.0"
}