{
    "machine_info": {
        "node": "runner-jlguopmm-project-39604133-concurrent-0",
        "processor": "",
        "machine": "x86_64",
        "python_compiler": "GCC 12.2.0",
        "python_implementation": "CPython",
        "python_implementation_version": "3.12.4",
        "python_version": "3.12.4",
        "python_build": [
            "main",
            "Jul 10 2024 19:07:58"
        ],
        "release": "5.15.154+",
        "system": "Linux",
        "cpu": {
            "python_version": "3.12.4.final.0 (64 bit)",
            "cpuinfo_version": [
                9,
                0,
                0
            ],
            "cpuinfo_version_string": "9.0.0",
            "arch": "X86_64",
            "bits": 64,
            "count": 2,
            "arch_string_raw": "x86_64",
            "vendor_id_raw": "AuthenticAMD",
            "brand_raw": "AMD EPYC 7B13",
            "hz_advertised_friendly": "2.4500 GHz",
            "hz_actual_friendly": "2.4500 GHz",
            "hz_advertised": [
                2449998000,
                0
            ],
            "hz_actual": [
                2449998000,
                0
            ],
            "model": 1,
            "family": 25,
            "flags": [
                "3dnowext",
                "3dnowprefetch",
                "abm",
                "adx",
                "aes",
                "apic",
                "arat",
                "avx",
                "avx2",
                "bmi1",
                "bmi2",
                "clflush",
                "clflushopt",
                "clwb",
                "clzero",
                "cmov",
                "cmp_legacy",
                "constant_tsc",
                "cpuid",
                "cr8_legacy",
                "cx16",
                "cx8",
                "de",
                "erms",
                "extd_apicid",
                "f16c",
                "fma",
                "fpu",
                "fsgsbase",
                "fsrm",
                "fxsr",
                "fxsr_opt",
                "ht",
                "hypervisor",
                "ibpb",
                "ibrs",
                "invpcid",
                "invpcid_single",
                "lahf_lm",
                "lm",
                "mca",
                "mce",
                "misalignsse",
                "mmx",
                "mmxext",
                "movbe",
                "msr",
                "mtrr",
                "nonstop_tsc",
                "nopl",
                "npt",
                "nrip_save",
                "nx",
                "osvw",
                "osxsave",
                "pae",
                "pat",
                "pcid",
                "pclmulqdq",
                "pdpe1gb",
                "pge",
                "pni",
                "popcnt",
                "pse",
                "pse36",
                "rdpid",
                "rdrand",
                "rdrnd",
                "rdseed",
                "rdtscp",
                "rep_good",
                "sep",
                "sha",
                "sha_ni",
                "smap",
                "smep",
                "ssbd",
                "sse",
                "sse2",
                "sse4_1",
                "sse4_2",
                "sse4a",
                "ssse3",
                "stibp",
                "syscall",
                "topoext",
                "tsc",
                "tsc_adjust",
                "tsc_known_freq",
                "umip",
                "vaes",
                "vme",
                "vmmcall",
                "vpclmulqdq",
                "x2apic",
                "xgetbv1",
                "xsave",
                "xsavec",
                "xsaveerptr",
                "xsaveopt"
            ],
            "l3_cache_size": 524288,
            "l2_cache_size": 524288,
            "l1_data_cache_size": 32768,
            "l1_instruction_cache_size": 32768,
            "l2_cache_line_size": 512,
            "l2_cache_associativity": 6
        }
    },
    "commit_info": {
        "id": "ea2cfbf7f5b2578393d550c6735c72dadb0ed649",
        "time": "2024-07-11T11:23:04+02:00",
        "author_time": "2024-07-11T11:23:04+02:00",
        "dirty": false,
        "project": "finesse3",
        "branch": "(detached head)"
    },
    "benchmarks": [
        {
            "group": null,
            "name": "test_01_simple_cav",
            "fullname": "tests/benchmarks/test_benchmarks.py::test_01_simple_cav",
            "params": null,
            "param": null,
            "extra_info": {},
            "options": {
                "disable_gc": false,
                "timer": "perf_counter",
                "min_rounds": 5,
                "max_time": 1.0,
                "min_time": 5e-06,
                "warmup": false
            },
            "stats": {
                "min": 0.2784361789999963,
                "max": 0.5100871119999937,
                "mean": 0.33205937899999755,
                "stddev": 0.09986560144547832,
                "rounds": 5,
                "median": 0.2868526609999975,
                "iqr": 0.07061578549999936,
                "q1": 0.28260287224999914,
                "q3": 0.3532186577499985,
                "iqr_outliers": 1,
                "stddev_outliers": 1,
                "outliers": "1;1",
                "ld15iqr": 0.2784361789999963,
                "hd15iqr": 0.5100871119999937,
                "ops": 3.011509577026606,
                "total": 1.6602968949999877,
                "iterations": 1
            }
        },
        {
            "group": null,
            "name": "test_02_pdh_lock",
            "fullname": "tests/benchmarks/test_benchmarks.py::test_02_pdh_lock",
            "params": null,
            "param": null,
            "extra_info": {},
            "options": {
                "disable_gc": false,
                "timer": "perf_counter",
                "min_rounds": 5,
                "max_time": 1.0,
                "min_time": 5e-06,
                "warmup": false
            },
            "stats": {
                "min": 1.1822576069999968,
                "max": 1.5666086509999957,
                "mean": 1.2827212674000008,
                "stddev": 0.16013035181163512,
                "rounds": 5,
                "median": 1.2268752440000128,
                "iqr": 0.12260663224999746,
                "q1": 1.19650427925,
                "q3": 1.3191109114999975,
                "iqr_outliers": 1,
                "stddev_outliers": 1,
                "outliers": "1;1",
                "ld15iqr": 1.1822576069999968,
                "hd15iqr": 1.5666086509999957,
                "ops": 0.7795925938196535,
                "total": 6.4136063370000045,
                "iterations": 1
            }
        },
        {
            "group": null,
            "name": "test_03_near_unstable",
            "fullname": "tests/benchmarks/test_benchmarks.py::test_03_near_unstable",
            "params": null,
            "param": null,
            "extra_info": {},
            "options": {
                "disable_gc": false,
                "timer": "perf_counter",
                "min_rounds": 5,
                "max_time": 1.0,
                "min_time": 5e-06,
                "warmup": false
            },
            "stats": {
                "min": 1.839999981712026e-06,
                "max": 3.561000002605397e-05,
                "mean": 2.0067419469040117e-06,
                "stddev": 6.434240565783446e-07,
                "rounds": 50633,
                "median": 1.950999973132639e-06,
                "iqr": 5.000001124244591e-08,
                "q1": 1.929999996264087e-06,
                "q3": 1.9800000075065327e-06,
                "iqr_outliers": 1499,
                "stddev_outliers": 520,
                "outliers": "520;1499",
                "ld15iqr": 1.8599999975776882e-06,
                "hd15iqr": 2.059999985704053e-06,
                "ops": 498320.175916387,
                "total": 0.10160736499759082,
                "iterations": 1
            }
        },
        {
            "group": null,
            "name": "test_04_geometrical_params",
            "fullname": "tests/benchmarks/test_benchmarks.py::test_04_geometrical_params",
            "params": null,
            "param": null,
            "extra_info": {},
            "options": {
                "disable_gc": false,
                "timer": "perf_counter",
                "min_rounds": 5,
                "max_time": 1.0,
                "min_time": 5e-06,
                "warmup": false
            },
            "stats": {
                "min": 0.4803662680000116,
                "max": 0.9065837279999869,
                "mean": 0.6536120206000021,
                "stddev": 0.19874174950433246,
                "rounds": 5,
                "median": 0.5297145749999856,
                "iqr": 0.33810456799999145,
                "q1": 0.511089790000014,
                "q3": 0.8491943580000054,
                "iqr_outliers": 0,
                "stddev_outliers": 1,
                "outliers": "1;0",
                "ld15iqr": 0.4803662680000116,
                "hd15iqr": 0.9065837279999869,
                "ops": 1.5299596220430907,
                "total": 3.2680601030000105,
                "iterations": 1
            }
        },
        {
            "group": null,
            "name": "test_05_modulation",
            "fullname": "tests/benchmarks/test_benchmarks.py::test_05_modulation",
            "params": null,
            "param": null,
            "extra_info": {},
            "options": {
                "disable_gc": false,
                "timer": "perf_counter",
                "min_rounds": 5,
                "max_time": 1.0,
                "min_time": 5e-06,
                "warmup": false
            },
            "stats": {
                "min": 0.12270663999998987,
                "max": 0.12907168899999988,
                "mean": 0.12605713524999373,
                "stddev": 0.0020616259484172476,
                "rounds": 8,
                "median": 0.1261726784999837,
                "iqr": 0.002749022000017476,
                "q1": 0.12470883799998944,
                "q3": 0.12745786000000692,
                "iqr_outliers": 0,
                "stddev_outliers": 2,
                "outliers": "2;0",
                "ld15iqr": 0.12270663999998987,
                "hd15iqr": 0.12907168899999988,
                "ops": 7.932910723512969,
                "total": 1.0084570819999499,
                "iterations": 1
            }
        },
        {
            "group": null,
            "name": "test_06_radiation_pressure",
            "fullname": "tests/benchmarks/test_benchmarks.py::test_06_radiation_pressure",
            "params": null,
            "param": null,
            "extra_info": {},
            "options": {
                "disable_gc": false,
                "timer": "perf_counter",
                "min_rounds": 5,
                "max_time": 1.0,
                "min_time": 5e-06,
                "warmup": false
            },
            "stats": {
                "min": 0.24225101099997914,
                "max": 0.7504072430000122,
                "mean": 0.35163818579999884,
                "stddev": 0.2230179443085391,
                "rounds": 5,
                "median": 0.2524819070000035,
                "iqr": 0.13381743050003791,
                "q1": 0.24956760449997972,
                "q3": 0.38338503500001764,
                "iqr_outliers": 1,
                "stddev_outliers": 1,
                "outliers": "1;1",
                "ld15iqr": 0.24225101099997914,
                "hd15iqr": 0.7504072430000122,
                "ops": 2.8438322127187,
                "total": 1.7581909289999942,
                "iterations": 1
            }
        },
        {
            "group": null,
            "name": "test_07_homodyne",
            "fullname": "tests/benchmarks/test_benchmarks.py::test_07_homodyne",
            "params": null,
            "param": null,
            "extra_info": {},
            "options": {
                "disable_gc": false,
                "timer": "perf_counter",
                "min_rounds": 5,
                "max_time": 1.0,
                "min_time": 5e-06,
                "warmup": false
            },
            "stats": {
                "min": 0.08449712499998441,
                "max": 0.10466130900002213,
                "mean": 0.09023805563636374,
                "stddev": 0.005437061379771796,
                "rounds": 11,
                "median": 0.08948025800000892,
                "iqr": 0.0042913637499850665,
                "q1": 0.08761074650000467,
                "q3": 0.09190211024998973,
                "iqr_outliers": 1,
                "stddev_outliers": 2,
                "outliers": "2;1",
                "ld15iqr": 0.08449712499998441,
                "hd15iqr": 0.10466130900002213,
                "ops": 11.081799058589471,
                "total": 0.9926186120000011,
                "iterations": 1
            }
        },
        {
            "group": null,
            "name": "test_08_optical_spring",
            "fullname": "tests/benchmarks/test_benchmarks.py::test_08_optical_spring",
            "params": null,
            "param": null,
            "extra_info": {},
            "options": {
                "disable_gc": false,
                "timer": "perf_counter",
                "min_rounds": 5,
                "max_time": 1.0,
                "min_time": 5e-06,
                "warmup": false
            },
            "stats": {
                "min": 0.2361687199999949,
                "max": 0.8728048240000135,
                "mean": 0.36591890920000764,
                "stddev": 0.2833921867083767,
                "rounds": 5,
                "median": 0.23732641700001977,
                "iqr": 0.16689423125000502,
                "q1": 0.23641004675000232,
                "q3": 0.40330427800000734,
                "iqr_outliers": 1,
                "stddev_outliers": 1,
                "outliers": "1;1",
                "ld15iqr": 0.2361687199999949,
                "hd15iqr": 0.8728048240000135,
                "ops": 2.732845925306937,
                "total": 1.8295945460000382,
                "iterations": 1
            }
        },
        {
            "group": null,
            "name": "test_09_aligo_sensitivity",
            "fullname": "tests/benchmarks/test_benchmarks.py::test_09_aligo_sensitivity",
            "params": null,
            "param": null,
            "extra_info": {},
            "options": {
                "disable_gc": false,
                "timer": "perf_counter",
                "min_rounds": 5,
                "max_time": 1.0,
                "min_time": 5e-06,
                "warmup": false
            },
            "stats": {
                "min": 0.25317428500000005,
                "max": 0.257710679999974,
                "mean": 0.2545815359999949,
                "stddev": 0.0018950461270148503,
                "rounds": 5,
                "median": 0.25355075299998475,
                "iqr": 0.0023395107499908363,
                "q1": 0.25336785100000725,
                "q3": 0.2557073617499981,
                "iqr_outliers": 0,
                "stddev_outliers": 1,
                "outliers": "1;0",
                "ld15iqr": 0.25317428500000005,
                "hd15iqr": 0.257710679999974,
                "ops": 3.9280146381080048,
                "total": 1.2729076799999746,
                "iterations": 1
            }
        },
        {
            "group": null,
            "name": "test_10_shifted_beam",
            "fullname": "tests/benchmarks/test_benchmarks.py::test_10_shifted_beam",
            "params": null,
            "param": null,
            "extra_info": {},
            "options": {
                "disable_gc": false,
                "timer": "perf_counter",
                "min_rounds": 5,
                "max_time": 1.0,
                "min_time": 5e-06,
                "warmup": false
            },
            "stats": {
                "min": 0.7244907269999885,
                "max": 0.7520438379999916,
                "mean": 0.737876226000003,
                "stddev": 0.011374911944812533,
                "rounds": 5,
                "median": 0.7405154550000077,
                "iqr": 0.01873938625001159,
                "q1": 0.727321293750002,
                "q3": 0.7460606800000136,
                "iqr_outliers": 0,
                "stddev_outliers": 2,
                "outliers": "2;0",
                "ld15iqr": 0.7244907269999885,
                "hd15iqr": 0.7520438379999916,
                "ops": 1.3552408449598101,
                "total": 3.689381130000015,
                "iterations": 1
            }
        },
        {
            "group": null,
            "name": "test_angular_radiation_pressure",
            "fullname": "tests/benchmarks/test_benchmarks.py::test_angular_radiation_pressure",
            "params": null,
            "param": null,
            "extra_info": {},
            "options": {
                "disable_gc": false,
                "timer": "perf_counter",
                "min_rounds": 5,
                "max_time": 1.0,
                "min_time": 5e-06,
                "warmup": false
            },
            "stats": {
                "min": 0.2965239039999972,
                "max": 0.3042443779999928,
                "mean": 0.30084752919999,
                "stddev": 0.0031434118555748866,
                "rounds": 5,
                "median": 0.30051423999998406,
                "iqr": 0.005001800500018305,
                "q1": 0.29870330649998067,
                "q3": 0.303705106999999,
                "iqr_outliers": 0,
                "stddev_outliers": 2,
                "outliers": "2;0",
                "ld15iqr": 0.2965239039999972,
                "hd15iqr": 0.3042443779999928,
                "ops": 3.3239428711918872,
                "total": 1.5042376459999502,
                "iterations": 1
            }
        },
        {
            "group": null,
            "name": "test_cavity_eigenmodes",
            "fullname": "tests/benchmarks/test_benchmarks.py::test_cavity_eigenmodes",
            "params": null,
            "param": null,
            "extra_info": {},
            "options": {
                "disable_gc": false,
                "timer": "perf_counter",
                "min_rounds": 5,
                "max_time": 1.0,
                "min_time": 5e-06,
                "warmup": false
            },
            "stats": {
                "min": 0.27102976599999806,
                "max": 0.28550414999998,
                "mean": 0.27636350719999997,
                "stddev": 0.005698230170980214,
                "rounds": 5,
                "median": 0.2742589260000159,
                "iqr": 0.007292976499975623,
                "q1": 0.27255451150001164,
                "q3": 0.27984748799998727,
                "iqr_outliers": 0,
                "stddev_outliers": 1,
                "outliers": "1;0",
                "ld15iqr": 0.27102976599999806,
                "hd15iqr": 0.28550414999998,
                "ops": 3.618422743768104,
                "total": 1.3818175359999998,
                "iterations": 1
            }
        },
        {
            "group": null,
            "name": "test_coupled_cavity_commands",
            "fullname": "tests/benchmarks/test_benchmarks.py::test_coupled_cavity_commands",
            "params": null,
            "param": null,
            "extra_info": {},
            "options": {
                "disable_gc": false,
                "timer": "perf_counter",
                "min_rounds": 5,
                "max_time": 1.0,
                "min_time": 5e-06,
                "warmup": false
            },
            "stats": {
                "min": 4.4949935049999965,
                "max": 5.682087215000024,
                "mean": 4.783261313600008,
                "stddev": 0.5051940131114062,
                "rounds": 5,
                "median": 4.559757063999996,
                "iqr": 0.372058968999994,
                "q1": 4.528406399500014,
                "q3": 4.900465368500008,
                "iqr_outliers": 1,
                "stddev_outliers": 1,
                "outliers": "1;1",
                "ld15iqr": 4.4949935049999965,
                "hd15iqr": 5.682087215000024,
                "ops": 0.20906238117427328,
                "total": 23.91630656800004,
                "iterations": 1
            }
        },
        {
            "group": null,
            "name": "test_frequency_dependant_squeezing",
            "fullname": "tests/benchmarks/test_benchmarks.py::test_frequency_dependant_squeezing",
            "params": null,
            "param": null,
            "extra_info": {},
            "options": {
                "disable_gc": false,
                "timer": "perf_counter",
                "min_rounds": 5,
                "max_time": 1.0,
                "min_time": 5e-06,
                "warmup": false
            },
            "stats": {
                "min": 1.4967847660000189,
                "max": 1.5238310550000165,
                "mean": 1.5102124572000093,
                "stddev": 0.011144555919754376,
                "rounds": 5,
                "median": 1.5100287909999963,
                "iqr": 0.018901459249981656,
                "q1": 1.5007828757500192,
                "q3": 1.5196843350000009,
                "iqr_outliers": 0,
                "stddev_outliers": 2,
                "outliers": "2;0",
                "ld15iqr": 1.4967847660000189,
                "hd15iqr": 1.5238310550000165,
                "ops": 0.6621584898419111,
                "total": 7.551062286000047,
                "iterations": 1
            }
        },
        {
            "group": null,
            "name": "test_lock_actions",
            "fullname": "tests/benchmarks/test_benchmarks.py::test_lock_actions",
            "params": null,
            "param": null,
            "extra_info": {},
            "options": {
                "disable_gc": false,
                "timer": "perf_counter",
                "min_rounds": 5,
                "max_time": 1.0,
                "min_time": 5e-06,
                "warmup": false
            },
            "stats": {
                "min": 3.138855007000018,
                "max": 3.165927802999988,
                "mean": 3.1517054311999972,
                "stddev": 0.012002237735518475,
                "rounds": 5,
                "median": 3.1540929950000134,
                "iqr": 0.021618886749990907,
                "q1": 3.1396576644999925,
                "q3": 3.1612765512499834,
                "iqr_outliers": 0,
                "stddev_outliers": 2,
                "outliers": "2;0",
                "ld15iqr": 3.138855007000018,
                "hd15iqr": 3.165927802999988,
                "ops": 0.3172885353118977,
                "total": 15.758527155999985,
                "iterations": 1
            }
        }
    ],
    "datetime": "2024-07-11T09:30:53.409083",
    "version": "4.0.0"
}