{
    "machine_info": {
        "node": "runner-zxwgkjap-project-39604133-concurrent-0",
        "processor": "",
        "machine": "x86_64",
        "python_compiler": "GCC 12.2.0",
        "python_implementation": "CPython",
        "python_implementation_version": "3.12.1",
        "python_version": "3.12.1",
        "python_build": [
            "main",
            "Dec 19 2023 20:14:15"
        ],
        "release": "5.4.109+",
        "system": "Linux",
        "cpu": {
            "python_version": "3.12.1.final.0 (64 bit)",
            "cpuinfo_version": [
                9,
                0,
                0
            ],
            "cpuinfo_version_string": "9.0.0",
            "arch": "X86_64",
            "bits": 64,
            "count": 2,
            "arch_string_raw": "x86_64",
            "vendor_id_raw": "AuthenticAMD",
            "brand_raw": "AMD EPYC 7B12",
            "hz_advertised_friendly": "2.2500 GHz",
            "hz_actual_friendly": "2.2500 GHz",
            "hz_advertised": [
                2249998000,
                0
            ],
            "hz_actual": [
                2249998000,
                0
            ],
            "model": 49,
            "family": 23,
            "flags": [
                "3dnowext",
                "3dnowprefetch",
                "abm",
                "adx",
                "aes",
                "apic",
                "arat",
                "avx",
                "avx2",
                "bmi1",
                "bmi2",
                "clflush",
                "clflushopt",
                "clwb",
                "clzero",
                "cmov",
                "cmp_legacy",
                "constant_tsc",
                "cpuid",
                "cr8_legacy",
                "cx16",
                "cx8",
                "de",
                "extd_apicid",
                "f16c",
                "fma",
                "fpu",
                "fsgsbase",
                "fxsr",
                "fxsr_opt",
                "ht",
                "hypervisor",
                "ibpb",
                "ibrs",
                "lahf_lm",
                "lm",
                "mca",
                "mce",
                "misalignsse",
                "mmx",
                "mmxext",
                "movbe",
                "msr",
                "mtrr",
                "nonstop_tsc",
                "nopl",
                "npt",
                "nrip_save",
                "nx",
                "osvw",
                "osxsave",
                "pae",
                "pat",
                "pclmulqdq",
                "pdpe1gb",
                "pge",
                "pni",
                "popcnt",
                "pse",
                "pse36",
                "rdpid",
                "rdrand",
                "rdrnd",
                "rdseed",
                "rdtscp",
                "rep_good",
                "sep",
                "sha",
                "sha_ni",
                "smap",
                "smep",
                "ssbd",
                "sse",
                "sse2",
                "sse4_1",
                "sse4_2",
                "sse4a",
                "ssse3",
                "stibp",
                "syscall",
                "topoext",
                "tsc",
                "tsc_adjust",
                "tsc_known_freq",
                "umip",
                "vme",
                "vmmcall",
                "xgetbv1",
                "xsave",
                "xsavec",
                "xsaveerptr",
                "xsaveopt"
            ],
            "l3_cache_size": 524288,
            "l2_cache_size": 524288,
            "l1_data_cache_size": 32768,
            "l1_instruction_cache_size": 32768,
            "l2_cache_line_size": 512,
            "l2_cache_associativity": 6
        }
    },
    "commit_info": {
        "id": "29f16ea19f6ef617e8a46ba295e31991e8476c93",
        "time": "2023-12-21T12:26:27+00:00",
        "author_time": "2023-12-21T12:26:27+00:00",
        "dirty": false,
        "project": "finesse3",
        "branch": "(detached head)"
    },
    "benchmarks": [
        {
            "group": null,
            "name": "test_1_simple_cav",
            "fullname": "tests/benchmarks/test_benchmarks.py::test_1_simple_cav",
            "params": null,
            "param": null,
            "extra_info": {},
            "options": {
                "disable_gc": false,
                "timer": "perf_counter",
                "min_rounds": 5,
                "max_time": 1.0,
                "min_time": 5e-06,
                "warmup": false
            },
            "stats": {
                "min": 0.0839022809999932,
                "max": 0.08623066300000914,
                "mean": 0.08490047733333246,
                "stddev": 0.0007808851115596391,
                "rounds": 6,
                "median": 0.08493133600000391,
                "iqr": 0.0006283160000037924,
                "q1": 0.08438946599999042,
                "q3": 0.08501778199999421,
                "iqr_outliers": 1,
                "stddev_outliers": 2,
                "outliers": "2;1",
                "ld15iqr": 0.0839022809999932,
                "hd15iqr": 0.08623066300000914,
                "ops": 11.778496793060945,
                "total": 0.5094028639999948,
                "iterations": 1
            }
        },
        {
            "group": null,
            "name": "test_2_pdh_lock",
            "fullname": "tests/benchmarks/test_benchmarks.py::test_2_pdh_lock",
            "params": null,
            "param": null,
            "extra_info": {},
            "options": {
                "disable_gc": false,
                "timer": "perf_counter",
                "min_rounds": 5,
                "max_time": 1.0,
                "min_time": 5e-06,
                "warmup": false
            },
            "stats": {
                "min": 1.1067432100000048,
                "max": 1.214648914999998,
                "mean": 1.1308847619999995,
                "stddev": 0.04690847630666246,
                "rounds": 5,
                "median": 1.111519346999998,
                "iqr": 0.03135387324999428,
                "q1": 1.107564205750002,
                "q3": 1.1389180789999962,
                "iqr_outliers": 1,
                "stddev_outliers": 1,
                "outliers": "1;1",
                "ld15iqr": 1.1067432100000048,
                "hd15iqr": 1.214648914999998,
                "ops": 0.8842633958843638,
                "total": 5.654423809999997,
                "iterations": 1
            }
        },
        {
            "group": null,
            "name": "test_4_geometrical_params",
            "fullname": "tests/benchmarks/test_benchmarks.py::test_4_geometrical_params",
            "params": null,
            "param": null,
            "extra_info": {},
            "options": {
                "disable_gc": false,
                "timer": "perf_counter",
                "min_rounds": 5,
                "max_time": 1.0,
                "min_time": 5e-06,
                "warmup": false
            },
            "stats": {
                "min": 0.11715714599999671,
                "max": 0.12016030600000249,
                "mean": 0.11828442766666411,
                "stddev": 0.0011208973786574798,
                "rounds": 9,
                "median": 0.11791296399999851,
                "iqr": 0.0019204237500041188,
                "q1": 0.11727428799999373,
                "q3": 0.11919471174999785,
                "iqr_outliers": 0,
                "stddev_outliers": 3,
                "outliers": "3;0",
                "ld15iqr": 0.11715714599999671,
                "hd15iqr": 0.12016030600000249,
                "ops": 8.454198238318298,
                "total": 1.064559848999977,
                "iterations": 1
            }
        },
        {
            "group": null,
            "name": "test_5_modulation",
            "fullname": "tests/benchmarks/test_benchmarks.py::test_5_modulation",
            "params": null,
            "param": null,
            "extra_info": {},
            "options": {
                "disable_gc": false,
                "timer": "perf_counter",
                "min_rounds": 5,
                "max_time": 1.0,
                "min_time": 5e-06,
                "warmup": false
            },
            "stats": {
                "min": 0.06289366499999005,
                "max": 0.17239021700000023,
                "mean": 0.07122485893749975,
                "stddev": 0.026995622423889858,
                "rounds": 16,
                "median": 0.06466608249999695,
                "iqr": 0.0014624200000028509,
                "q1": 0.06366213750000327,
                "q3": 0.06512455750000612,
                "iqr_outliers": 1,
                "stddev_outliers": 1,
                "outliers": "1;1",
                "ld15iqr": 0.06289366499999005,
                "hd15iqr": 0.17239021700000023,
                "ops": 14.040041846590475,
                "total": 1.139597742999996,
                "iterations": 1
            }
        },
        {
            "group": null,
            "name": "test_6_radiation_pressure",
            "fullname": "tests/benchmarks/test_benchmarks.py::test_6_radiation_pressure",
            "params": null,
            "param": null,
            "extra_info": {},
            "options": {
                "disable_gc": false,
                "timer": "perf_counter",
                "min_rounds": 5,
                "max_time": 1.0,
                "min_time": 5e-06,
                "warmup": false
            },
            "stats": {
                "min": 0.026184395999990784,
                "max": 0.13175172000001112,
                "mean": 0.03082315305555541,
                "stddev": 0.017376330212923362,
                "rounds": 36,
                "median": 0.027733681999997373,
                "iqr": 0.002402928500004009,
                "q1": 0.026511069499996154,
                "q3": 0.028913998000000163,
                "iqr_outliers": 1,
                "stddev_outliers": 1,
                "outliers": "1;1",
                "ld15iqr": 0.026184395999990784,
                "hd15iqr": 0.13175172000001112,
                "ops": 32.44314422335729,
                "total": 1.1096335099999948,
                "iterations": 1
            }
        },
        {
            "group": null,
            "name": "test_7_homodyne",
            "fullname": "tests/benchmarks/test_benchmarks.py::test_7_homodyne",
            "params": null,
            "param": null,
            "extra_info": {},
            "options": {
                "disable_gc": false,
                "timer": "perf_counter",
                "min_rounds": 5,
                "max_time": 1.0,
                "min_time": 5e-06,
                "warmup": false
            },
            "stats": {
                "min": 0.04253819599999531,
                "max": 0.04647529500000758,
                "mean": 0.0437798515454556,
                "stddev": 0.0010476304892047667,
                "rounds": 22,
                "median": 0.04346408549999836,
                "iqr": 0.0014804549999922756,
                "q1": 0.04303568100000632,
                "q3": 0.044516135999998596,
                "iqr_outliers": 0,
                "stddev_outliers": 7,
                "outliers": "7;0",
                "ld15iqr": 0.04253819599999531,
                "hd15iqr": 0.04647529500000758,
                "ops": 22.841557581841577,
                "total": 0.9631567340000231,
                "iterations": 1
            }
        },
        {
            "group": null,
            "name": "test_8_optical_spring",
            "fullname": "tests/benchmarks/test_benchmarks.py::test_8_optical_spring",
            "params": null,
            "param": null,
            "extra_info": {},
            "options": {
                "disable_gc": false,
                "timer": "perf_counter",
                "min_rounds": 5,
                "max_time": 1.0,
                "min_time": 5e-06,
                "warmup": false
            },
            "stats": {
                "min": 0.04139778500000091,
                "max": 0.15583617499999036,
                "mean": 0.04736494008695603,
                "stddev": 0.02366100856547676,
                "rounds": 23,
                "median": 0.04261545699999658,
                "iqr": 0.0017741030000095748,
                "q1": 0.04155480424999425,
                "q3": 0.04332890725000382,
                "iqr_outliers": 1,
                "stddev_outliers": 1,
                "outliers": "1;1",
                "ld15iqr": 0.04139778500000091,
                "hd15iqr": 0.15583617499999036,
                "ops": 21.112662618471102,
                "total": 1.0893936219999887,
                "iterations": 1
            }
        },
        {
            "group": null,
            "name": "test_9_aligo_sensitivity",
            "fullname": "tests/benchmarks/test_benchmarks.py::test_9_aligo_sensitivity",
            "params": null,
            "param": null,
            "extra_info": {},
            "options": {
                "disable_gc": false,
                "timer": "perf_counter",
                "min_rounds": 5,
                "max_time": 1.0,
                "min_time": 5e-06,
                "warmup": false
            },
            "stats": {
                "min": 0.1331303030000015,
                "max": 0.2587259720000077,
                "mean": 0.16583385800000272,
                "stddev": 0.05593149380465146,
                "rounds": 8,
                "median": 0.13689686000000734,
                "iqr": 0.062246048500000484,
                "q1": 0.13413219299999923,
                "q3": 0.19637824149999972,
                "iqr_outliers": 0,
                "stddev_outliers": 2,
                "outliers": "2;0",
                "ld15iqr": 0.1331303030000015,
                "hd15iqr": 0.2587259720000077,
                "ops": 6.030131675523002,
                "total": 1.3266708640000218,
                "iterations": 1
            }
        },
        {
            "group": null,
            "name": "test_10_shifted_beam",
            "fullname": "tests/benchmarks/test_benchmarks.py::test_10_shifted_beam",
            "params": null,
            "param": null,
            "extra_info": {},
            "options": {
                "disable_gc": false,
                "timer": "perf_counter",
                "min_rounds": 5,
                "max_time": 1.0,
                "min_time": 5e-06,
                "warmup": false
            },
            "stats": {
                "min": 0.7411295819999992,
                "max": 0.9024467100000066,
                "mean": 0.7877565500000031,
                "stddev": 0.06667545908991018,
                "rounds": 5,
                "median": 0.7695937999999956,
                "iqr": 0.07178725200001068,
                "q1": 0.7416581572500007,
                "q3": 0.8134454092500114,
                "iqr_outliers": 0,
                "stddev_outliers": 1,
                "outliers": "1;0",
                "ld15iqr": 0.7411295819999992,
                "hd15iqr": 0.9024467100000066,
                "ops": 1.2694277185000824,
                "total": 3.9387827500000157,
                "iterations": 1
            }
        },
        {
            "group": null,
            "name": "test_angular_radiation_pressure",
            "fullname": "tests/benchmarks/test_benchmarks.py::test_angular_radiation_pressure",
            "params": null,
            "param": null,
            "extra_info": {},
            "options": {
                "disable_gc": false,
                "timer": "perf_counter",
                "min_rounds": 5,
                "max_time": 1.0,
                "min_time": 5e-06,
                "warmup": false
            },
            "stats": {
                "min": 0.19364370600000314,
                "max": 0.19817167899999788,
                "mean": 0.19580742020000058,
                "stddev": 0.001753406031308926,
                "rounds": 5,
                "median": 0.19587097699999845,
                "iqr": 0.002627274999991158,
                "q1": 0.19441981275000586,
                "q3": 0.19704708774999702,
                "iqr_outliers": 0,
                "stddev_outliers": 2,
                "outliers": "2;0",
                "ld15iqr": 0.19364370600000314,
                "hd15iqr": 0.19817167899999788,
                "ops": 5.107058756908115,
                "total": 0.979037101000003,
                "iterations": 1
            }
        },
        {
            "group": null,
            "name": "test_cavity_eigenmodes",
            "fullname": "tests/benchmarks/test_benchmarks.py::test_cavity_eigenmodes",
            "params": null,
            "param": null,
            "extra_info": {},
            "options": {
                "disable_gc": false,
                "timer": "perf_counter",
                "min_rounds": 5,
                "max_time": 1.0,
                "min_time": 5e-06,
                "warmup": false
            },
            "stats": {
                "min": 0.07830797599999073,
                "max": 0.08917332299999714,
                "mean": 0.08417818033333191,
                "stddev": 0.003625721930750889,
                "rounds": 12,
                "median": 0.08403878749999905,
                "iqr": 0.00638200800000277,
                "q1": 0.08108060300000375,
                "q3": 0.08746261100000652,
                "iqr_outliers": 0,
                "stddev_outliers": 3,
                "outliers": "3;0",
                "ld15iqr": 0.07830797599999073,
                "hd15iqr": 0.08917332299999714,
                "ops": 11.87956304163576,
                "total": 1.010138163999983,
                "iterations": 1
            }
        },
        {
            "group": null,
            "name": "test_coupled_cavity_commands",
            "fullname": "tests/benchmarks/test_benchmarks.py::test_coupled_cavity_commands",
            "params": null,
            "param": null,
            "extra_info": {},
            "options": {
                "disable_gc": false,
                "timer": "perf_counter",
                "min_rounds": 5,
                "max_time": 1.0,
                "min_time": 5e-06,
                "warmup": false
            },
            "stats": {
                "min": 4.5003663869999855,
                "max": 4.853052759999997,
                "mean": 4.709055207999995,
                "stddev": 0.1812001214053443,
                "rounds": 5,
                "median": 4.825535699999989,
                "iqr": 0.33036202750000143,
                "q1": 4.516366826999999,
                "q3": 4.8467288545,
                "iqr_outliers": 0,
                "stddev_outliers": 2,
                "outliers": "2;0",
                "ld15iqr": 4.5003663869999855,
                "hd15iqr": 4.853052759999997,
                "ops": 0.21235682229869518,
                "total": 23.545276039999976,
                "iterations": 1
            }
        },
        {
            "group": null,
            "name": "test_frequency_dependant_squeezing",
            "fullname": "tests/benchmarks/test_benchmarks.py::test_frequency_dependant_squeezing",
            "params": null,
            "param": null,
            "extra_info": {},
            "options": {
                "disable_gc": false,
                "timer": "perf_counter",
                "min_rounds": 5,
                "max_time": 1.0,
                "min_time": 5e-06,
                "warmup": false
            },
            "stats": {
                "min": 1.4855615410000098,
                "max": 1.8444970580000017,
                "mean": 1.5782365778000098,
                "stddev": 0.1506942401822801,
                "rounds": 5,
                "median": 1.5257641550000187,
                "iqr": 0.12744587950002284,
                "q1": 1.4907944357499971,
                "q3": 1.61824031525002,
                "iqr_outliers": 1,
                "stddev_outliers": 1,
                "outliers": "1;1",
                "ld15iqr": 1.4855615410000098,
                "hd15iqr": 1.8444970580000017,
                "ops": 0.633618567752342,
                "total": 7.891182889000049,
                "iterations": 1
            }
        },
        {
            "group": null,
            "name": "test_lock_actions",
            "fullname": "tests/benchmarks/test_benchmarks.py::test_lock_actions",
            "params": null,
            "param": null,
            "extra_info": {},
            "options": {
                "disable_gc": false,
                "timer": "perf_counter",
                "min_rounds": 5,
                "max_time": 1.0,
                "min_time": 5e-06,
                "warmup": false
            },
            "stats": {
                "min": 0.3742434650000064,
                "max": 0.6937716200000068,
                "mean": 0.44015362760000587,
                "stddev": 0.14179950850396247,
                "rounds": 5,
                "median": 0.3773456220000071,
                "iqr": 0.08429854350003296,
                "q1": 0.3746304004999885,
                "q3": 0.4589289440000215,
                "iqr_outliers": 1,
                "stddev_outliers": 1,
                "outliers": "1;1",
                "ld15iqr": 0.3742434650000064,
                "hd15iqr": 0.6937716200000068,
                "ops": 2.271934018703034,
                "total": 2.2007681380000292,
                "iterations": 1
            }
        }
    ],
    "datetime": "2023-12-21T12:37:01.072068",
    "version": "4.0.0"
}