{
    "machine_info": {
        "node": "runner-nthfetyx-project-39604133-concurrent-0",
        "processor": "",
        "machine": "x86_64",
        "python_compiler": "GCC 12.2.0",
        "python_implementation": "CPython",
        "python_implementation_version": "3.12.5",
        "python_version": "3.12.5",
        "python_build": [
            "main",
            "Aug 13 2024 02:19:05"
        ],
        "release": "5.15.154+",
        "system": "Linux",
        "cpu": {
            "python_version": "3.12.5.final.0 (64 bit)",
            "cpuinfo_version": [
                9,
                0,
                0
            ],
            "cpuinfo_version_string": "9.0.0",
            "arch": "X86_64",
            "bits": 64,
            "count": 2,
            "arch_string_raw": "x86_64",
            "vendor_id_raw": "AuthenticAMD",
            "brand_raw": "AMD EPYC 7B13",
            "hz_advertised_friendly": "2.4500 GHz",
            "hz_actual_friendly": "2.4500 GHz",
            "hz_advertised": [
                2449998000,
                0
            ],
            "hz_actual": [
                2449998000,
                0
            ],
            "model": 1,
            "family": 25,
            "flags": [
                "3dnowext",
                "3dnowprefetch",
                "abm",
                "adx",
                "aes",
                "apic",
                "arat",
                "avx",
                "avx2",
                "bmi1",
                "bmi2",
                "clflush",
                "clflushopt",
                "clwb",
                "clzero",
                "cmov",
                "cmp_legacy",
                "constant_tsc",
                "cpuid",
                "cr8_legacy",
                "cx16",
                "cx8",
                "de",
                "erms",
                "extd_apicid",
                "f16c",
                "fma",
                "fpu",
                "fsgsbase",
                "fsrm",
                "fxsr",
                "fxsr_opt",
                "ht",
                "hypervisor",
                "ibpb",
                "ibrs",
                "invpcid",
                "invpcid_single",
                "lahf_lm",
                "lm",
                "mca",
                "mce",
                "misalignsse",
                "mmx",
                "mmxext",
                "movbe",
                "msr",
                "mtrr",
                "nonstop_tsc",
                "nopl",
                "npt",
                "nrip_save",
                "nx",
                "osvw",
                "osxsave",
                "pae",
                "pat",
                "pcid",
                "pclmulqdq",
                "pdpe1gb",
                "pge",
                "pni",
                "popcnt",
                "pse",
                "pse36",
                "rdpid",
                "rdrand",
                "rdrnd",
                "rdseed",
                "rdtscp",
                "rep_good",
                "sep",
                "sha",
                "sha_ni",
                "smap",
                "smep",
                "ssbd",
                "sse",
                "sse2",
                "sse4_1",
                "sse4_2",
                "sse4a",
                "ssse3",
                "stibp",
                "syscall",
                "topoext",
                "tsc",
                "tsc_adjust",
                "tsc_known_freq",
                "umip",
                "vaes",
                "vme",
                "vmmcall",
                "vpclmulqdq",
                "x2apic",
                "xgetbv1",
                "xsave",
                "xsavec",
                "xsaveerptr",
                "xsaveopt"
            ],
            "l3_cache_size": 524288,
            "l2_cache_size": 524288,
            "l1_data_cache_size": 32768,
            "l1_instruction_cache_size": 32768,
            "l2_cache_line_size": 512,
            "l2_cache_associativity": 6
        }
    },
    "commit_info": {
        "id": "6f841007dfad7a086323486c6e9ba341090b7438",
        "time": "2024-09-02T14:01:03+09:30",
        "author_time": "2024-09-02T14:01:03+09:30",
        "dirty": false,
        "project": "finesse3",
        "branch": "(detached head)"
    },
    "benchmarks": [
        {
            "group": null,
            "name": "test_01_simple_cav",
            "fullname": "tests/benchmarks/test_benchmarks.py::test_01_simple_cav",
            "params": null,
            "param": null,
            "extra_info": {},
            "options": {
                "disable_gc": false,
                "timer": "perf_counter",
                "min_rounds": 5,
                "max_time": 1.0,
                "min_time": 5e-06,
                "warmup": false
            },
            "stats": {
                "min": 0.2646494780000239,
                "max": 0.460107379999954,
                "mean": 0.3056073507999827,
                "stddev": 0.08639772753317039,
                "rounds": 5,
                "median": 0.26858647899996413,
                "iqr": 0.05256380474995126,
                "q1": 0.26482273625001085,
                "q3": 0.3173865409999621,
                "iqr_outliers": 1,
                "stddev_outliers": 1,
                "outliers": "1;1",
                "ld15iqr": 0.2646494780000239,
                "hd15iqr": 0.460107379999954,
                "ops": 3.2721726011573957,
                "total": 1.5280367539999133,
                "iterations": 1
            }
        },
        {
            "group": null,
            "name": "test_02_pdh_lock",
            "fullname": "tests/benchmarks/test_benchmarks.py::test_02_pdh_lock",
            "params": null,
            "param": null,
            "extra_info": {},
            "options": {
                "disable_gc": false,
                "timer": "perf_counter",
                "min_rounds": 5,
                "max_time": 1.0,
                "min_time": 5e-06,
                "warmup": false
            },
            "stats": {
                "min": 1.1739807989999917,
                "max": 1.4884014749999324,
                "mean": 1.298308259600003,
                "stddev": 0.14524162450525938,
                "rounds": 5,
                "median": 1.2108539170000086,
                "iqr": 0.2459890072500457,
                "q1": 1.1916676957499988,
                "q3": 1.4376567030000444,
                "iqr_outliers": 0,
                "stddev_outliers": 1,
                "outliers": "1;0",
                "ld15iqr": 1.1739807989999917,
                "hd15iqr": 1.4884014749999324,
                "ops": 0.7702331034296053,
                "total": 6.491541298000016,
                "iterations": 1
            }
        },
        {
            "group": null,
            "name": "test_03_near_unstable",
            "fullname": "tests/benchmarks/test_benchmarks.py::test_03_near_unstable",
            "params": null,
            "param": null,
            "extra_info": {},
            "options": {
                "disable_gc": false,
                "timer": "perf_counter",
                "min_rounds": 5,
                "max_time": 1.0,
                "min_time": 5e-06,
                "warmup": false
            },
            "stats": {
                "min": 1.7699999261822086e-06,
                "max": 0.00014800000008108327,
                "mean": 1.9342420220386275e-06,
                "stddev": 7.152316455933997e-07,
                "rounds": 71634,
                "median": 1.9000000293090125e-06,
                "iqr": 4.000003173132427e-08,
                "q1": 1.8800000134433503e-06,
                "q3": 1.9200000451746746e-06,
                "iqr_outliers": 4865,
                "stddev_outliers": 437,
                "outliers": "437;4865",
                "ld15iqr": 1.819999965846364e-06,
                "hd15iqr": 1.988999997593055e-06,
                "ops": 516998.38417636737,
                "total": 0.13855749300671505,
                "iterations": 1
            }
        },
        {
            "group": null,
            "name": "test_04_geometrical_params",
            "fullname": "tests/benchmarks/test_benchmarks.py::test_04_geometrical_params",
            "params": null,
            "param": null,
            "extra_info": {},
            "options": {
                "disable_gc": false,
                "timer": "perf_counter",
                "min_rounds": 5,
                "max_time": 1.0,
                "min_time": 5e-06,
                "warmup": false
            },
            "stats": {
                "min": 0.4538425800000141,
                "max": 0.8127418249999891,
                "mean": 0.5363074646000314,
                "stddev": 0.15479863903519928,
                "rounds": 5,
                "median": 0.47047999900007653,
                "iqr": 0.09982167049994928,
                "q1": 0.4625895600000547,
                "q3": 0.562411230500004,
                "iqr_outliers": 1,
                "stddev_outliers": 1,
                "outliers": "1;1",
                "ld15iqr": 0.4538425800000141,
                "hd15iqr": 0.8127418249999891,
                "ops": 1.864602053871807,
                "total": 2.681537323000157,
                "iterations": 1
            }
        },
        {
            "group": null,
            "name": "test_05_modulation",
            "fullname": "tests/benchmarks/test_benchmarks.py::test_05_modulation",
            "params": null,
            "param": null,
            "extra_info": {},
            "options": {
                "disable_gc": false,
                "timer": "perf_counter",
                "min_rounds": 5,
                "max_time": 1.0,
                "min_time": 5e-06,
                "warmup": false
            },
            "stats": {
                "min": 0.11965344499992625,
                "max": 0.13277696499994818,
                "mean": 0.1252764972499847,
                "stddev": 0.004992125097180611,
                "rounds": 8,
                "median": 0.12310304000004635,
                "iqr": 0.008629374000008738,
                "q1": 0.12157918499997322,
                "q3": 0.13020855899998196,
                "iqr_outliers": 0,
                "stddev_outliers": 3,
                "outliers": "3;0",
                "ld15iqr": 0.11965344499992625,
                "hd15iqr": 0.13277696499994818,
                "ops": 7.982343232382499,
                "total": 1.0022119779998775,
                "iterations": 1
            }
        },
        {
            "group": null,
            "name": "test_06_radiation_pressure",
            "fullname": "tests/benchmarks/test_benchmarks.py::test_06_radiation_pressure",
            "params": null,
            "param": null,
            "extra_info": {},
            "options": {
                "disable_gc": false,
                "timer": "perf_counter",
                "min_rounds": 5,
                "max_time": 1.0,
                "min_time": 5e-06,
                "warmup": false
            },
            "stats": {
                "min": 0.24426950899999156,
                "max": 0.7807785960000047,
                "mean": 0.3542968625999947,
                "stddev": 0.23842999453542063,
                "rounds": 5,
                "median": 0.2501518390000683,
                "iqr": 0.1387438134999286,
                "q1": 0.2448657447500011,
                "q3": 0.3836095582499297,
                "iqr_outliers": 1,
                "stddev_outliers": 1,
                "outliers": "1;1",
                "ld15iqr": 0.24426950899999156,
                "hd15iqr": 0.7807785960000047,
                "ops": 2.822491829765401,
                "total": 1.7714843129999736,
                "iterations": 1
            }
        },
        {
            "group": null,
            "name": "test_07_homodyne",
            "fullname": "tests/benchmarks/test_benchmarks.py::test_07_homodyne",
            "params": null,
            "param": null,
            "extra_info": {},
            "options": {
                "disable_gc": false,
                "timer": "perf_counter",
                "min_rounds": 5,
                "max_time": 1.0,
                "min_time": 5e-06,
                "warmup": false
            },
            "stats": {
                "min": 0.08541889599996466,
                "max": 0.09065775599992776,
                "mean": 0.0873666789090583,
                "stddev": 0.0017505680502917962,
                "rounds": 11,
                "median": 0.08672940700000709,
                "iqr": 0.003096610000000055,
                "q1": 0.0859080459999575,
                "q3": 0.08900465599995755,
                "iqr_outliers": 0,
                "stddev_outliers": 3,
                "outliers": "3;0",
                "ld15iqr": 0.08541889599996466,
                "hd15iqr": 0.09065775599992776,
                "ops": 11.446011368257683,
                "total": 0.9610334679996413,
                "iterations": 1
            }
        },
        {
            "group": null,
            "name": "test_08_optical_spring",
            "fullname": "tests/benchmarks/test_benchmarks.py::test_08_optical_spring",
            "params": null,
            "param": null,
            "extra_info": {},
            "options": {
                "disable_gc": false,
                "timer": "perf_counter",
                "min_rounds": 5,
                "max_time": 1.0,
                "min_time": 5e-06,
                "warmup": false
            },
            "stats": {
                "min": 0.22290519099999528,
                "max": 0.8979857409999568,
                "mean": 0.3611411844000031,
                "stddev": 0.30011477927725766,
                "rounds": 5,
                "median": 0.22836487999995825,
                "iqr": 0.16998560999994083,
                "q1": 0.22628735275006306,
                "q3": 0.3962729627500039,
                "iqr_outliers": 1,
                "stddev_outliers": 1,
                "outliers": "1;1",
                "ld15iqr": 0.22290519099999528,
                "hd15iqr": 0.8979857409999568,
                "ops": 2.7690001672376177,
                "total": 1.8057059220000156,
                "iterations": 1
            }
        },
        {
            "group": null,
            "name": "test_09_aligo_sensitivity",
            "fullname": "tests/benchmarks/test_benchmarks.py::test_09_aligo_sensitivity",
            "params": null,
            "param": null,
            "extra_info": {},
            "options": {
                "disable_gc": false,
                "timer": "perf_counter",
                "min_rounds": 5,
                "max_time": 1.0,
                "min_time": 5e-06,
                "warmup": false
            },
            "stats": {
                "min": 0.24521718899995903,
                "max": 0.2577523489999294,
                "mean": 0.2530932610000036,
                "stddev": 0.004677077145593868,
                "rounds": 5,
                "median": 0.2542397089999895,
                "iqr": 0.0037173350000045957,
                "q1": 0.25160892150003633,
                "q3": 0.2553262565000409,
                "iqr_outliers": 1,
                "stddev_outliers": 1,
                "outliers": "1;1",
                "ld15iqr": 0.2537394990000621,
                "hd15iqr": 0.2577523489999294,
                "ops": 3.9511127086073845,
                "total": 1.265466305000018,
                "iterations": 1
            }
        },
        {
            "group": null,
            "name": "test_10_shifted_beam",
            "fullname": "tests/benchmarks/test_benchmarks.py::test_10_shifted_beam",
            "params": null,
            "param": null,
            "extra_info": {},
            "options": {
                "disable_gc": false,
                "timer": "perf_counter",
                "min_rounds": 5,
                "max_time": 1.0,
                "min_time": 5e-06,
                "warmup": false
            },
            "stats": {
                "min": 0.7099083089999567,
                "max": 1.4166719590000412,
                "mean": 0.8550631490000115,
                "stddev": 0.31399603304183354,
                "rounds": 5,
                "median": 0.7156199790000528,
                "iqr": 0.186627362500019,
                "q1": 0.7099271639999927,
                "q3": 0.8965545265000117,
                "iqr_outliers": 1,
                "stddev_outliers": 1,
                "outliers": "1;1",
                "ld15iqr": 0.7099083089999567,
                "hd15iqr": 1.4166719590000412,
                "ops": 1.1695042654679844,
                "total": 4.275315745000057,
                "iterations": 1
            }
        },
        {
            "group": null,
            "name": "test_angular_radiation_pressure",
            "fullname": "tests/benchmarks/test_benchmarks.py::test_angular_radiation_pressure",
            "params": null,
            "param": null,
            "extra_info": {},
            "options": {
                "disable_gc": false,
                "timer": "perf_counter",
                "min_rounds": 5,
                "max_time": 1.0,
                "min_time": 5e-06,
                "warmup": false
            },
            "stats": {
                "min": 0.300862805999941,
                "max": 0.3087552060000007,
                "mean": 0.3037875426000028,
                "stddev": 0.0029977271450946016,
                "rounds": 5,
                "median": 0.3029789070000106,
                "iqr": 0.0031815449999328393,
                "q1": 0.3019892767500494,
                "q3": 0.3051708217499822,
                "iqr_outliers": 0,
                "stddev_outliers": 1,
                "outliers": "1;0",
                "ld15iqr": 0.300862805999941,
                "hd15iqr": 0.3087552060000007,
                "ops": 3.291774216419073,
                "total": 1.518937713000014,
                "iterations": 1
            }
        },
        {
            "group": null,
            "name": "test_cavity_eigenmodes",
            "fullname": "tests/benchmarks/test_benchmarks.py::test_cavity_eigenmodes",
            "params": null,
            "param": null,
            "extra_info": {},
            "options": {
                "disable_gc": false,
                "timer": "perf_counter",
                "min_rounds": 5,
                "max_time": 1.0,
                "min_time": 5e-06,
                "warmup": false
            },
            "stats": {
                "min": 0.26488228900007016,
                "max": 1.0935836820000304,
                "mean": 0.43581645700003263,
                "stddev": 0.36772632040809,
                "rounds": 5,
                "median": 0.272196278000024,
                "iqr": 0.2104496082499736,
                "q1": 0.27024095575004026,
                "q3": 0.48069056400001386,
                "iqr_outliers": 1,
                "stddev_outliers": 1,
                "outliers": "1;1",
                "ld15iqr": 0.26488228900007016,
                "hd15iqr": 1.0935836820000304,
                "ops": 2.294543916224635,
                "total": 2.179082285000163,
                "iterations": 1
            }
        },
        {
            "group": null,
            "name": "test_coupled_cavity_commands",
            "fullname": "tests/benchmarks/test_benchmarks.py::test_coupled_cavity_commands",
            "params": null,
            "param": null,
            "extra_info": {},
            "options": {
                "disable_gc": false,
                "timer": "perf_counter",
                "min_rounds": 5,
                "max_time": 1.0,
                "min_time": 5e-06,
                "warmup": false
            },
            "stats": {
                "min": 4.225476329999992,
                "max": 5.394937981999988,
                "mean": 4.67826771120001,
                "stddev": 0.5642978537695161,
                "rounds": 5,
                "median": 4.299177017000034,
                "iqr": 0.9671531502500557,
                "q1": 4.270880423999984,
                "q3": 5.238033574250039,
                "iqr_outliers": 0,
                "stddev_outliers": 1,
                "outliers": "1;0",
                "ld15iqr": 4.225476329999992,
                "hd15iqr": 5.394937981999988,
                "ops": 0.21375433423913498,
                "total": 23.39133855600005,
                "iterations": 1
            }
        },
        {
            "group": null,
            "name": "test_frequency_dependant_squeezing",
            "fullname": "tests/benchmarks/test_benchmarks.py::test_frequency_dependant_squeezing",
            "params": null,
            "param": null,
            "extra_info": {},
            "options": {
                "disable_gc": false,
                "timer": "perf_counter",
                "min_rounds": 5,
                "max_time": 1.0,
                "min_time": 5e-06,
                "warmup": false
            },
            "stats": {
                "min": 1.5053552580000087,
                "max": 2.8547383339999897,
                "mean": 1.7883849137999959,
                "stddev": 0.596216658806291,
                "rounds": 5,
                "median": 1.5263283289999663,
                "iqr": 0.3502677365000295,
                "q1": 1.5156913237499907,
                "q3": 1.8659590602500202,
                "iqr_outliers": 1,
                "stddev_outliers": 1,
                "outliers": "1;1",
                "ld15iqr": 1.5053552580000087,
                "hd15iqr": 2.8547383339999897,
                "ops": 0.559163741699867,
                "total": 8.94192456899998,
                "iterations": 1
            }
        },
        {
            "group": null,
            "name": "test_lock_actions",
            "fullname": "tests/benchmarks/test_benchmarks.py::test_lock_actions",
            "params": null,
            "param": null,
            "extra_info": {},
            "options": {
                "disable_gc": false,
                "timer": "perf_counter",
                "min_rounds": 5,
                "max_time": 1.0,
                "min_time": 5e-06,
                "warmup": false
            },
            "stats": {
                "min": 3.0818162380001013,
                "max": 4.3845928229999345,
                "mean": 3.349657401200011,
                "stddev": 0.5785976661428799,
                "rounds": 5,
                "median": 3.0948502080000253,
                "iqr": 0.33755727199996954,
                "q1": 3.0846578980000174,
                "q3": 3.422215169999987,
                "iqr_outliers": 1,
                "stddev_outliers": 1,
                "outliers": "1;1",
                "ld15iqr": 3.0818162380001013,
                "hd15iqr": 4.3845928229999345,
                "ops": 0.2985379936592175,
                "total": 16.748287006000055,
                "iterations": 1
            }
        }
    ],
    "datetime": "2024-09-02T04:43:30.840779",
    "version": "4.0.0"
}