{
    "machine_info": {
        "node": "runner-j1aldqxs-project-39604133-concurrent-0",
        "processor": "",
        "machine": "x86_64",
        "python_compiler": "GCC 12.2.0",
        "python_implementation": "CPython",
        "python_implementation_version": "3.13.0",
        "python_version": "3.13.0",
        "python_build": [
            "main",
            "Nov 12 2024 06:05:34"
        ],
        "release": "5.15.154+",
        "system": "Linux",
        "cpu": {
            "python_version": "3.13.0.final.0 (64 bit)",
            "cpuinfo_version": [
                9,
                0,
                0
            ],
            "cpuinfo_version_string": "9.0.0",
            "arch": "X86_64",
            "bits": 64,
            "count": 2,
            "arch_string_raw": "x86_64",
            "vendor_id_raw": "AuthenticAMD",
            "brand_raw": "AMD EPYC 7B13",
            "hz_advertised_friendly": "2.4500 GHz",
            "hz_actual_friendly": "2.4500 GHz",
            "hz_advertised": [
                2449998000,
                0
            ],
            "hz_actual": [
                2449998000,
                0
            ],
            "model": 1,
            "family": 25,
            "flags": [
                "3dnowext",
                "3dnowprefetch",
                "abm",
                "adx",
                "aes",
                "apic",
                "arat",
                "avx",
                "avx2",
                "bmi1",
                "bmi2",
                "clflush",
                "clflushopt",
                "clwb",
                "clzero",
                "cmov",
                "cmp_legacy",
                "constant_tsc",
                "cpuid",
                "cr8_legacy",
                "cx16",
                "cx8",
                "de",
                "erms",
                "extd_apicid",
                "f16c",
                "fma",
                "fpu",
                "fsgsbase",
                "fsrm",
                "fxsr",
                "fxsr_opt",
                "ht",
                "hypervisor",
                "ibpb",
                "ibrs",
                "invpcid",
                "invpcid_single",
                "lahf_lm",
                "lm",
                "mca",
                "mce",
                "misalignsse",
                "mmx",
                "mmxext",
                "movbe",
                "msr",
                "mtrr",
                "nonstop_tsc",
                "nopl",
                "npt",
                "nrip_save",
                "nx",
                "osvw",
                "osxsave",
                "pae",
                "pat",
                "pcid",
                "pclmulqdq",
                "pdpe1gb",
                "pge",
                "pni",
                "popcnt",
                "pse",
                "pse36",
                "rdpid",
                "rdrand",
                "rdrnd",
                "rdseed",
                "rdtscp",
                "rep_good",
                "sep",
                "sha",
                "sha_ni",
                "smap",
                "smep",
                "ssbd",
                "sse",
                "sse2",
                "sse4_1",
                "sse4_2",
                "sse4a",
                "ssse3",
                "stibp",
                "syscall",
                "topoext",
                "tsc",
                "tsc_adjust",
                "tsc_known_freq",
                "umip",
                "vaes",
                "vme",
                "vmmcall",
                "vpclmulqdq",
                "x2apic",
                "xgetbv1",
                "xsave",
                "xsavec",
                "xsaveerptr",
                "xsaveopt"
            ],
            "l3_cache_size": 524288,
            "l2_cache_size": 524288,
            "l1_data_cache_size": 32768,
            "l1_instruction_cache_size": 32768,
            "l2_cache_line_size": 512,
            "l2_cache_associativity": 6
        }
    },
    "commit_info": {
        "id": "409e26843ab6c03e857462d922904130f38d9c32",
        "time": "2024-11-14T15:09:49+01:00",
        "author_time": "2024-11-14T15:09:49+01:00",
        "dirty": false,
        "project": "finesse3",
        "branch": "(detached head)"
    },
    "benchmarks": [
        {
            "group": null,
            "name": "test_01_simple_cav",
            "fullname": "tests/benchmarks/test_benchmarks.py::test_01_simple_cav",
            "params": null,
            "param": null,
            "extra_info": {},
            "options": {
                "disable_gc": false,
                "timer": "perf_counter",
                "min_rounds": 5,
                "max_time": 1.0,
                "min_time": 5e-06,
                "warmup": false
            },
            "stats": {
                "min": 0.29959703999999476,
                "max": 0.5283926369999961,
                "mean": 0.3472760475999991,
                "stddev": 0.10126822297900145,
                "rounds": 5,
                "median": 0.3017346090000075,
                "iqr": 0.060126128249983424,
                "q1": 0.300931627500006,
                "q3": 0.36105775574998944,
                "iqr_outliers": 1,
                "stddev_outliers": 1,
                "outliers": "1;1",
                "ld15iqr": 0.29959703999999476,
                "hd15iqr": 0.5283926369999961,
                "ops": 2.8795536199830982,
                "total": 1.7363802379999953,
                "iterations": 1
            }
        },
        {
            "group": null,
            "name": "test_02_pdh_lock",
            "fullname": "tests/benchmarks/test_benchmarks.py::test_02_pdh_lock",
            "params": null,
            "param": null,
            "extra_info": {},
            "options": {
                "disable_gc": false,
                "timer": "perf_counter",
                "min_rounds": 5,
                "max_time": 1.0,
                "min_time": 5e-06,
                "warmup": false
            },
            "stats": {
                "min": 1.3302993730000026,
                "max": 1.6841195350000078,
                "mean": 1.4694187123999967,
                "stddev": 0.17626565999285995,
                "rounds": 5,
                "median": 1.3615791959999797,
                "iqr": 0.3176117595000001,
                "q1": 1.3321572804999988,
                "q3": 1.649769039999999,
                "iqr_outliers": 0,
                "stddev_outliers": 1,
                "outliers": "1;0",
                "ld15iqr": 1.3302993730000026,
                "hd15iqr": 1.6841195350000078,
                "ops": 0.6805412178035376,
                "total": 7.3470935619999835,
                "iterations": 1
            }
        },
        {
            "group": null,
            "name": "test_03_near_unstable",
            "fullname": "tests/benchmarks/test_benchmarks.py::test_03_near_unstable",
            "params": null,
            "param": null,
            "extra_info": {},
            "options": {
                "disable_gc": false,
                "timer": "perf_counter",
                "min_rounds": 5,
                "max_time": 1.0,
                "min_time": 5e-06,
                "warmup": false
            },
            "stats": {
                "min": 1.920000016752965e-06,
                "max": 6.197000001861852e-05,
                "mean": 2.0407567587903767e-06,
                "stddev": 6.744382634299523e-07,
                "rounds": 51895,
                "median": 1.9800000075065327e-06,
                "iqr": 4.000000330961484e-08,
                "q1": 1.9699999995737016e-06,
                "q3": 2.0100000028833165e-06,
                "iqr_outliers": 2641,
                "stddev_outliers": 585,
                "outliers": "585;2641",
                "ld15iqr": 1.920000016752965e-06,
                "hd15iqr": 2.0700000220585935e-06,
                "ops": 490014.3026318985,
                "total": 0.1059050719974266,
                "iterations": 1
            }
        },
        {
            "group": null,
            "name": "test_04_geometrical_params",
            "fullname": "tests/benchmarks/test_benchmarks.py::test_04_geometrical_params",
            "params": null,
            "param": null,
            "extra_info": {},
            "options": {
                "disable_gc": false,
                "timer": "perf_counter",
                "min_rounds": 5,
                "max_time": 1.0,
                "min_time": 5e-06,
                "warmup": false
            },
            "stats": {
                "min": 0.5275599080000006,
                "max": 0.5954814260000205,
                "mean": 0.549767176600011,
                "stddev": 0.026827626802542085,
                "rounds": 5,
                "median": 0.5424638040000218,
                "iqr": 0.02817087975001442,
                "q1": 0.5325437562499999,
                "q3": 0.5607146360000144,
                "iqr_outliers": 0,
                "stddev_outliers": 1,
                "outliers": "1;0",
                "ld15iqr": 0.5275599080000006,
                "hd15iqr": 0.5954814260000205,
                "ops": 1.8189518082625742,
                "total": 2.748835883000055,
                "iterations": 1
            }
        },
        {
            "group": null,
            "name": "test_05_modulation",
            "fullname": "tests/benchmarks/test_benchmarks.py::test_05_modulation",
            "params": null,
            "param": null,
            "extra_info": {},
            "options": {
                "disable_gc": false,
                "timer": "perf_counter",
                "min_rounds": 5,
                "max_time": 1.0,
                "min_time": 5e-06,
                "warmup": false
            },
            "stats": {
                "min": 0.13741194899998277,
                "max": 0.14319399100000396,
                "mean": 0.14044965599999923,
                "stddev": 0.0023888854794230645,
                "rounds": 7,
                "median": 0.14130962100000488,
                "iqr": 0.004366933750013402,
                "q1": 0.13818160974999216,
                "q3": 0.14254854350000556,
                "iqr_outliers": 0,
                "stddev_outliers": 2,
                "outliers": "2;0",
                "ld15iqr": 0.13741194899998277,
                "hd15iqr": 0.14319399100000396,
                "ops": 7.119988958890761,
                "total": 0.9831475919999946,
                "iterations": 1
            }
        },
        {
            "group": null,
            "name": "test_06_radiation_pressure",
            "fullname": "tests/benchmarks/test_benchmarks.py::test_06_radiation_pressure",
            "params": null,
            "param": null,
            "extra_info": {},
            "options": {
                "disable_gc": false,
                "timer": "perf_counter",
                "min_rounds": 5,
                "max_time": 1.0,
                "min_time": 5e-06,
                "warmup": false
            },
            "stats": {
                "min": 0.2762063190000106,
                "max": 0.2853481029999898,
                "mean": 0.28021400680000286,
                "stddev": 0.003351813695656438,
                "rounds": 5,
                "median": 0.2795590400000094,
                "iqr": 0.003777175000010402,
                "q1": 0.2782894297499965,
                "q3": 0.2820666047500069,
                "iqr_outliers": 0,
                "stddev_outliers": 2,
                "outliers": "2;0",
                "ld15iqr": 0.2762063190000106,
                "hd15iqr": 0.2853481029999898,
                "ops": 3.5687009775843577,
                "total": 1.4010700340000142,
                "iterations": 1
            }
        },
        {
            "group": null,
            "name": "test_07_homodyne",
            "fullname": "tests/benchmarks/test_benchmarks.py::test_07_homodyne",
            "params": null,
            "param": null,
            "extra_info": {},
            "options": {
                "disable_gc": false,
                "timer": "perf_counter",
                "min_rounds": 5,
                "max_time": 1.0,
                "min_time": 5e-06,
                "warmup": false
            },
            "stats": {
                "min": 0.09689904799998317,
                "max": 0.8332762960000082,
                "mean": 0.1781305391000018,
                "stddev": 0.23027622001378242,
                "rounds": 10,
                "median": 0.1048249060000046,
                "iqr": 0.01222942200001853,
                "q1": 0.10183431699999801,
                "q3": 0.11406373900001654,
                "iqr_outliers": 1,
                "stddev_outliers": 1,
                "outliers": "1;1",
                "ld15iqr": 0.09689904799998317,
                "hd15iqr": 0.8332762960000082,
                "ops": 5.613860515173111,
                "total": 1.7813053910000178,
                "iterations": 1
            }
        },
        {
            "group": null,
            "name": "test_08_optical_spring",
            "fullname": "tests/benchmarks/test_benchmarks.py::test_08_optical_spring",
            "params": null,
            "param": null,
            "extra_info": {},
            "options": {
                "disable_gc": false,
                "timer": "perf_counter",
                "min_rounds": 5,
                "max_time": 1.0,
                "min_time": 5e-06,
                "warmup": false
            },
            "stats": {
                "min": 0.25880175200001077,
                "max": 0.266037611999991,
                "mean": 0.2629132060000018,
                "stddev": 0.002759542970377056,
                "rounds": 5,
                "median": 0.263788452,
                "iqr": 0.0036528175000114516,
                "q1": 0.26100534199999714,
                "q3": 0.2646581595000086,
                "iqr_outliers": 0,
                "stddev_outliers": 2,
                "outliers": "2;0",
                "ld15iqr": 0.25880175200001077,
                "hd15iqr": 0.266037611999991,
                "ops": 3.8035365937456684,
                "total": 1.3145660300000088,
                "iterations": 1
            }
        },
        {
            "group": null,
            "name": "test_09_aligo_sensitivity",
            "fullname": "tests/benchmarks/test_benchmarks.py::test_09_aligo_sensitivity",
            "params": null,
            "param": null,
            "extra_info": {},
            "options": {
                "disable_gc": false,
                "timer": "perf_counter",
                "min_rounds": 5,
                "max_time": 1.0,
                "min_time": 5e-06,
                "warmup": false
            },
            "stats": {
                "min": 0.29271924100001456,
                "max": 0.29692588099999284,
                "mean": 0.29488505899999495,
                "stddev": 0.0014896018317139411,
                "rounds": 5,
                "median": 0.29490091099998494,
                "iqr": 0.001175919999980124,
                "q1": 0.29432240350000427,
                "q3": 0.2954983234999844,
                "iqr_outliers": 0,
                "stddev_outliers": 2,
                "outliers": "2;0",
                "ld15iqr": 0.29271924100001456,
                "hd15iqr": 0.29692588099999284,
                "ops": 3.3911518046766047,
                "total": 1.4744252949999748,
                "iterations": 1
            }
        },
        {
            "group": null,
            "name": "test_10_shifted_beam",
            "fullname": "tests/benchmarks/test_benchmarks.py::test_10_shifted_beam",
            "params": null,
            "param": null,
            "extra_info": {},
            "options": {
                "disable_gc": false,
                "timer": "perf_counter",
                "min_rounds": 5,
                "max_time": 1.0,
                "min_time": 5e-06,
                "warmup": false
            },
            "stats": {
                "min": 0.7846037760000115,
                "max": 0.7913848359999918,
                "mean": 0.7887536860000068,
                "stddev": 0.002549638503861419,
                "rounds": 5,
                "median": 0.7894911360000094,
                "iqr": 0.0027606174999945665,
                "q1": 0.7874765235000112,
                "q3": 0.7902371410000057,
                "iqr_outliers": 0,
                "stddev_outliers": 2,
                "outliers": "2;0",
                "ld15iqr": 0.7846037760000115,
                "hd15iqr": 0.7913848359999918,
                "ops": 1.2678229182944083,
                "total": 3.943768430000034,
                "iterations": 1
            }
        },
        {
            "group": null,
            "name": "test_angular_radiation_pressure",
            "fullname": "tests/benchmarks/test_benchmarks.py::test_angular_radiation_pressure",
            "params": null,
            "param": null,
            "extra_info": {},
            "options": {
                "disable_gc": false,
                "timer": "perf_counter",
                "min_rounds": 5,
                "max_time": 1.0,
                "min_time": 5e-06,
                "warmup": false
            },
            "stats": {
                "min": 0.3360515100000043,
                "max": 0.34354286000001366,
                "mean": 0.3398877777999985,
                "stddev": 0.0028565678612463043,
                "rounds": 5,
                "median": 0.3406342499999937,
                "iqr": 0.0039530157500067276,
                "q1": 0.3376766392499917,
                "q3": 0.3416296549999984,
                "iqr_outliers": 0,
                "stddev_outliers": 2,
                "outliers": "2;0",
                "ld15iqr": 0.3360515100000043,
                "hd15iqr": 0.34354286000001366,
                "ops": 2.9421475713917373,
                "total": 1.6994388889999925,
                "iterations": 1
            }
        },
        {
            "group": null,
            "name": "test_cavity_eigenmodes",
            "fullname": "tests/benchmarks/test_benchmarks.py::test_cavity_eigenmodes",
            "params": null,
            "param": null,
            "extra_info": {},
            "options": {
                "disable_gc": false,
                "timer": "perf_counter",
                "min_rounds": 5,
                "max_time": 1.0,
                "min_time": 5e-06,
                "warmup": false
            },
            "stats": {
                "min": 0.29295008099998654,
                "max": 1.3734862980000173,
                "mean": 0.5140182204000041,
                "stddev": 0.48049374069014705,
                "rounds": 5,
                "median": 0.30288560100001405,
                "iqr": 0.27990001425001054,
                "q1": 0.2936429609999962,
                "q3": 0.5735429752500067,
                "iqr_outliers": 1,
                "stddev_outliers": 1,
                "outliers": "1;1",
                "ld15iqr": 0.29295008099998654,
                "hd15iqr": 1.3734862980000173,
                "ops": 1.945456328808363,
                "total": 2.5700911020000206,
                "iterations": 1
            }
        },
        {
            "group": null,
            "name": "test_coupled_cavity_commands",
            "fullname": "tests/benchmarks/test_benchmarks.py::test_coupled_cavity_commands",
            "params": null,
            "param": null,
            "extra_info": {},
            "options": {
                "disable_gc": false,
                "timer": "perf_counter",
                "min_rounds": 5,
                "max_time": 1.0,
                "min_time": 5e-06,
                "warmup": false
            },
            "stats": {
                "min": 6.229859320000003,
                "max": 7.501286671000003,
                "mean": 6.558937067800002,
                "stddev": 0.5295988846519889,
                "rounds": 5,
                "median": 6.356850686000001,
                "iqr": 0.33320247524998337,
                "q1": 6.314800259500011,
                "q3": 6.648002734749994,
                "iqr_outliers": 1,
                "stddev_outliers": 1,
                "outliers": "1;1",
                "ld15iqr": 6.229859320000003,
                "hd15iqr": 7.501286671000003,
                "ops": 0.15246372844608186,
                "total": 32.79468533900001,
                "iterations": 1
            }
        },
        {
            "group": null,
            "name": "test_frequency_dependant_squeezing",
            "fullname": "tests/benchmarks/test_benchmarks.py::test_frequency_dependant_squeezing",
            "params": null,
            "param": null,
            "extra_info": {},
            "options": {
                "disable_gc": false,
                "timer": "perf_counter",
                "min_rounds": 5,
                "max_time": 1.0,
                "min_time": 5e-06,
                "warmup": false
            },
            "stats": {
                "min": 1.7279802539999878,
                "max": 1.7534097529999997,
                "mean": 1.7395220514000016,
                "stddev": 0.012190300535655141,
                "rounds": 5,
                "median": 1.7369582040000182,
                "iqr": 0.02351698475000319,
                "q1": 1.7281385257499977,
                "q3": 1.751655510500001,
                "iqr_outliers": 0,
                "stddev_outliers": 1,
                "outliers": "1;0",
                "ld15iqr": 1.7279802539999878,
                "hd15iqr": 1.7534097529999997,
                "ops": 0.574870550905164,
                "total": 8.697610257000008,
                "iterations": 1
            }
        },
        {
            "group": null,
            "name": "test_lock_actions",
            "fullname": "tests/benchmarks/test_benchmarks.py::test_lock_actions",
            "params": null,
            "param": null,
            "extra_info": {},
            "options": {
                "disable_gc": false,
                "timer": "perf_counter",
                "min_rounds": 5,
                "max_time": 1.0,
                "min_time": 5e-06,
                "warmup": false
            },
            "stats": {
                "min": 3.2170058760000018,
                "max": 3.2557947870000135,
                "mean": 3.2407909805999906,
                "stddev": 0.014675242635374298,
                "rounds": 5,
                "median": 3.24383569699998,
                "iqr": 0.016802946000005647,
                "q1": 3.2334430634999833,
                "q3": 3.250246009499989,
                "iqr_outliers": 0,
                "stddev_outliers": 2,
                "outliers": "2;0",
                "ld15iqr": 3.2170058760000018,
                "hd15iqr": 3.2557947870000135,
                "ops": 0.30856664499074327,
                "total": 16.203954902999953,
                "iterations": 1
            }
        }
    ],
    "datetime": "2024-11-14T14:16:56.228211+00:00",
    "version": "5.1.0"
}