{
    "machine_info": {
        "node": "runner-ns46nmmj-project-39604133-concurrent-0",
        "processor": "",
        "machine": "x86_64",
        "python_compiler": "GCC 12.2.0",
        "python_implementation": "CPython",
        "python_implementation_version": "3.13.2",
        "python_version": "3.13.2",
        "python_build": [
            "main",
            "Feb 25 2025 05:25:21"
        ],
        "release": "5.15.154+",
        "system": "Linux",
        "cpu": {
            "python_version": "3.13.2.final.0 (64 bit)",
            "cpuinfo_version": [
                9,
                0,
                0
            ],
            "cpuinfo_version_string": "9.0.0",
            "arch": "X86_64",
            "bits": 64,
            "count": 2,
            "arch_string_raw": "x86_64",
            "vendor_id_raw": "AuthenticAMD",
            "brand_raw": "AMD EPYC 7B13",
            "hz_advertised_friendly": "2.4500 GHz",
            "hz_actual_friendly": "2.4500 GHz",
            "hz_advertised": [
                2449998000,
                0
            ],
            "hz_actual": [
                2449998000,
                0
            ],
            "model": 1,
            "family": 25,
            "flags": [
                "3dnowext",
                "3dnowprefetch",
                "abm",
                "adx",
                "aes",
                "apic",
                "arat",
                "avx",
                "avx2",
                "bmi1",
                "bmi2",
                "clflush",
                "clflushopt",
                "clwb",
                "clzero",
                "cmov",
                "cmp_legacy",
                "constant_tsc",
                "cpuid",
                "cr8_legacy",
                "cx16",
                "cx8",
                "de",
                "erms",
                "extd_apicid",
                "f16c",
                "fma",
                "fpu",
                "fsgsbase",
                "fsrm",
                "fxsr",
                "fxsr_opt",
                "ht",
                "hypervisor",
                "ibpb",
                "ibrs",
                "invpcid",
                "invpcid_single",
                "lahf_lm",
                "lm",
                "mca",
                "mce",
                "misalignsse",
                "mmx",
                "mmxext",
                "movbe",
                "msr",
                "mtrr",
                "nonstop_tsc",
                "nopl",
                "npt",
                "nrip_save",
                "nx",
                "osvw",
                "osxsave",
                "pae",
                "pat",
                "pcid",
                "pclmulqdq",
                "pdpe1gb",
                "pge",
                "pni",
                "popcnt",
                "pse",
                "pse36",
                "rdpid",
                "rdrand",
                "rdrnd",
                "rdseed",
                "rdtscp",
                "rep_good",
                "sep",
                "sha",
                "sha_ni",
                "smap",
                "smep",
                "ssbd",
                "sse",
                "sse2",
                "sse4_1",
                "sse4_2",
                "sse4a",
                "ssse3",
                "stibp",
                "syscall",
                "topoext",
                "tsc",
                "tsc_adjust",
                "tsc_known_freq",
                "umip",
                "vaes",
                "vme",
                "vmmcall",
                "vpclmulqdq",
                "x2apic",
                "xgetbv1",
                "xsave",
                "xsavec",
                "xsaveerptr",
                "xsaveopt"
            ],
            "l3_cache_size": 524288,
            "l2_cache_size": 524288,
            "l1_data_cache_size": 32768,
            "l1_instruction_cache_size": 32768,
            "l2_cache_line_size": 512,
            "l2_cache_associativity": 6
        }
    },
    "commit_info": {
        "id": "0a05f1a0c9bee85d36218524dea710d45440e7ce",
        "time": "2025-03-10T11:19:34+01:00",
        "author_time": "2025-03-10T10:33:10+01:00",
        "dirty": false,
        "project": "finesse3",
        "branch": "(detached head)"
    },
    "benchmarks": [
        {
            "group": null,
            "name": "test_01_simple_cav",
            "fullname": "tests/benchmarks/test_benchmarks.py::test_01_simple_cav",
            "params": null,
            "param": null,
            "extra_info": {},
            "options": {
                "disable_gc": false,
                "timer": "perf_counter",
                "min_rounds": 5,
                "max_time": 1.0,
                "min_time": 5e-06,
                "warmup": false
            },
            "stats": {
                "min": 0.30423363399999914,
                "max": 0.5278986050000043,
                "mean": 0.3526611042000013,
                "stddev": 0.0980021331320072,
                "rounds": 5,
                "median": 0.3110152969999973,
                "iqr": 0.057879210999995934,
                "q1": 0.30763616875000466,
                "q3": 0.3655153797500006,
                "iqr_outliers": 1,
                "stddev_outliers": 1,
                "outliers": "1;1",
                "ld15iqr": 0.30423363399999914,
                "hd15iqr": 0.5278986050000043,
                "ops": 2.83558347685794,
                "total": 1.7633055210000066,
                "iterations": 1
            }
        },
        {
            "group": null,
            "name": "test_02_pdh_lock",
            "fullname": "tests/benchmarks/test_benchmarks.py::test_02_pdh_lock",
            "params": null,
            "param": null,
            "extra_info": {},
            "options": {
                "disable_gc": false,
                "timer": "perf_counter",
                "min_rounds": 5,
                "max_time": 1.0,
                "min_time": 5e-06,
                "warmup": false
            },
            "stats": {
                "min": 1.3562144130000036,
                "max": 1.7805925410000185,
                "mean": 1.460426358600006,
                "stddev": 0.18119692215539746,
                "rounds": 5,
                "median": 1.3769377529999929,
                "iqr": 0.15605675399999797,
                "q1": 1.3597176495000092,
                "q3": 1.5157744035000071,
                "iqr_outliers": 1,
                "stddev_outliers": 1,
                "outliers": "1;1",
                "ld15iqr": 1.3562144130000036,
                "hd15iqr": 1.7805925410000185,
                "ops": 0.6847315471343726,
                "total": 7.302131793000029,
                "iterations": 1
            }
        },
        {
            "group": null,
            "name": "test_03_near_unstable",
            "fullname": "tests/benchmarks/test_benchmarks.py::test_03_near_unstable",
            "params": null,
            "param": null,
            "extra_info": {},
            "options": {
                "disable_gc": false,
                "timer": "perf_counter",
                "min_rounds": 5,
                "max_time": 1.0,
                "min_time": 5e-06,
                "warmup": false
            },
            "stats": {
                "min": 2.069999993636884e-06,
                "max": 5.576000000928616e-05,
                "mean": 2.221575905442602e-06,
                "stddev": 6.059767524321517e-07,
                "rounds": 64936,
                "median": 2.168999998275467e-06,
                "iqr": 5.000001124244591e-08,
                "q1": 2.1399999923232826e-06,
                "q3": 2.1900000035657285e-06,
                "iqr_outliers": 2862,
                "stddev_outliers": 731,
                "outliers": "731;2862",
                "ld15iqr": 2.069999993636884e-06,
                "hd15iqr": 2.2689999923386495e-06,
                "ops": 450130.91722417256,
                "total": 0.1442602529958208,
                "iterations": 1
            }
        },
        {
            "group": null,
            "name": "test_04_geometrical_params",
            "fullname": "tests/benchmarks/test_benchmarks.py::test_04_geometrical_params",
            "params": null,
            "param": null,
            "extra_info": {},
            "options": {
                "disable_gc": false,
                "timer": "perf_counter",
                "min_rounds": 5,
                "max_time": 1.0,
                "min_time": 5e-06,
                "warmup": false
            },
            "stats": {
                "min": 0.47699415799999656,
                "max": 0.9902787940000053,
                "mean": 0.5904759767999963,
                "stddev": 0.22455061029656195,
                "rounds": 5,
                "median": 0.47859881899998413,
                "iqr": 0.16566581674997138,
                "q1": 0.4780167530000128,
                "q3": 0.6436825697499842,
                "iqr_outliers": 1,
                "stddev_outliers": 1,
                "outliers": "1;1",
                "ld15iqr": 0.47699415799999656,
                "hd15iqr": 0.9902787940000053,
                "ops": 1.6935489999430005,
                "total": 2.9523798839999813,
                "iterations": 1
            }
        },
        {
            "group": null,
            "name": "test_05_modulation",
            "fullname": "tests/benchmarks/test_benchmarks.py::test_05_modulation",
            "params": null,
            "param": null,
            "extra_info": {},
            "options": {
                "disable_gc": false,
                "timer": "perf_counter",
                "min_rounds": 5,
                "max_time": 1.0,
                "min_time": 5e-06,
                "warmup": false
            },
            "stats": {
                "min": 0.1394511350000016,
                "max": 0.1465349089999961,
                "mean": 0.1431781157142861,
                "stddev": 0.0026215933030851422,
                "rounds": 7,
                "median": 0.14377071699999533,
                "iqr": 0.004397452250003653,
                "q1": 0.14086244375000234,
                "q3": 0.145259896000006,
                "iqr_outliers": 0,
                "stddev_outliers": 3,
                "outliers": "3;0",
                "ld15iqr": 0.1394511350000016,
                "hd15iqr": 0.1465349089999961,
                "ops": 6.984307587868483,
                "total": 1.0022468100000026,
                "iterations": 1
            }
        },
        {
            "group": null,
            "name": "test_06_radiation_pressure",
            "fullname": "tests/benchmarks/test_benchmarks.py::test_06_radiation_pressure",
            "params": null,
            "param": null,
            "extra_info": {},
            "options": {
                "disable_gc": false,
                "timer": "perf_counter",
                "min_rounds": 5,
                "max_time": 1.0,
                "min_time": 5e-06,
                "warmup": false
            },
            "stats": {
                "min": 0.2877906450000012,
                "max": 0.2924427979999962,
                "mean": 0.29073662099999636,
                "stddev": 0.002345984023375027,
                "rounds": 5,
                "median": 0.2924286079999945,
                "iqr": 0.004059959750016162,
                "q1": 0.28838209574998785,
                "q3": 0.292442055500004,
                "iqr_outliers": 0,
                "stddev_outliers": 1,
                "outliers": "1;0",
                "ld15iqr": 0.2877906450000012,
                "hd15iqr": 0.2924427979999962,
                "ops": 3.4395391834729083,
                "total": 1.4536831049999819,
                "iterations": 1
            }
        },
        {
            "group": null,
            "name": "test_07_homodyne",
            "fullname": "tests/benchmarks/test_benchmarks.py::test_07_homodyne",
            "params": null,
            "param": null,
            "extra_info": {},
            "options": {
                "disable_gc": false,
                "timer": "perf_counter",
                "min_rounds": 5,
                "max_time": 1.0,
                "min_time": 5e-06,
                "warmup": false
            },
            "stats": {
                "min": 0.0958165400000155,
                "max": 0.11204204800000639,
                "mean": 0.10400775129999715,
                "stddev": 0.004784635652433167,
                "rounds": 10,
                "median": 0.10323332899999116,
                "iqr": 0.0073376130000042394,
                "q1": 0.1009413329999802,
                "q3": 0.10827894599998444,
                "iqr_outliers": 0,
                "stddev_outliers": 3,
                "outliers": "3;0",
                "ld15iqr": 0.0958165400000155,
                "hd15iqr": 0.11204204800000639,
                "ops": 9.61466801753676,
                "total": 1.0400775129999715,
                "iterations": 1
            }
        },
        {
            "group": null,
            "name": "test_08_optical_spring",
            "fullname": "tests/benchmarks/test_benchmarks.py::test_08_optical_spring",
            "params": null,
            "param": null,
            "extra_info": {},
            "options": {
                "disable_gc": false,
                "timer": "perf_counter",
                "min_rounds": 5,
                "max_time": 1.0,
                "min_time": 5e-06,
                "warmup": false
            },
            "stats": {
                "min": 0.2635806220000063,
                "max": 0.2699904540000091,
                "mean": 0.2676362136000023,
                "stddev": 0.002948407806758614,
                "rounds": 5,
                "median": 0.26918566499998065,
                "iqr": 0.0050180187500075135,
                "q1": 0.26497149775000395,
                "q3": 0.26998951650001146,
                "iqr_outliers": 0,
                "stddev_outliers": 1,
                "outliers": "1;0",
                "ld15iqr": 0.2635806220000063,
                "hd15iqr": 0.2699904540000091,
                "ops": 3.736415138104433,
                "total": 1.3381810680000115,
                "iterations": 1
            }
        },
        {
            "group": null,
            "name": "test_09_aligo_sensitivity",
            "fullname": "tests/benchmarks/test_benchmarks.py::test_09_aligo_sensitivity",
            "params": null,
            "param": null,
            "extra_info": {},
            "options": {
                "disable_gc": false,
                "timer": "perf_counter",
                "min_rounds": 5,
                "max_time": 1.0,
                "min_time": 5e-06,
                "warmup": false
            },
            "stats": {
                "min": 0.29466550500001176,
                "max": 1.1136609829999884,
                "mean": 0.4603109954000047,
                "stddev": 0.3652388938935468,
                "rounds": 5,
                "median": 0.2972743360000152,
                "iqr": 0.20767462024999617,
                "q1": 0.29568630825000497,
                "q3": 0.5033609285000011,
                "iqr_outliers": 1,
                "stddev_outliers": 1,
                "outliers": "1;1",
                "ld15iqr": 0.29466550500001176,
                "hd15iqr": 1.1136609829999884,
                "ops": 2.1724443039450145,
                "total": 2.3015549770000234,
                "iterations": 1
            }
        },
        {
            "group": null,
            "name": "test_10_shifted_beam",
            "fullname": "tests/benchmarks/test_benchmarks.py::test_10_shifted_beam",
            "params": null,
            "param": null,
            "extra_info": {},
            "options": {
                "disable_gc": false,
                "timer": "perf_counter",
                "min_rounds": 5,
                "max_time": 1.0,
                "min_time": 5e-06,
                "warmup": false
            },
            "stats": {
                "min": 0.7741915989999768,
                "max": 0.7807912819999956,
                "mean": 0.7781770985999913,
                "stddev": 0.0025596237585730737,
                "rounds": 5,
                "median": 0.779149010999987,
                "iqr": 0.003314906500023085,
                "q1": 0.7764980072499839,
                "q3": 0.7798129137500069,
                "iqr_outliers": 0,
                "stddev_outliers": 2,
                "outliers": "2;0",
                "ld15iqr": 0.7741915989999768,
                "hd15iqr": 0.7807912819999956,
                "ops": 1.2850545226775338,
                "total": 3.8908854929999563,
                "iterations": 1
            }
        },
        {
            "group": null,
            "name": "test_angular_radiation_pressure",
            "fullname": "tests/benchmarks/test_benchmarks.py::test_angular_radiation_pressure",
            "params": null,
            "param": null,
            "extra_info": {},
            "options": {
                "disable_gc": false,
                "timer": "perf_counter",
                "min_rounds": 5,
                "max_time": 1.0,
                "min_time": 5e-06,
                "warmup": false
            },
            "stats": {
                "min": 0.3401888040000074,
                "max": 0.35071326900001054,
                "mean": 0.34409830220000687,
                "stddev": 0.004400748061403036,
                "rounds": 5,
                "median": 0.34285497600001236,
                "iqr": 0.006848435250006446,
                "q1": 0.3404639647500005,
                "q3": 0.34731240000000696,
                "iqr_outliers": 0,
                "stddev_outliers": 1,
                "outliers": "1;0",
                "ld15iqr": 0.3401888040000074,
                "hd15iqr": 0.35071326900001054,
                "ops": 2.9061462774052016,
                "total": 1.7204915110000343,
                "iterations": 1
            }
        },
        {
            "group": null,
            "name": "test_cavity_eigenmodes",
            "fullname": "tests/benchmarks/test_benchmarks.py::test_cavity_eigenmodes",
            "params": null,
            "param": null,
            "extra_info": {},
            "options": {
                "disable_gc": false,
                "timer": "perf_counter",
                "min_rounds": 5,
                "max_time": 1.0,
                "min_time": 5e-06,
                "warmup": false
            },
            "stats": {
                "min": 0.2618102609999937,
                "max": 0.2865433610000139,
                "mean": 0.27791078380000156,
                "stddev": 0.00972155977887938,
                "rounds": 5,
                "median": 0.2787760779999928,
                "iqr": 0.011128777250007715,
                "q1": 0.2738888962499999,
                "q3": 0.2850176735000076,
                "iqr_outliers": 0,
                "stddev_outliers": 1,
                "outliers": "1;0",
                "ld15iqr": 0.2618102609999937,
                "hd15iqr": 0.2865433610000139,
                "ops": 3.5982770669296866,
                "total": 1.389553919000008,
                "iterations": 1
            }
        },
        {
            "group": null,
            "name": "test_coupled_cavity_commands",
            "fullname": "tests/benchmarks/test_benchmarks.py::test_coupled_cavity_commands",
            "params": null,
            "param": null,
            "extra_info": {},
            "options": {
                "disable_gc": false,
                "timer": "perf_counter",
                "min_rounds": 5,
                "max_time": 1.0,
                "min_time": 5e-06,
                "warmup": false
            },
            "stats": {
                "min": 6.153647533999987,
                "max": 7.417482750999994,
                "mean": 6.432100442599994,
                "stddev": 0.5524014467132208,
                "rounds": 5,
                "median": 6.172435411999999,
                "iqr": 0.38810304424998066,
                "q1": 6.158690957000005,
                "q3": 6.546794001249985,
                "iqr_outliers": 1,
                "stddev_outliers": 1,
                "outliers": "1;1",
                "ld15iqr": 6.153647533999987,
                "hd15iqr": 7.417482750999994,
                "ops": 0.15547020898134145,
                "total": 32.16050221299997,
                "iterations": 1
            }
        },
        {
            "group": null,
            "name": "test_frequency_dependant_squeezing",
            "fullname": "tests/benchmarks/test_benchmarks.py::test_frequency_dependant_squeezing",
            "params": null,
            "param": null,
            "extra_info": {},
            "options": {
                "disable_gc": false,
                "timer": "perf_counter",
                "min_rounds": 5,
                "max_time": 1.0,
                "min_time": 5e-06,
                "warmup": false
            },
            "stats": {
                "min": 1.7241988929999934,
                "max": 1.7633622589999902,
                "mean": 1.7390027941999904,
                "stddev": 0.01565796977322402,
                "rounds": 5,
                "median": 1.7322699339999872,
                "iqr": 0.021353196250011308,
                "q1": 1.7284621277499852,
                "q3": 1.7498153239999965,
                "iqr_outliers": 0,
                "stddev_outliers": 1,
                "outliers": "1;0",
                "ld15iqr": 1.7241988929999934,
                "hd15iqr": 1.7633622589999902,
                "ops": 0.57504220426514,
                "total": 8.695013970999952,
                "iterations": 1
            }
        },
        {
            "group": null,
            "name": "test_lock_actions",
            "fullname": "tests/benchmarks/test_benchmarks.py::test_lock_actions",
            "params": null,
            "param": null,
            "extra_info": {},
            "options": {
                "disable_gc": false,
                "timer": "perf_counter",
                "min_rounds": 5,
                "max_time": 1.0,
                "min_time": 5e-06,
                "warmup": false
            },
            "stats": {
                "min": 3.3841978370000163,
                "max": 5.190966696000004,
                "mean": 3.759603529000003,
                "stddev": 0.8003259149144937,
                "rounds": 5,
                "median": 3.408898569999991,
                "iqr": 0.4791837197500044,
                "q1": 3.387536660000002,
                "q3": 3.8667203797500065,
                "iqr_outliers": 1,
                "stddev_outliers": 1,
                "outliers": "1;1",
                "ld15iqr": 3.3841978370000163,
                "hd15iqr": 5.190966696000004,
                "ops": 0.265985493493242,
                "total": 18.798017645000016,
                "iterations": 1
            }
        }
    ],
    "datetime": "2025-03-10T10:27:47.654254+00:00",
    "version": "5.1.0"
}