{
    "machine_info": {
        "node": "runner-nthfetyx-project-39604133-concurrent-0",
        "processor": "",
        "machine": "x86_64",
        "python_compiler": "GCC 12.2.0",
        "python_implementation": "CPython",
        "python_implementation_version": "3.12.4",
        "python_version": "3.12.4",
        "python_build": [
            "main",
            "Jun  7 2024 19:06:40"
        ],
        "release": "5.15.154+",
        "system": "Linux",
        "cpu": {
            "python_version": "3.12.4.final.0 (64 bit)",
            "cpuinfo_version": [
                9,
                0,
                0
            ],
            "cpuinfo_version_string": "9.0.0",
            "arch": "X86_64",
            "bits": 64,
            "count": 2,
            "arch_string_raw": "x86_64",
            "vendor_id_raw": "AuthenticAMD",
            "brand_raw": "AMD EPYC 7B13",
            "hz_advertised_friendly": "2.4500 GHz",
            "hz_actual_friendly": "2.4500 GHz",
            "hz_advertised": [
                2449996000,
                0
            ],
            "hz_actual": [
                2449996000,
                0
            ],
            "model": 1,
            "family": 25,
            "flags": [
                "3dnowext",
                "3dnowprefetch",
                "abm",
                "adx",
                "aes",
                "apic",
                "arat",
                "avx",
                "avx2",
                "bmi1",
                "bmi2",
                "clflush",
                "clflushopt",
                "clwb",
                "clzero",
                "cmov",
                "cmp_legacy",
                "constant_tsc",
                "cpuid",
                "cr8_legacy",
                "cx16",
                "cx8",
                "de",
                "erms",
                "extd_apicid",
                "f16c",
                "fma",
                "fpu",
                "fsgsbase",
                "fsrm",
                "fxsr",
                "fxsr_opt",
                "ht",
                "hypervisor",
                "ibpb",
                "ibrs",
                "invpcid",
                "invpcid_single",
                "lahf_lm",
                "lm",
                "mca",
                "mce",
                "misalignsse",
                "mmx",
                "mmxext",
                "movbe",
                "msr",
                "mtrr",
                "nonstop_tsc",
                "nopl",
                "npt",
                "nrip_save",
                "nx",
                "osvw",
                "osxsave",
                "pae",
                "pat",
                "pcid",
                "pclmulqdq",
                "pdpe1gb",
                "pge",
                "pni",
                "popcnt",
                "pse",
                "pse36",
                "rdpid",
                "rdrand",
                "rdrnd",
                "rdseed",
                "rdtscp",
                "rep_good",
                "sep",
                "sha",
                "sha_ni",
                "smap",
                "smep",
                "ssbd",
                "sse",
                "sse2",
                "sse4_1",
                "sse4_2",
                "sse4a",
                "ssse3",
                "stibp",
                "syscall",
                "topoext",
                "tsc",
                "tsc_adjust",
                "tsc_known_freq",
                "umip",
                "vaes",
                "vme",
                "vmmcall",
                "vpclmulqdq",
                "x2apic",
                "xgetbv1",
                "xsave",
                "xsavec",
                "xsaveerptr",
                "xsaveopt"
            ],
            "l3_cache_size": 524288,
            "l2_cache_size": 524288,
            "l1_data_cache_size": 32768,
            "l1_instruction_cache_size": 32768,
            "l2_cache_line_size": 512,
            "l2_cache_associativity": 6
        }
    },
    "commit_info": {
        "id": "04e496f825b053f8555d8c82d069700cfa94536e",
        "time": "2024-06-06T11:10:20+00:00",
        "author_time": "2024-06-06T11:10:20+00:00",
        "dirty": false,
        "project": "finesse3",
        "branch": "(detached head)"
    },
    "benchmarks": [
        {
            "group": null,
            "name": "test_01_simple_cav",
            "fullname": "tests/benchmarks/test_benchmarks.py::test_01_simple_cav",
            "params": null,
            "param": null,
            "extra_info": {},
            "options": {
                "disable_gc": false,
                "timer": "perf_counter",
                "min_rounds": 5,
                "max_time": 1.0,
                "min_time": 5e-06,
                "warmup": false
            },
            "stats": {
                "min": 0.37579901799999504,
                "max": 0.5434549640000057,
                "mean": 0.413346325400002,
                "stddev": 0.07280527596102453,
                "rounds": 5,
                "median": 0.38277631100000065,
                "iqr": 0.044985736000001,
                "q1": 0.3791768800000028,
                "q3": 0.4241626160000038,
                "iqr_outliers": 1,
                "stddev_outliers": 1,
                "outliers": "1;1",
                "ld15iqr": 0.37579901799999504,
                "hd15iqr": 0.5434549640000057,
                "ops": 2.4192787949240473,
                "total": 2.06673162700001,
                "iterations": 1
            }
        },
        {
            "group": null,
            "name": "test_02_pdh_lock",
            "fullname": "tests/benchmarks/test_benchmarks.py::test_02_pdh_lock",
            "params": null,
            "param": null,
            "extra_info": {},
            "options": {
                "disable_gc": false,
                "timer": "perf_counter",
                "min_rounds": 5,
                "max_time": 1.0,
                "min_time": 5e-06,
                "warmup": false
            },
            "stats": {
                "min": 1.324838304000025,
                "max": 1.5769990869999901,
                "mean": 1.3939509524000102,
                "stddev": 0.10465805217089072,
                "rounds": 5,
                "median": 1.3453067960000027,
                "iqr": 0.09711894400000176,
                "q1": 1.3351491675000133,
                "q3": 1.432268111500015,
                "iqr_outliers": 0,
                "stddev_outliers": 1,
                "outliers": "1;0",
                "ld15iqr": 1.324838304000025,
                "hd15iqr": 1.5769990869999901,
                "ops": 0.7173853558321173,
                "total": 6.969754762000051,
                "iterations": 1
            }
        },
        {
            "group": null,
            "name": "test_03_near_unstable",
            "fullname": "tests/benchmarks/test_benchmarks.py::test_03_near_unstable",
            "params": null,
            "param": null,
            "extra_info": {},
            "options": {
                "disable_gc": false,
                "timer": "perf_counter",
                "min_rounds": 5,
                "max_time": 1.0,
                "min_time": 5e-06,
                "warmup": false
            },
            "stats": {
                "min": 1.6799999968952761e-06,
                "max": 4.5220000004064786e-05,
                "mean": 2.6062591264437463e-06,
                "stddev": 1.001733418469414e-06,
                "rounds": 44623,
                "median": 3.10000001491062e-06,
                "iqr": 1.4300000259481749e-06,
                "q1": 1.7699999830256274e-06,
                "q3": 3.2000000089738023e-06,
                "iqr_outliers": 241,
                "stddev_outliers": 410,
                "outliers": "410;241",
                "ld15iqr": 1.6799999968952761e-06,
                "hd15iqr": 5.350000009229916e-06,
                "ops": 383691.7019699821,
                "total": 0.1162991009992993,
                "iterations": 1
            }
        },
        {
            "group": null,
            "name": "test_04_geometrical_params",
            "fullname": "tests/benchmarks/test_benchmarks.py::test_04_geometrical_params",
            "params": null,
            "param": null,
            "extra_info": {},
            "options": {
                "disable_gc": false,
                "timer": "perf_counter",
                "min_rounds": 5,
                "max_time": 1.0,
                "min_time": 5e-06,
                "warmup": false
            },
            "stats": {
                "min": 0.49053383899999403,
                "max": 0.8454484949999994,
                "mean": 0.5812091175999967,
                "stddev": 0.14850522035582753,
                "rounds": 5,
                "median": 0.5268594279999945,
                "iqr": 0.09989438500002024,
                "q1": 0.5082520339999874,
                "q3": 0.6081464190000077,
                "iqr_outliers": 1,
                "stddev_outliers": 1,
                "outliers": "1;1",
                "ld15iqr": 0.49053383899999403,
                "hd15iqr": 0.8454484949999994,
                "ops": 1.7205511230266455,
                "total": 2.9060455879999836,
                "iterations": 1
            }
        },
        {
            "group": null,
            "name": "test_05_modulation",
            "fullname": "tests/benchmarks/test_benchmarks.py::test_05_modulation",
            "params": null,
            "param": null,
            "extra_info": {},
            "options": {
                "disable_gc": false,
                "timer": "perf_counter",
                "min_rounds": 5,
                "max_time": 1.0,
                "min_time": 5e-06,
                "warmup": false
            },
            "stats": {
                "min": 0.1755947800000115,
                "max": 0.5868006369999819,
                "mean": 0.2377934359999959,
                "stddev": 0.15392096960328877,
                "rounds": 7,
                "median": 0.1814004239999747,
                "iqr": 0.00509978774997677,
                "q1": 0.17736346300001316,
                "q3": 0.18246325074998992,
                "iqr_outliers": 1,
                "stddev_outliers": 1,
                "outliers": "1;1",
                "ld15iqr": 0.1755947800000115,
                "hd15iqr": 0.5868006369999819,
                "ops": 4.205330545793608,
                "total": 1.6645540519999713,
                "iterations": 1
            }
        },
        {
            "group": null,
            "name": "test_06_radiation_pressure",
            "fullname": "tests/benchmarks/test_benchmarks.py::test_06_radiation_pressure",
            "params": null,
            "param": null,
            "extra_info": {},
            "options": {
                "disable_gc": false,
                "timer": "perf_counter",
                "min_rounds": 5,
                "max_time": 1.0,
                "min_time": 5e-06,
                "warmup": false
            },
            "stats": {
                "min": 0.31273316400000795,
                "max": 0.3184467350000091,
                "mean": 0.3151517330000047,
                "stddev": 0.0024367222551456647,
                "rounds": 5,
                "median": 0.31489787699999283,
                "iqr": 0.004191347000009671,
                "q1": 0.3129321472500024,
                "q3": 0.3171234942500121,
                "iqr_outliers": 0,
                "stddev_outliers": 1,
                "outliers": "1;0",
                "ld15iqr": 0.31273316400000795,
                "hd15iqr": 0.3184467350000091,
                "ops": 3.173074729688969,
                "total": 1.5757586650000235,
                "iterations": 1
            }
        },
        {
            "group": null,
            "name": "test_07_homodyne",
            "fullname": "tests/benchmarks/test_benchmarks.py::test_07_homodyne",
            "params": null,
            "param": null,
            "extra_info": {},
            "options": {
                "disable_gc": false,
                "timer": "perf_counter",
                "min_rounds": 5,
                "max_time": 1.0,
                "min_time": 5e-06,
                "warmup": false
            },
            "stats": {
                "min": 0.11197022599998263,
                "max": 0.6015444229999787,
                "mean": 0.16381791349999447,
                "stddev": 0.15381411193386454,
                "rounds": 10,
                "median": 0.11585078699998519,
                "iqr": 0.0031326360000321074,
                "q1": 0.11383260899998504,
                "q3": 0.11696524500001715,
                "iqr_outliers": 1,
                "stddev_outliers": 1,
                "outliers": "1;1",
                "ld15iqr": 0.11197022599998263,
                "hd15iqr": 0.6015444229999787,
                "ops": 6.104338522172875,
                "total": 1.6381791349999446,
                "iterations": 1
            }
        },
        {
            "group": null,
            "name": "test_08_optical_spring",
            "fullname": "tests/benchmarks/test_benchmarks.py::test_08_optical_spring",
            "params": null,
            "param": null,
            "extra_info": {},
            "options": {
                "disable_gc": false,
                "timer": "perf_counter",
                "min_rounds": 5,
                "max_time": 1.0,
                "min_time": 5e-06,
                "warmup": false
            },
            "stats": {
                "min": 0.2864896459999784,
                "max": 0.29521992200000113,
                "mean": 0.29159254719999694,
                "stddev": 0.0032946998266441805,
                "rounds": 5,
                "median": 0.29150093499998775,
                "iqr": 0.004015512750022765,
                "q1": 0.2899880269999926,
                "q3": 0.29400353975001536,
                "iqr_outliers": 0,
                "stddev_outliers": 2,
                "outliers": "2;0",
                "ld15iqr": 0.2864896459999784,
                "hd15iqr": 0.29521992200000113,
                "ops": 3.429442931935163,
                "total": 1.4579627359999847,
                "iterations": 1
            }
        },
        {
            "group": null,
            "name": "test_09_aligo_sensitivity",
            "fullname": "tests/benchmarks/test_benchmarks.py::test_09_aligo_sensitivity",
            "params": null,
            "param": null,
            "extra_info": {},
            "options": {
                "disable_gc": false,
                "timer": "perf_counter",
                "min_rounds": 5,
                "max_time": 1.0,
                "min_time": 5e-06,
                "warmup": false
            },
            "stats": {
                "min": 0.31826124399998434,
                "max": 0.9118603130000054,
                "mean": 0.4410152969999956,
                "stddev": 0.2632330384738857,
                "rounds": 5,
                "median": 0.32569958699997414,
                "iqr": 0.15223451650000897,
                "q1": 0.32111868924999953,
                "q3": 0.4733532057500085,
                "iqr_outliers": 1,
                "stddev_outliers": 1,
                "outliers": "1;1",
                "ld15iqr": 0.31826124399998434,
                "hd15iqr": 0.9118603130000054,
                "ops": 2.2674950433749013,
                "total": 2.205076484999978,
                "iterations": 1
            }
        },
        {
            "group": null,
            "name": "test_10_shifted_beam",
            "fullname": "tests/benchmarks/test_benchmarks.py::test_10_shifted_beam",
            "params": null,
            "param": null,
            "extra_info": {},
            "options": {
                "disable_gc": false,
                "timer": "perf_counter",
                "min_rounds": 5,
                "max_time": 1.0,
                "min_time": 5e-06,
                "warmup": false
            },
            "stats": {
                "min": 0.7001165650000019,
                "max": 1.4126666020000016,
                "mean": 0.8528328745999942,
                "stddev": 0.3131752926217634,
                "rounds": 5,
                "median": 0.7226638149999758,
                "iqr": 0.1960372754999753,
                "q1": 0.7018482797500099,
                "q3": 0.8978855552499851,
                "iqr_outliers": 1,
                "stddev_outliers": 1,
                "outliers": "1;1",
                "ld15iqr": 0.7001165650000019,
                "hd15iqr": 1.4126666020000016,
                "ops": 1.172562678788657,
                "total": 4.264164372999971,
                "iterations": 1
            }
        },
        {
            "group": null,
            "name": "test_angular_radiation_pressure",
            "fullname": "tests/benchmarks/test_benchmarks.py::test_angular_radiation_pressure",
            "params": null,
            "param": null,
            "extra_info": {},
            "options": {
                "disable_gc": false,
                "timer": "perf_counter",
                "min_rounds": 5,
                "max_time": 1.0,
                "min_time": 5e-06,
                "warmup": false
            },
            "stats": {
                "min": 0.33030856600001357,
                "max": 0.3382181909999815,
                "mean": 0.3338668326000061,
                "stddev": 0.0030852598036854727,
                "rounds": 5,
                "median": 0.3340547330000163,
                "iqr": 0.004567513999987227,
                "q1": 0.3313143400000129,
                "q3": 0.33588185400000015,
                "iqr_outliers": 0,
                "stddev_outliers": 2,
                "outliers": "2;0",
                "ld15iqr": 0.33030856600001357,
                "hd15iqr": 0.3382181909999815,
                "ops": 2.9952061790997497,
                "total": 1.6693341630000305,
                "iterations": 1
            }
        },
        {
            "group": null,
            "name": "test_cavity_eigenmodes",
            "fullname": "tests/benchmarks/test_benchmarks.py::test_cavity_eigenmodes",
            "params": null,
            "param": null,
            "extra_info": {},
            "options": {
                "disable_gc": false,
                "timer": "perf_counter",
                "min_rounds": 5,
                "max_time": 1.0,
                "min_time": 5e-06,
                "warmup": false
            },
            "stats": {
                "min": 0.25486678699999743,
                "max": 1.1285563109999828,
                "mean": 0.436680703199994,
                "stddev": 0.38690776975629737,
                "rounds": 5,
                "median": 0.26389642499998445,
                "iqr": 0.23709418224999723,
                "q1": 0.25541229350000094,
                "q3": 0.4925064757499982,
                "iqr_outliers": 1,
                "stddev_outliers": 1,
                "outliers": "1;1",
                "ld15iqr": 0.25486678699999743,
                "hd15iqr": 1.1285563109999828,
                "ops": 2.2900027243521524,
                "total": 2.18340351599997,
                "iterations": 1
            }
        },
        {
            "group": null,
            "name": "test_coupled_cavity_commands",
            "fullname": "tests/benchmarks/test_benchmarks.py::test_coupled_cavity_commands",
            "params": null,
            "param": null,
            "extra_info": {},
            "options": {
                "disable_gc": false,
                "timer": "perf_counter",
                "min_rounds": 5,
                "max_time": 1.0,
                "min_time": 5e-06,
                "warmup": false
            },
            "stats": {
                "min": 4.1709232930000155,
                "max": 5.338976266000003,
                "mean": 4.630658156200002,
                "stddev": 0.571472768703099,
                "rounds": 5,
                "median": 4.288519678,
                "iqr": 1.0205708122499857,
                "q1": 4.186528867750006,
                "q3": 5.207099679999992,
                "iqr_outliers": 0,
                "stddev_outliers": 1,
                "outliers": "1;0",
                "ld15iqr": 4.1709232930000155,
                "hd15iqr": 5.338976266000003,
                "ops": 0.21595202372282588,
                "total": 23.15329078100001,
                "iterations": 1
            }
        },
        {
            "group": null,
            "name": "test_frequency_dependant_squeezing",
            "fullname": "tests/benchmarks/test_benchmarks.py::test_frequency_dependant_squeezing",
            "params": null,
            "param": null,
            "extra_info": {},
            "options": {
                "disable_gc": false,
                "timer": "perf_counter",
                "min_rounds": 5,
                "max_time": 1.0,
                "min_time": 5e-06,
                "warmup": false
            },
            "stats": {
                "min": 1.4971269540000094,
                "max": 2.691377541999998,
                "mean": 1.7482866026000068,
                "stddev": 0.5273716992557197,
                "rounds": 5,
                "median": 1.513126710000023,
                "iqr": 0.3187352057499879,
                "q1": 1.5041211367500082,
                "q3": 1.8228563424999962,
                "iqr_outliers": 1,
                "stddev_outliers": 1,
                "outliers": "1;1",
                "ld15iqr": 1.4971269540000094,
                "hd15iqr": 2.691377541999998,
                "ops": 0.5719885964422685,
                "total": 8.741433013000034,
                "iterations": 1
            }
        },
        {
            "group": null,
            "name": "test_lock_actions",
            "fullname": "tests/benchmarks/test_benchmarks.py::test_lock_actions",
            "params": null,
            "param": null,
            "extra_info": {},
            "options": {
                "disable_gc": false,
                "timer": "perf_counter",
                "min_rounds": 5,
                "max_time": 1.0,
                "min_time": 5e-06,
                "warmup": false
            },
            "stats": {
                "min": 4.809974365999977,
                "max": 6.167819710999993,
                "mean": 5.214983370599998,
                "stddev": 0.5471341350778197,
                "rounds": 5,
                "median": 5.088617723000027,
                "iqr": 0.4921021185000001,
                "q1": 4.879362595249994,
                "q3": 5.371464713749994,
                "iqr_outliers": 1,
                "stddev_outliers": 1,
                "outliers": "1;1",
                "ld15iqr": 4.809974365999977,
                "hd15iqr": 6.167819710999993,
                "ops": 0.19175516563247397,
                "total": 26.07491685299999,
                "iterations": 1
            }
        }
    ],
    "datetime": "2024-06-10T07:16:06.835941",
    "version": "4.0.0"
}