{
    "machine_info": {
        "node": "runner--azerasq-project-39604133-concurrent-0",
        "processor": "",
        "machine": "x86_64",
        "python_compiler": "GCC 12.2.0",
        "python_implementation": "CPython",
        "python_implementation_version": "3.12.7",
        "python_version": "3.12.7",
        "python_build": [
            "main",
            "Oct  1 2024 22:28:30"
        ],
        "release": "5.15.154+",
        "system": "Linux",
        "cpu": {
            "python_version": "3.12.7.final.0 (64 bit)",
            "cpuinfo_version": [
                9,
                0,
                0
            ],
            "cpuinfo_version_string": "9.0.0",
            "arch": "X86_64",
            "bits": 64,
            "count": 2,
            "arch_string_raw": "x86_64",
            "vendor_id_raw": "AuthenticAMD",
            "brand_raw": "AMD EPYC 7B13",
            "hz_advertised_friendly": "2.4500 GHz",
            "hz_actual_friendly": "2.4500 GHz",
            "hz_advertised": [
                2449998000,
                0
            ],
            "hz_actual": [
                2449998000,
                0
            ],
            "model": 1,
            "family": 25,
            "flags": [
                "3dnowext",
                "3dnowprefetch",
                "abm",
                "adx",
                "aes",
                "apic",
                "arat",
                "avx",
                "avx2",
                "bmi1",
                "bmi2",
                "clflush",
                "clflushopt",
                "clwb",
                "clzero",
                "cmov",
                "cmp_legacy",
                "constant_tsc",
                "cpuid",
                "cr8_legacy",
                "cx16",
                "cx8",
                "de",
                "erms",
                "extd_apicid",
                "f16c",
                "fma",
                "fpu",
                "fsgsbase",
                "fsrm",
                "fxsr",
                "fxsr_opt",
                "ht",
                "hypervisor",
                "ibpb",
                "ibrs",
                "invpcid",
                "invpcid_single",
                "lahf_lm",
                "lm",
                "mca",
                "mce",
                "misalignsse",
                "mmx",
                "mmxext",
                "movbe",
                "msr",
                "mtrr",
                "nonstop_tsc",
                "nopl",
                "npt",
                "nrip_save",
                "nx",
                "osvw",
                "osxsave",
                "pae",
                "pat",
                "pcid",
                "pclmulqdq",
                "pdpe1gb",
                "pge",
                "pni",
                "popcnt",
                "pse",
                "pse36",
                "rdpid",
                "rdrand",
                "rdrnd",
                "rdseed",
                "rdtscp",
                "rep_good",
                "sep",
                "sha",
                "sha_ni",
                "smap",
                "smep",
                "ssbd",
                "sse",
                "sse2",
                "sse4_1",
                "sse4_2",
                "sse4a",
                "ssse3",
                "stibp",
                "syscall",
                "topoext",
                "tsc",
                "tsc_adjust",
                "tsc_known_freq",
                "umip",
                "vaes",
                "vme",
                "vmmcall",
                "vpclmulqdq",
                "x2apic",
                "xgetbv1",
                "xsave",
                "xsavec",
                "xsaveerptr",
                "xsaveopt"
            ],
            "l3_cache_size": 524288,
            "l2_cache_size": 524288,
            "l1_data_cache_size": 32768,
            "l1_instruction_cache_size": 32768,
            "l2_cache_line_size": 512,
            "l2_cache_associativity": 6
        }
    },
    "commit_info": {
        "id": "94c9d449f23e054561a3edf7157088bcdd82848c",
        "time": "2024-10-09T10:58:04+02:00",
        "author_time": "2024-10-09T10:58:04+02:00",
        "dirty": false,
        "project": "finesse3",
        "branch": "(detached head)"
    },
    "benchmarks": [
        {
            "group": null,
            "name": "test_01_simple_cav",
            "fullname": "tests/benchmarks/test_benchmarks.py::test_01_simple_cav",
            "params": null,
            "param": null,
            "extra_info": {},
            "options": {
                "disable_gc": false,
                "timer": "perf_counter",
                "min_rounds": 5,
                "max_time": 1.0,
                "min_time": 5e-06,
                "warmup": false
            },
            "stats": {
                "min": 0.2977985590000003,
                "max": 0.4959463659999983,
                "mean": 0.3404107155999981,
                "stddev": 0.0870431298293557,
                "rounds": 5,
                "median": 0.3022270109999994,
                "iqr": 0.056876078249999296,
                "q1": 0.2980606922499973,
                "q3": 0.3549367704999966,
                "iqr_outliers": 1,
                "stddev_outliers": 1,
                "outliers": "1;1",
                "ld15iqr": 0.2977985590000003,
                "hd15iqr": 0.4959463659999983,
                "ops": 2.937627854156791,
                "total": 1.7020535779999904,
                "iterations": 1
            }
        },
        {
            "group": null,
            "name": "test_02_pdh_lock",
            "fullname": "tests/benchmarks/test_benchmarks.py::test_02_pdh_lock",
            "params": null,
            "param": null,
            "extra_info": {},
            "options": {
                "disable_gc": false,
                "timer": "perf_counter",
                "min_rounds": 5,
                "max_time": 1.0,
                "min_time": 5e-06,
                "warmup": false
            },
            "stats": {
                "min": 1.3610905179999975,
                "max": 1.680128652999997,
                "mean": 1.4324865091999925,
                "stddev": 0.1385963623162803,
                "rounds": 5,
                "median": 1.3760285219999844,
                "iqr": 0.08723557349999567,
                "q1": 1.3659789294999953,
                "q3": 1.453214502999991,
                "iqr_outliers": 1,
                "stddev_outliers": 1,
                "outliers": "1;1",
                "ld15iqr": 1.3610905179999975,
                "hd15iqr": 1.680128652999997,
                "ops": 0.6980868535777518,
                "total": 7.1624325459999625,
                "iterations": 1
            }
        },
        {
            "group": null,
            "name": "test_03_near_unstable",
            "fullname": "tests/benchmarks/test_benchmarks.py::test_03_near_unstable",
            "params": null,
            "param": null,
            "extra_info": {},
            "options": {
                "disable_gc": false,
                "timer": "perf_counter",
                "min_rounds": 5,
                "max_time": 1.0,
                "min_time": 5e-06,
                "warmup": false
            },
            "stats": {
                "min": 2.3199999930056947e-06,
                "max": 0.00036360999999374144,
                "mean": 2.5799004519016417e-06,
                "stddev": 2.228279012504158e-06,
                "rounds": 55310,
                "median": 2.3899999916920933e-06,
                "iqr": 4.000000330961484e-08,
                "q1": 2.3700000042481406e-06,
                "q3": 2.4100000075577555e-06,
                "iqr_outliers": 4049,
                "stddev_outliers": 479,
                "outliers": "479;4049",
                "ld15iqr": 2.3199999930056947e-06,
                "hd15iqr": 2.4700000267330324e-06,
                "ops": 387611.855047702,
                "total": 0.1426942939946798,
                "iterations": 1
            }
        },
        {
            "group": null,
            "name": "test_04_geometrical_params",
            "fullname": "tests/benchmarks/test_benchmarks.py::test_04_geometrical_params",
            "params": null,
            "param": null,
            "extra_info": {},
            "options": {
                "disable_gc": false,
                "timer": "perf_counter",
                "min_rounds": 5,
                "max_time": 1.0,
                "min_time": 5e-06,
                "warmup": false
            },
            "stats": {
                "min": 0.5173211910000077,
                "max": 0.8926539489999925,
                "mean": 0.5955044232000034,
                "stddev": 0.16614562721309992,
                "rounds": 5,
                "median": 0.5224462730000141,
                "iqr": 0.09912936024999652,
                "q1": 0.5185949760000028,
                "q3": 0.6177243362499993,
                "iqr_outliers": 1,
                "stddev_outliers": 1,
                "outliers": "1;1",
                "ld15iqr": 0.5173211910000077,
                "hd15iqr": 0.8926539489999925,
                "ops": 1.6792486521366181,
                "total": 2.977522116000017,
                "iterations": 1
            }
        },
        {
            "group": null,
            "name": "test_05_modulation",
            "fullname": "tests/benchmarks/test_benchmarks.py::test_05_modulation",
            "params": null,
            "param": null,
            "extra_info": {},
            "options": {
                "disable_gc": false,
                "timer": "perf_counter",
                "min_rounds": 5,
                "max_time": 1.0,
                "min_time": 5e-06,
                "warmup": false
            },
            "stats": {
                "min": 0.13780533199999923,
                "max": 0.14011955300000523,
                "mean": 0.13897115175000252,
                "stddev": 0.0008317453683701576,
                "rounds": 8,
                "median": 0.13915699849999896,
                "iqr": 0.0014184189999895125,
                "q1": 0.1381733735000097,
                "q3": 0.1395917924999992,
                "iqr_outliers": 0,
                "stddev_outliers": 3,
                "outliers": "3;0",
                "ld15iqr": 0.13780533199999923,
                "hd15iqr": 0.14011955300000523,
                "ops": 7.195738017620494,
                "total": 1.1117692140000202,
                "iterations": 1
            }
        },
        {
            "group": null,
            "name": "test_06_radiation_pressure",
            "fullname": "tests/benchmarks/test_benchmarks.py::test_06_radiation_pressure",
            "params": null,
            "param": null,
            "extra_info": {},
            "options": {
                "disable_gc": false,
                "timer": "perf_counter",
                "min_rounds": 5,
                "max_time": 1.0,
                "min_time": 5e-06,
                "warmup": false
            },
            "stats": {
                "min": 0.27267341799998235,
                "max": 0.754195119000002,
                "mean": 0.3758366072000001,
                "stddev": 0.21157062828375153,
                "rounds": 5,
                "median": 0.28397144300001287,
                "iqr": 0.1230916662499908,
                "q1": 0.2799413800000039,
                "q3": 0.4030330462499947,
                "iqr_outliers": 1,
                "stddev_outliers": 1,
                "outliers": "1;1",
                "ld15iqr": 0.27267341799998235,
                "hd15iqr": 0.754195119000002,
                "ops": 2.660730702764815,
                "total": 1.8791830360000006,
                "iterations": 1
            }
        },
        {
            "group": null,
            "name": "test_07_homodyne",
            "fullname": "tests/benchmarks/test_benchmarks.py::test_07_homodyne",
            "params": null,
            "param": null,
            "extra_info": {},
            "options": {
                "disable_gc": false,
                "timer": "perf_counter",
                "min_rounds": 5,
                "max_time": 1.0,
                "min_time": 5e-06,
                "warmup": false
            },
            "stats": {
                "min": 0.09683827099999576,
                "max": 0.10024632900001507,
                "mean": 0.09816279460000317,
                "stddev": 0.0010973766592220558,
                "rounds": 10,
                "median": 0.09818715449999615,
                "iqr": 0.0015602709999882336,
                "q1": 0.09720377900001154,
                "q3": 0.09876404999999977,
                "iqr_outliers": 0,
                "stddev_outliers": 3,
                "outliers": "3;0",
                "ld15iqr": 0.09683827099999576,
                "hd15iqr": 0.10024632900001507,
                "ops": 10.187159035914078,
                "total": 0.9816279460000317,
                "iterations": 1
            }
        },
        {
            "group": null,
            "name": "test_08_optical_spring",
            "fullname": "tests/benchmarks/test_benchmarks.py::test_08_optical_spring",
            "params": null,
            "param": null,
            "extra_info": {},
            "options": {
                "disable_gc": false,
                "timer": "perf_counter",
                "min_rounds": 5,
                "max_time": 1.0,
                "min_time": 5e-06,
                "warmup": false
            },
            "stats": {
                "min": 0.2568698839999968,
                "max": 0.26033530200001564,
                "mean": 0.258166763600002,
                "stddev": 0.0014108507274018793,
                "rounds": 5,
                "median": 0.2574309649999975,
                "iqr": 0.0019411937499924647,
                "q1": 0.25725417650000537,
                "q3": 0.25919537024999784,
                "iqr_outliers": 0,
                "stddev_outliers": 1,
                "outliers": "1;0",
                "ld15iqr": 0.2568698839999968,
                "hd15iqr": 0.26033530200001564,
                "ops": 3.8734652983812365,
                "total": 1.29083381800001,
                "iterations": 1
            }
        },
        {
            "group": null,
            "name": "test_09_aligo_sensitivity",
            "fullname": "tests/benchmarks/test_benchmarks.py::test_09_aligo_sensitivity",
            "params": null,
            "param": null,
            "extra_info": {},
            "options": {
                "disable_gc": false,
                "timer": "perf_counter",
                "min_rounds": 5,
                "max_time": 1.0,
                "min_time": 5e-06,
                "warmup": false
            },
            "stats": {
                "min": 0.2934199600000227,
                "max": 0.30452061500000127,
                "mean": 0.29858660320001035,
                "stddev": 0.004933451322928658,
                "rounds": 5,
                "median": 0.2959325079999928,
                "iqr": 0.008248106499998187,
                "q1": 0.29526599350001703,
                "q3": 0.3035141000000152,
                "iqr_outliers": 0,
                "stddev_outliers": 2,
                "outliers": "2;0",
                "ld15iqr": 0.2934199600000227,
                "hd15iqr": 0.30452061500000127,
                "ops": 3.34911208099361,
                "total": 1.4929330160000518,
                "iterations": 1
            }
        },
        {
            "group": null,
            "name": "test_10_shifted_beam",
            "fullname": "tests/benchmarks/test_benchmarks.py::test_10_shifted_beam",
            "params": null,
            "param": null,
            "extra_info": {},
            "options": {
                "disable_gc": false,
                "timer": "perf_counter",
                "min_rounds": 5,
                "max_time": 1.0,
                "min_time": 5e-06,
                "warmup": false
            },
            "stats": {
                "min": 0.7782524289999913,
                "max": 1.4756355819999953,
                "mean": 0.9255285105999917,
                "stddev": 0.30758693687949423,
                "rounds": 5,
                "median": 0.7919028039999887,
                "iqr": 0.1809941077500241,
                "q1": 0.78443334924998,
                "q3": 0.9654274570000041,
                "iqr_outliers": 1,
                "stddev_outliers": 1,
                "outliers": "1;1",
                "ld15iqr": 0.7782524289999913,
                "hd15iqr": 1.4756355819999953,
                "ops": 1.0804637442791802,
                "total": 4.6276425529999585,
                "iterations": 1
            }
        },
        {
            "group": null,
            "name": "test_angular_radiation_pressure",
            "fullname": "tests/benchmarks/test_benchmarks.py::test_angular_radiation_pressure",
            "params": null,
            "param": null,
            "extra_info": {},
            "options": {
                "disable_gc": false,
                "timer": "perf_counter",
                "min_rounds": 5,
                "max_time": 1.0,
                "min_time": 5e-06,
                "warmup": false
            },
            "stats": {
                "min": 0.34209865999997646,
                "max": 0.34755190699999616,
                "mean": 0.34426179059998957,
                "stddev": 0.002165133319691546,
                "rounds": 5,
                "median": 0.3445259490000012,
                "iqr": 0.002940021000014781,
                "q1": 0.34241097424997946,
                "q3": 0.34535099524999424,
                "iqr_outliers": 0,
                "stddev_outliers": 1,
                "outliers": "1;0",
                "ld15iqr": 0.34209865999997646,
                "hd15iqr": 0.34755190699999616,
                "ops": 2.9047661614063256,
                "total": 1.721308952999948,
                "iterations": 1
            }
        },
        {
            "group": null,
            "name": "test_cavity_eigenmodes",
            "fullname": "tests/benchmarks/test_benchmarks.py::test_cavity_eigenmodes",
            "params": null,
            "param": null,
            "extra_info": {},
            "options": {
                "disable_gc": false,
                "timer": "perf_counter",
                "min_rounds": 5,
                "max_time": 1.0,
                "min_time": 5e-06,
                "warmup": false
            },
            "stats": {
                "min": 0.2930251389999796,
                "max": 1.1112257119999924,
                "mean": 0.4573332175999951,
                "stddev": 0.3655381648959443,
                "rounds": 5,
                "median": 0.2938190989999896,
                "iqr": 0.20614984825002125,
                "q1": 0.2931799839999911,
                "q3": 0.4993298322500124,
                "iqr_outliers": 1,
                "stddev_outliers": 1,
                "outliers": "1;1",
                "ld15iqr": 0.2930251389999796,
                "hd15iqr": 1.1112257119999924,
                "ops": 2.186589474623832,
                "total": 2.2866660879999756,
                "iterations": 1
            }
        },
        {
            "group": null,
            "name": "test_coupled_cavity_commands",
            "fullname": "tests/benchmarks/test_benchmarks.py::test_coupled_cavity_commands",
            "params": null,
            "param": null,
            "extra_info": {},
            "options": {
                "disable_gc": false,
                "timer": "perf_counter",
                "min_rounds": 5,
                "max_time": 1.0,
                "min_time": 5e-06,
                "warmup": false
            },
            "stats": {
                "min": 5.999033609999998,
                "max": 7.028156905999992,
                "mean": 6.414331718799997,
                "stddev": 0.49228038038591987,
                "rounds": 5,
                "median": 6.103449377000004,
                "iqr": 0.8545995162499906,
                "q1": 6.05398106925,
                "q3": 6.90858058549999,
                "iqr_outliers": 0,
                "stddev_outliers": 1,
                "outliers": "1;0",
                "ld15iqr": 5.999033609999998,
                "hd15iqr": 7.028156905999992,
                "ops": 0.15590088630263133,
                "total": 32.071658593999985,
                "iterations": 1
            }
        },
        {
            "group": null,
            "name": "test_frequency_dependant_squeezing",
            "fullname": "tests/benchmarks/test_benchmarks.py::test_frequency_dependant_squeezing",
            "params": null,
            "param": null,
            "extra_info": {},
            "options": {
                "disable_gc": false,
                "timer": "perf_counter",
                "min_rounds": 5,
                "max_time": 1.0,
                "min_time": 5e-06,
                "warmup": false
            },
            "stats": {
                "min": 1.7003969589999883,
                "max": 2.957678721999997,
                "mean": 1.9647214555999994,
                "stddev": 0.5551686061735901,
                "rounds": 5,
                "median": 1.7228927890000136,
                "iqr": 0.32158664325000075,
                "q1": 1.712455691499997,
                "q3": 2.034042334749998,
                "iqr_outliers": 1,
                "stddev_outliers": 1,
                "outliers": "1;1",
                "ld15iqr": 1.7003969589999883,
                "hd15iqr": 2.957678721999997,
                "ops": 0.508978001512491,
                "total": 9.823607277999997,
                "iterations": 1
            }
        },
        {
            "group": null,
            "name": "test_lock_actions",
            "fullname": "tests/benchmarks/test_benchmarks.py::test_lock_actions",
            "params": null,
            "param": null,
            "extra_info": {},
            "options": {
                "disable_gc": false,
                "timer": "perf_counter",
                "min_rounds": 5,
                "max_time": 1.0,
                "min_time": 5e-06,
                "warmup": false
            },
            "stats": {
                "min": 3.161761718000008,
                "max": 4.494760434999989,
                "mean": 3.4358037698000032,
                "stddev": 0.5920193802853796,
                "rounds": 5,
                "median": 3.1763793389999933,
                "iqr": 0.34322892499999824,
                "q1": 3.16524481550001,
                "q3": 3.5084737405000084,
                "iqr_outliers": 1,
                "stddev_outliers": 1,
                "outliers": "1;1",
                "ld15iqr": 3.161761718000008,
                "hd15iqr": 4.494760434999989,
                "ops": 0.29105271051559783,
                "total": 17.179018849000016,
                "iterations": 1
            }
        }
    ],
    "datetime": "2024-10-09T09:04:58.749479",
    "version": "4.0.0"
}