{
    "machine_info": {
        "node": "runner-xxurkrix-project-39604133-concurrent-0",
        "processor": "",
        "machine": "x86_64",
        "python_compiler": "GCC 12.2.0",
        "python_implementation": "CPython",
        "python_implementation_version": "3.13.0",
        "python_version": "3.13.0",
        "python_build": [
            "main",
            "Nov 12 2024 06:05:34"
        ],
        "release": "5.15.154+",
        "system": "Linux",
        "cpu": {
            "python_version": "3.13.0.final.0 (64 bit)",
            "cpuinfo_version": [
                9,
                0,
                0
            ],
            "cpuinfo_version_string": "9.0.0",
            "arch": "X86_64",
            "bits": 64,
            "count": 2,
            "arch_string_raw": "x86_64",
            "vendor_id_raw": "AuthenticAMD",
            "brand_raw": "AMD EPYC 7B13",
            "hz_advertised_friendly": "2.4500 GHz",
            "hz_actual_friendly": "2.4500 GHz",
            "hz_advertised": [
                2449998000,
                0
            ],
            "hz_actual": [
                2449998000,
                0
            ],
            "model": 1,
            "family": 25,
            "flags": [
                "3dnowext",
                "3dnowprefetch",
                "abm",
                "adx",
                "aes",
                "apic",
                "arat",
                "avx",
                "avx2",
                "bmi1",
                "bmi2",
                "clflush",
                "clflushopt",
                "clwb",
                "clzero",
                "cmov",
                "cmp_legacy",
                "constant_tsc",
                "cpuid",
                "cr8_legacy",
                "cx16",
                "cx8",
                "de",
                "erms",
                "extd_apicid",
                "f16c",
                "fma",
                "fpu",
                "fsgsbase",
                "fsrm",
                "fxsr",
                "fxsr_opt",
                "ht",
                "hypervisor",
                "ibpb",
                "ibrs",
                "invpcid",
                "invpcid_single",
                "lahf_lm",
                "lm",
                "mca",
                "mce",
                "misalignsse",
                "mmx",
                "mmxext",
                "movbe",
                "msr",
                "mtrr",
                "nonstop_tsc",
                "nopl",
                "npt",
                "nrip_save",
                "nx",
                "osvw",
                "osxsave",
                "pae",
                "pat",
                "pcid",
                "pclmulqdq",
                "pdpe1gb",
                "pge",
                "pni",
                "popcnt",
                "pse",
                "pse36",
                "rdpid",
                "rdrand",
                "rdrnd",
                "rdseed",
                "rdtscp",
                "rep_good",
                "sep",
                "sha",
                "sha_ni",
                "smap",
                "smep",
                "ssbd",
                "sse",
                "sse2",
                "sse4_1",
                "sse4_2",
                "sse4a",
                "ssse3",
                "stibp",
                "syscall",
                "topoext",
                "tsc",
                "tsc_adjust",
                "tsc_known_freq",
                "umip",
                "vaes",
                "vme",
                "vmmcall",
                "vpclmulqdq",
                "x2apic",
                "xgetbv1",
                "xsave",
                "xsavec",
                "xsaveerptr",
                "xsaveopt"
            ],
            "l3_cache_size": 524288,
            "l2_cache_size": 524288,
            "l1_data_cache_size": 32768,
            "l1_instruction_cache_size": 32768,
            "l2_cache_line_size": 512,
            "l2_cache_associativity": 6
        }
    },
    "commit_info": {
        "id": "97211bc0db6bb59c075c36f68825efa6eba7b741",
        "time": "2024-11-14T10:52:20+01:00",
        "author_time": "2024-11-14T10:52:20+01:00",
        "dirty": false,
        "project": "finesse3",
        "branch": "(detached head)"
    },
    "benchmarks": [
        {
            "group": null,
            "name": "test_01_simple_cav",
            "fullname": "tests/benchmarks/test_benchmarks.py::test_01_simple_cav",
            "params": null,
            "param": null,
            "extra_info": {},
            "options": {
                "disable_gc": false,
                "timer": "perf_counter",
                "min_rounds": 5,
                "max_time": 1.0,
                "min_time": 5e-06,
                "warmup": false
            },
            "stats": {
                "min": 0.3149460719999979,
                "max": 0.5540232780000025,
                "mean": 0.36891431220000187,
                "stddev": 0.10367076010692973,
                "rounds": 5,
                "median": 0.328813046999997,
                "iqr": 0.06801266399999761,
                "q1": 0.3171607732500057,
                "q3": 0.3851734372500033,
                "iqr_outliers": 1,
                "stddev_outliers": 1,
                "outliers": "1;1",
                "ld15iqr": 0.3149460719999979,
                "hd15iqr": 0.5540232780000025,
                "ops": 2.7106565587996587,
                "total": 1.8445715610000093,
                "iterations": 1
            }
        },
        {
            "group": null,
            "name": "test_02_pdh_lock",
            "fullname": "tests/benchmarks/test_benchmarks.py::test_02_pdh_lock",
            "params": null,
            "param": null,
            "extra_info": {},
            "options": {
                "disable_gc": false,
                "timer": "perf_counter",
                "min_rounds": 5,
                "max_time": 1.0,
                "min_time": 5e-06,
                "warmup": false
            },
            "stats": {
                "min": 1.376370967000014,
                "max": 1.7408777029999953,
                "mean": 1.5089260704000025,
                "stddev": 0.1793061817891666,
                "rounds": 5,
                "median": 1.3820906690000072,
                "iqr": 0.3052822127500079,
                "q1": 1.3789991072499959,
                "q3": 1.6842813200000037,
                "iqr_outliers": 0,
                "stddev_outliers": 1,
                "outliers": "1;0",
                "ld15iqr": 1.376370967000014,
                "hd15iqr": 1.7408777029999953,
                "ops": 0.662722991945463,
                "total": 7.544630352000013,
                "iterations": 1
            }
        },
        {
            "group": null,
            "name": "test_03_near_unstable",
            "fullname": "tests/benchmarks/test_benchmarks.py::test_03_near_unstable",
            "params": null,
            "param": null,
            "extra_info": {},
            "options": {
                "disable_gc": false,
                "timer": "perf_counter",
                "min_rounds": 5,
                "max_time": 1.0,
                "min_time": 5e-06,
                "warmup": false
            },
            "stats": {
                "min": 1.94899999428344e-06,
                "max": 8.378000001130204e-05,
                "mean": 2.0960320916273765e-06,
                "stddev": 7.35661239595517e-07,
                "rounds": 52163,
                "median": 2.029999990327269e-06,
                "iqr": 5.900000132896821e-08,
                "q1": 2.0100000028833165e-06,
                "q3": 2.0690000042122847e-06,
                "iqr_outliers": 2314,
                "stddev_outliers": 1008,
                "outliers": "1008;2314",
                "ld15iqr": 1.94899999428344e-06,
                "hd15iqr": 2.1599999797672353e-06,
                "ops": 477091.9319386908,
                "total": 0.10933532199555884,
                "iterations": 1
            }
        },
        {
            "group": null,
            "name": "test_04_geometrical_params",
            "fullname": "tests/benchmarks/test_benchmarks.py::test_04_geometrical_params",
            "params": null,
            "param": null,
            "extra_info": {},
            "options": {
                "disable_gc": false,
                "timer": "perf_counter",
                "min_rounds": 5,
                "max_time": 1.0,
                "min_time": 5e-06,
                "warmup": false
            },
            "stats": {
                "min": 0.5230627389999825,
                "max": 0.548927257999992,
                "mean": 0.5317851851999876,
                "stddev": 0.010742780194218376,
                "rounds": 5,
                "median": 0.5277294469999845,
                "iqr": 0.015065121249996594,
                "q1": 0.5236686197499907,
                "q3": 0.5387337409999873,
                "iqr_outliers": 0,
                "stddev_outliers": 1,
                "outliers": "1;0",
                "ld15iqr": 0.5230627389999825,
                "hd15iqr": 0.548927257999992,
                "ops": 1.8804585532482099,
                "total": 2.658925925999938,
                "iterations": 1
            }
        },
        {
            "group": null,
            "name": "test_05_modulation",
            "fullname": "tests/benchmarks/test_benchmarks.py::test_05_modulation",
            "params": null,
            "param": null,
            "extra_info": {},
            "options": {
                "disable_gc": false,
                "timer": "perf_counter",
                "min_rounds": 5,
                "max_time": 1.0,
                "min_time": 5e-06,
                "warmup": false
            },
            "stats": {
                "min": 0.13793614900001216,
                "max": 0.15440724000001183,
                "mean": 0.1464892890000036,
                "stddev": 0.006103298609717442,
                "rounds": 7,
                "median": 0.14350545900001066,
                "iqr": 0.008866534750026744,
                "q1": 0.14294115399998475,
                "q3": 0.1518076887500115,
                "iqr_outliers": 0,
                "stddev_outliers": 2,
                "outliers": "2;0",
                "ld15iqr": 0.13793614900001216,
                "hd15iqr": 0.15440724000001183,
                "ops": 6.826437665350232,
                "total": 1.0254250230000252,
                "iterations": 1
            }
        },
        {
            "group": null,
            "name": "test_06_radiation_pressure",
            "fullname": "tests/benchmarks/test_benchmarks.py::test_06_radiation_pressure",
            "params": null,
            "param": null,
            "extra_info": {},
            "options": {
                "disable_gc": false,
                "timer": "perf_counter",
                "min_rounds": 5,
                "max_time": 1.0,
                "min_time": 5e-06,
                "warmup": false
            },
            "stats": {
                "min": 0.2788301820000072,
                "max": 0.2949574160000168,
                "mean": 0.285447608000004,
                "stddev": 0.006034206177651417,
                "rounds": 5,
                "median": 0.28554719100000625,
                "iqr": 0.006824782249985617,
                "q1": 0.2812747777500064,
                "q3": 0.28809955999999204,
                "iqr_outliers": 0,
                "stddev_outliers": 2,
                "outliers": "2;0",
                "ld15iqr": 0.2788301820000072,
                "hd15iqr": 0.2949574160000168,
                "ops": 3.503269853990109,
                "total": 1.4272380400000202,
                "iterations": 1
            }
        },
        {
            "group": null,
            "name": "test_07_homodyne",
            "fullname": "tests/benchmarks/test_benchmarks.py::test_07_homodyne",
            "params": null,
            "param": null,
            "extra_info": {},
            "options": {
                "disable_gc": false,
                "timer": "perf_counter",
                "min_rounds": 5,
                "max_time": 1.0,
                "min_time": 5e-06,
                "warmup": false
            },
            "stats": {
                "min": 0.09983851500001606,
                "max": 0.8650479169999983,
                "mean": 0.18098888830000134,
                "stddev": 0.24037258526999938,
                "rounds": 10,
                "median": 0.10554498850000016,
                "iqr": 0.005420431000004555,
                "q1": 0.10244746199998644,
                "q3": 0.107867892999991,
                "iqr_outliers": 1,
                "stddev_outliers": 1,
                "outliers": "1;1",
                "ld15iqr": 0.09983851500001606,
                "hd15iqr": 0.8650479169999983,
                "ops": 5.525201073904782,
                "total": 1.8098888830000135,
                "iterations": 1
            }
        },
        {
            "group": null,
            "name": "test_08_optical_spring",
            "fullname": "tests/benchmarks/test_benchmarks.py::test_08_optical_spring",
            "params": null,
            "param": null,
            "extra_info": {},
            "options": {
                "disable_gc": false,
                "timer": "perf_counter",
                "min_rounds": 5,
                "max_time": 1.0,
                "min_time": 5e-06,
                "warmup": false
            },
            "stats": {
                "min": 0.26000102300000094,
                "max": 0.2728609960000199,
                "mean": 0.26712164060000987,
                "stddev": 0.005509921659946682,
                "rounds": 5,
                "median": 0.2696554960000128,
                "iqr": 0.009092705750013863,
                "q1": 0.26197040750000156,
                "q3": 0.2710631132500154,
                "iqr_outliers": 0,
                "stddev_outliers": 2,
                "outliers": "2;0",
                "ld15iqr": 0.26000102300000094,
                "hd15iqr": 0.2728609960000199,
                "ops": 3.7436128265527095,
                "total": 1.3356082030000493,
                "iterations": 1
            }
        },
        {
            "group": null,
            "name": "test_09_aligo_sensitivity",
            "fullname": "tests/benchmarks/test_benchmarks.py::test_09_aligo_sensitivity",
            "params": null,
            "param": null,
            "extra_info": {},
            "options": {
                "disable_gc": false,
                "timer": "perf_counter",
                "min_rounds": 5,
                "max_time": 1.0,
                "min_time": 5e-06,
                "warmup": false
            },
            "stats": {
                "min": 0.29646265200000244,
                "max": 0.3052005129999884,
                "mean": 0.3005486709999957,
                "stddev": 0.00413518598000505,
                "rounds": 5,
                "median": 0.298855709999998,
                "iqr": 0.007650985749982908,
                "q1": 0.2972165827500035,
                "q3": 0.3048675684999864,
                "iqr_outliers": 0,
                "stddev_outliers": 2,
                "outliers": "2;0",
                "ld15iqr": 0.29646265200000244,
                "hd15iqr": 0.3052005129999884,
                "ops": 3.3272481181592526,
                "total": 1.5027433549999785,
                "iterations": 1
            }
        },
        {
            "group": null,
            "name": "test_10_shifted_beam",
            "fullname": "tests/benchmarks/test_benchmarks.py::test_10_shifted_beam",
            "params": null,
            "param": null,
            "extra_info": {},
            "options": {
                "disable_gc": false,
                "timer": "perf_counter",
                "min_rounds": 5,
                "max_time": 1.0,
                "min_time": 5e-06,
                "warmup": false
            },
            "stats": {
                "min": 0.7952738900000043,
                "max": 0.8121962069999995,
                "mean": 0.8044089632000123,
                "stddev": 0.0063073900342921286,
                "rounds": 5,
                "median": 0.8048107140000127,
                "iqr": 0.008260112500003913,
                "q1": 0.8004652077500154,
                "q3": 0.8087253202500193,
                "iqr_outliers": 0,
                "stddev_outliers": 2,
                "outliers": "2;0",
                "ld15iqr": 0.7952738900000043,
                "hd15iqr": 0.8121962069999995,
                "ops": 1.243148753616455,
                "total": 4.0220448160000615,
                "iterations": 1
            }
        },
        {
            "group": null,
            "name": "test_angular_radiation_pressure",
            "fullname": "tests/benchmarks/test_benchmarks.py::test_angular_radiation_pressure",
            "params": null,
            "param": null,
            "extra_info": {},
            "options": {
                "disable_gc": false,
                "timer": "perf_counter",
                "min_rounds": 5,
                "max_time": 1.0,
                "min_time": 5e-06,
                "warmup": false
            },
            "stats": {
                "min": 0.34202036900001076,
                "max": 0.3496552500000121,
                "mean": 0.3446535812000036,
                "stddev": 0.0029302595007482217,
                "rounds": 5,
                "median": 0.3438634030000003,
                "iqr": 0.00267747774996252,
                "q1": 0.3430190450000197,
                "q3": 0.3456965227499822,
                "iqr_outliers": 0,
                "stddev_outliers": 1,
                "outliers": "1;0",
                "ld15iqr": 0.34202036900001076,
                "hd15iqr": 0.3496552500000121,
                "ops": 2.9014641209246474,
                "total": 1.723267906000018,
                "iterations": 1
            }
        },
        {
            "group": null,
            "name": "test_cavity_eigenmodes",
            "fullname": "tests/benchmarks/test_benchmarks.py::test_cavity_eigenmodes",
            "params": null,
            "param": null,
            "extra_info": {},
            "options": {
                "disable_gc": false,
                "timer": "perf_counter",
                "min_rounds": 5,
                "max_time": 1.0,
                "min_time": 5e-06,
                "warmup": false
            },
            "stats": {
                "min": 0.30788855899999135,
                "max": 1.439372351000003,
                "mean": 0.5410505847999957,
                "stddev": 0.5022051488332682,
                "rounds": 5,
                "median": 0.31792720699999677,
                "iqr": 0.2864530132499894,
                "q1": 0.3152054097499999,
                "q3": 0.6016584229999893,
                "iqr_outliers": 1,
                "stddev_outliers": 1,
                "outliers": "1;1",
                "ld15iqr": 0.30788855899999135,
                "hd15iqr": 1.439372351000003,
                "ops": 1.8482560191107809,
                "total": 2.7052529239999785,
                "iterations": 1
            }
        },
        {
            "group": null,
            "name": "test_coupled_cavity_commands",
            "fullname": "tests/benchmarks/test_benchmarks.py::test_coupled_cavity_commands",
            "params": null,
            "param": null,
            "extra_info": {},
            "options": {
                "disable_gc": false,
                "timer": "perf_counter",
                "min_rounds": 5,
                "max_time": 1.0,
                "min_time": 5e-06,
                "warmup": false
            },
            "stats": {
                "min": 6.272223438999987,
                "max": 7.7069233119999865,
                "mean": 6.63924568139999,
                "stddev": 0.6003191847230392,
                "rounds": 5,
                "median": 6.409727431999983,
                "iqr": 0.4189361152499913,
                "q1": 6.340683120249999,
                "q3": 6.75961923549999,
                "iqr_outliers": 1,
                "stddev_outliers": 1,
                "outliers": "1;1",
                "ld15iqr": 6.272223438999987,
                "hd15iqr": 7.7069233119999865,
                "ops": 0.15061952034724738,
                "total": 33.19622840699995,
                "iterations": 1
            }
        },
        {
            "group": null,
            "name": "test_frequency_dependant_squeezing",
            "fullname": "tests/benchmarks/test_benchmarks.py::test_frequency_dependant_squeezing",
            "params": null,
            "param": null,
            "extra_info": {},
            "options": {
                "disable_gc": false,
                "timer": "perf_counter",
                "min_rounds": 5,
                "max_time": 1.0,
                "min_time": 5e-06,
                "warmup": false
            },
            "stats": {
                "min": 1.7277843279999843,
                "max": 1.7940625779999948,
                "mean": 1.7665262138000002,
                "stddev": 0.025191159104180492,
                "rounds": 5,
                "median": 1.772449684999998,
                "iqr": 0.03266070300001189,
                "q1": 1.7507759410000006,
                "q3": 1.7834366440000124,
                "iqr_outliers": 0,
                "stddev_outliers": 2,
                "outliers": "2;0",
                "ld15iqr": 1.7277843279999843,
                "hd15iqr": 1.7940625779999948,
                "ops": 0.5660827403454634,
                "total": 8.832631069000001,
                "iterations": 1
            }
        },
        {
            "group": null,
            "name": "test_lock_actions",
            "fullname": "tests/benchmarks/test_benchmarks.py::test_lock_actions",
            "params": null,
            "param": null,
            "extra_info": {},
            "options": {
                "disable_gc": false,
                "timer": "perf_counter",
                "min_rounds": 5,
                "max_time": 1.0,
                "min_time": 5e-06,
                "warmup": false
            },
            "stats": {
                "min": 3.214416521000004,
                "max": 3.2346138229999895,
                "mean": 3.223870187800003,
                "stddev": 0.0073811211173895495,
                "rounds": 5,
                "median": 3.2248807920000218,
                "iqr": 0.00831137625000622,
                "q1": 3.219013030999996,
                "q3": 3.227324407250002,
                "iqr_outliers": 0,
                "stddev_outliers": 2,
                "outliers": "2;0",
                "ld15iqr": 3.214416521000004,
                "hd15iqr": 3.2346138229999895,
                "ops": 0.310186186709462,
                "total": 16.119350939000014,
                "iterations": 1
            }
        }
    ],
    "datetime": "2024-11-14T09:59:09.474273+00:00",
    "version": "5.1.0"
}