{
    "machine_info": {
        "node": "runner-ns46nmmj-project-39604133-concurrent-0",
        "processor": "",
        "machine": "x86_64",
        "python_compiler": "GCC 12.2.0",
        "python_implementation": "CPython",
        "python_implementation_version": "3.12.2",
        "python_version": "3.12.2",
        "python_build": [
            "main",
            "Mar 12 2024 11:02:14"
        ],
        "release": "5.4.109+",
        "system": "Linux",
        "cpu": {
            "python_version": "3.12.2.final.0 (64 bit)",
            "cpuinfo_version": [
                9,
                0,
                0
            ],
            "cpuinfo_version_string": "9.0.0",
            "arch": "X86_64",
            "bits": 64,
            "count": 2,
            "arch_string_raw": "x86_64",
            "vendor_id_raw": "AuthenticAMD",
            "brand_raw": "AMD EPYC 7B12",
            "hz_advertised_friendly": "2.2500 GHz",
            "hz_actual_friendly": "2.2500 GHz",
            "hz_advertised": [
                2249998000,
                0
            ],
            "hz_actual": [
                2249998000,
                0
            ],
            "model": 49,
            "family": 23,
            "flags": [
                "3dnowext",
                "3dnowprefetch",
                "abm",
                "adx",
                "aes",
                "apic",
                "arat",
                "avx",
                "avx2",
                "bmi1",
                "bmi2",
                "clflush",
                "clflushopt",
                "clwb",
                "clzero",
                "cmov",
                "cmp_legacy",
                "constant_tsc",
                "cpuid",
                "cr8_legacy",
                "cx16",
                "cx8",
                "de",
                "extd_apicid",
                "f16c",
                "fma",
                "fpu",
                "fsgsbase",
                "fxsr",
                "fxsr_opt",
                "ht",
                "hypervisor",
                "ibpb",
                "ibrs",
                "lahf_lm",
                "lm",
                "mca",
                "mce",
                "misalignsse",
                "mmx",
                "mmxext",
                "movbe",
                "msr",
                "mtrr",
                "nonstop_tsc",
                "nopl",
                "npt",
                "nrip_save",
                "nx",
                "osvw",
                "osxsave",
                "pae",
                "pat",
                "pclmulqdq",
                "pdpe1gb",
                "pge",
                "pni",
                "popcnt",
                "pse",
                "pse36",
                "rdpid",
                "rdrand",
                "rdrnd",
                "rdseed",
                "rdtscp",
                "rep_good",
                "sep",
                "sha",
                "sha_ni",
                "smap",
                "smep",
                "ssbd",
                "sse",
                "sse2",
                "sse4_1",
                "sse4_2",
                "sse4a",
                "ssse3",
                "stibp",
                "syscall",
                "topoext",
                "tsc",
                "tsc_adjust",
                "tsc_known_freq",
                "umip",
                "vme",
                "vmmcall",
                "x2apic",
                "xgetbv1",
                "xsave",
                "xsavec",
                "xsaveerptr",
                "xsaveopt"
            ],
            "l3_cache_size": 524288,
            "l2_cache_size": 524288,
            "l1_data_cache_size": 32768,
            "l1_instruction_cache_size": 32768,
            "l2_cache_line_size": 512,
            "l2_cache_associativity": 6
        }
    },
    "commit_info": {
        "id": "152260afc58bae8a67be8d4fa22cf28615b3c8d1",
        "time": "2024-03-26T15:50:31+00:00",
        "author_time": "2024-03-26T15:50:31+00:00",
        "dirty": false,
        "project": "finesse3",
        "branch": "(detached head)"
    },
    "benchmarks": [
        {
            "group": null,
            "name": "test_01_simple_cav",
            "fullname": "tests/benchmarks/test_benchmarks.py::test_01_simple_cav",
            "params": null,
            "param": null,
            "extra_info": {},
            "options": {
                "disable_gc": false,
                "timer": "perf_counter",
                "min_rounds": 5,
                "max_time": 1.0,
                "min_time": 5e-06,
                "warmup": false
            },
            "stats": {
                "min": 0.35430709099999547,
                "max": 0.548084572999997,
                "mean": 0.4218097314000005,
                "stddev": 0.0928103102615224,
                "rounds": 5,
                "median": 0.3561246360000041,
                "iqr": 0.15244666725000044,
                "q1": 0.35552525825000103,
                "q3": 0.5079719255000015,
                "iqr_outliers": 0,
                "stddev_outliers": 1,
                "outliers": "1;0",
                "ld15iqr": 0.35430709099999547,
                "hd15iqr": 0.548084572999997,
                "ops": 2.3707371489058984,
                "total": 2.1090486570000024,
                "iterations": 1
            }
        },
        {
            "group": null,
            "name": "test_02_pdh_lock",
            "fullname": "tests/benchmarks/test_benchmarks.py::test_02_pdh_lock",
            "params": null,
            "param": null,
            "extra_info": {},
            "options": {
                "disable_gc": false,
                "timer": "perf_counter",
                "min_rounds": 5,
                "max_time": 1.0,
                "min_time": 5e-06,
                "warmup": false
            },
            "stats": {
                "min": 1.2952684010000013,
                "max": 1.5727311410000056,
                "mean": 1.394488840400004,
                "stddev": 0.1340001760153263,
                "rounds": 5,
                "median": 1.2998740290000086,
                "iqr": 0.22356554925000083,
                "q1": 1.298431154750002,
                "q3": 1.5219967040000029,
                "iqr_outliers": 0,
                "stddev_outliers": 1,
                "outliers": "1;0",
                "ld15iqr": 1.2952684010000013,
                "hd15iqr": 1.5727311410000056,
                "ops": 0.7171086429871706,
                "total": 6.97244420200002,
                "iterations": 1
            }
        },
        {
            "group": null,
            "name": "test_03_near_unstable",
            "fullname": "tests/benchmarks/test_benchmarks.py::test_03_near_unstable",
            "params": null,
            "param": null,
            "extra_info": {},
            "options": {
                "disable_gc": false,
                "timer": "perf_counter",
                "min_rounds": 5,
                "max_time": 1.0,
                "min_time": 5e-06,
                "warmup": false
            },
            "stats": {
                "min": 1.720000000204891e-06,
                "max": 4.070999999328251e-05,
                "mean": 2.5501562146621667e-06,
                "stddev": 1.0544096528258754e-06,
                "rounds": 54822,
                "median": 2.0399999982601003e-06,
                "iqr": 1.370000006772898e-06,
                "q1": 1.8000000068241206e-06,
                "q3": 3.1700000135970186e-06,
                "iqr_outliers": 315,
                "stddev_outliers": 1125,
                "outliers": "1125;315",
                "ld15iqr": 1.720000000204891e-06,
                "hd15iqr": 5.239999993023048e-06,
                "ops": 392132.8404316892,
                "total": 0.1398046640002093,
                "iterations": 1
            }
        },
        {
            "group": null,
            "name": "test_04_geometrical_params",
            "fullname": "tests/benchmarks/test_benchmarks.py::test_04_geometrical_params",
            "params": null,
            "param": null,
            "extra_info": {},
            "options": {
                "disable_gc": false,
                "timer": "perf_counter",
                "min_rounds": 5,
                "max_time": 1.0,
                "min_time": 5e-06,
                "warmup": false
            },
            "stats": {
                "min": 0.4871975630000094,
                "max": 0.8265952510000005,
                "mean": 0.557109951000001,
                "stddev": 0.15066790234743335,
                "rounds": 5,
                "median": 0.48953552199999706,
                "iqr": 0.08897033824999667,
                "q1": 0.48807196475000225,
                "q3": 0.5770423029999989,
                "iqr_outliers": 1,
                "stddev_outliers": 1,
                "outliers": "1;1",
                "ld15iqr": 0.4871975630000094,
                "hd15iqr": 0.8265952510000005,
                "ops": 1.7949778104035303,
                "total": 2.7855497550000052,
                "iterations": 1
            }
        },
        {
            "group": null,
            "name": "test_05_modulation",
            "fullname": "tests/benchmarks/test_benchmarks.py::test_05_modulation",
            "params": null,
            "param": null,
            "extra_info": {},
            "options": {
                "disable_gc": false,
                "timer": "perf_counter",
                "min_rounds": 5,
                "max_time": 1.0,
                "min_time": 5e-06,
                "warmup": false
            },
            "stats": {
                "min": 0.1723854759999881,
                "max": 0.1769384129999878,
                "mean": 0.1746866852000039,
                "stddev": 0.0018093239300391018,
                "rounds": 5,
                "median": 0.17514283900001715,
                "iqr": 0.0027943602499860276,
                "q1": 0.17313081775001393,
                "q3": 0.17592517799999996,
                "iqr_outliers": 0,
                "stddev_outliers": 2,
                "outliers": "2;0",
                "ld15iqr": 0.1723854759999881,
                "hd15iqr": 0.1769384129999878,
                "ops": 5.72453475120368,
                "total": 0.8734334260000196,
                "iterations": 1
            }
        },
        {
            "group": null,
            "name": "test_06_radiation_pressure",
            "fullname": "tests/benchmarks/test_benchmarks.py::test_06_radiation_pressure",
            "params": null,
            "param": null,
            "extra_info": {},
            "options": {
                "disable_gc": false,
                "timer": "perf_counter",
                "min_rounds": 5,
                "max_time": 1.0,
                "min_time": 5e-06,
                "warmup": false
            },
            "stats": {
                "min": 0.2283415950000176,
                "max": 0.23251633099999935,
                "mean": 0.23092840720000254,
                "stddev": 0.0017169228950663382,
                "rounds": 5,
                "median": 0.23092752700000574,
                "iqr": 0.002572811750006565,
                "q1": 0.22989205349999509,
                "q3": 0.23246486525000165,
                "iqr_outliers": 0,
                "stddev_outliers": 1,
                "outliers": "1;0",
                "ld15iqr": 0.2283415950000176,
                "hd15iqr": 0.23251633099999935,
                "ops": 4.330346413959889,
                "total": 1.1546420360000127,
                "iterations": 1
            }
        },
        {
            "group": null,
            "name": "test_07_homodyne",
            "fullname": "tests/benchmarks/test_benchmarks.py::test_07_homodyne",
            "params": null,
            "param": null,
            "extra_info": {},
            "options": {
                "disable_gc": false,
                "timer": "perf_counter",
                "min_rounds": 5,
                "max_time": 1.0,
                "min_time": 5e-06,
                "warmup": false
            },
            "stats": {
                "min": 0.10815316899999061,
                "max": 0.5665180839999948,
                "mean": 0.15682071930000632,
                "stddev": 0.14397364138385854,
                "rounds": 10,
                "median": 0.11101660200002073,
                "iqr": 0.005158103000013625,
                "q1": 0.10937937799999986,
                "q3": 0.11453748100001349,
                "iqr_outliers": 1,
                "stddev_outliers": 1,
                "outliers": "1;1",
                "ld15iqr": 0.10815316899999061,
                "hd15iqr": 0.5665180839999948,
                "ops": 6.376708412406573,
                "total": 1.5682071930000632,
                "iterations": 1
            }
        },
        {
            "group": null,
            "name": "test_08_optical_spring",
            "fullname": "tests/benchmarks/test_benchmarks.py::test_08_optical_spring",
            "params": null,
            "param": null,
            "extra_info": {},
            "options": {
                "disable_gc": false,
                "timer": "perf_counter",
                "min_rounds": 5,
                "max_time": 1.0,
                "min_time": 5e-06,
                "warmup": false
            },
            "stats": {
                "min": 0.2880486059999896,
                "max": 0.29849759200001813,
                "mean": 0.2904992239999956,
                "stddev": 0.004488559724670557,
                "rounds": 5,
                "median": 0.28847867899997937,
                "iqr": 0.0031990367500185357,
                "q1": 0.2882704724999883,
                "q3": 0.2914695092500068,
                "iqr_outliers": 1,
                "stddev_outliers": 1,
                "outliers": "1;1",
                "ld15iqr": 0.2880486059999896,
                "hd15iqr": 0.29849759200001813,
                "ops": 3.442349987138056,
                "total": 1.452496119999978,
                "iterations": 1
            }
        },
        {
            "group": null,
            "name": "test_09_aligo_sensitivity",
            "fullname": "tests/benchmarks/test_benchmarks.py::test_09_aligo_sensitivity",
            "params": null,
            "param": null,
            "extra_info": {},
            "options": {
                "disable_gc": false,
                "timer": "perf_counter",
                "min_rounds": 5,
                "max_time": 1.0,
                "min_time": 5e-06,
                "warmup": false
            },
            "stats": {
                "min": 0.3213618899999915,
                "max": 0.9289148719999787,
                "mean": 0.44637771919998953,
                "stddev": 0.26976668606009774,
                "rounds": 5,
                "median": 0.32836690799999246,
                "iqr": 0.15613140499998224,
                "q1": 0.32318573999999956,
                "q3": 0.4793171449999818,
                "iqr_outliers": 1,
                "stddev_outliers": 1,
                "outliers": "1;1",
                "ld15iqr": 0.3213618899999915,
                "hd15iqr": 0.9289148719999787,
                "ops": 2.2402551852100223,
                "total": 2.2318885959999477,
                "iterations": 1
            }
        },
        {
            "group": null,
            "name": "test_10_shifted_beam",
            "fullname": "tests/benchmarks/test_benchmarks.py::test_10_shifted_beam",
            "params": null,
            "param": null,
            "extra_info": {},
            "options": {
                "disable_gc": false,
                "timer": "perf_counter",
                "min_rounds": 5,
                "max_time": 1.0,
                "min_time": 5e-06,
                "warmup": false
            },
            "stats": {
                "min": 0.7200661370000034,
                "max": 0.7466963749999991,
                "mean": 0.7362109302000022,
                "stddev": 0.01133288260032567,
                "rounds": 5,
                "median": 0.7390706900000055,
                "iqr": 0.018799266749979893,
                "q1": 0.7271537240000114,
                "q3": 0.7459529907499913,
                "iqr_outliers": 0,
                "stddev_outliers": 1,
                "outliers": "1;0",
                "ld15iqr": 0.7200661370000034,
                "hd15iqr": 0.7466963749999991,
                "ops": 1.3583063752236546,
                "total": 3.681054651000011,
                "iterations": 1
            }
        },
        {
            "group": null,
            "name": "test_angular_radiation_pressure",
            "fullname": "tests/benchmarks/test_benchmarks.py::test_angular_radiation_pressure",
            "params": null,
            "param": null,
            "extra_info": {},
            "options": {
                "disable_gc": false,
                "timer": "perf_counter",
                "min_rounds": 5,
                "max_time": 1.0,
                "min_time": 5e-06,
                "warmup": false
            },
            "stats": {
                "min": 0.3375759099999982,
                "max": 0.34669865899999763,
                "mean": 0.3409757003999971,
                "stddev": 0.003538588295467586,
                "rounds": 5,
                "median": 0.34037839100000156,
                "iqr": 0.00438323724998213,
                "q1": 0.33842728075000394,
                "q3": 0.3428105179999861,
                "iqr_outliers": 0,
                "stddev_outliers": 1,
                "outliers": "1;0",
                "ld15iqr": 0.3375759099999982,
                "hd15iqr": 0.34669865899999763,
                "ops": 2.9327603076316127,
                "total": 1.7048785019999855,
                "iterations": 1
            }
        },
        {
            "group": null,
            "name": "test_cavity_eigenmodes",
            "fullname": "tests/benchmarks/test_benchmarks.py::test_cavity_eigenmodes",
            "params": null,
            "param": null,
            "extra_info": {},
            "options": {
                "disable_gc": false,
                "timer": "perf_counter",
                "min_rounds": 5,
                "max_time": 1.0,
                "min_time": 5e-06,
                "warmup": false
            },
            "stats": {
                "min": 0.2671238659999915,
                "max": 1.1609238300000015,
                "mean": 0.4523474583999928,
                "stddev": 0.3961394769175286,
                "rounds": 5,
                "median": 0.2772397569999896,
                "iqr": 0.22790765724999318,
                "q1": 0.2732208229999955,
                "q3": 0.5011284802499887,
                "iqr_outliers": 1,
                "stddev_outliers": 1,
                "outliers": "1;1",
                "ld15iqr": 0.2671238659999915,
                "hd15iqr": 1.1609238300000015,
                "ops": 2.210689993787342,
                "total": 2.261737291999964,
                "iterations": 1
            }
        },
        {
            "group": null,
            "name": "test_coupled_cavity_commands",
            "fullname": "tests/benchmarks/test_benchmarks.py::test_coupled_cavity_commands",
            "params": null,
            "param": null,
            "extra_info": {},
            "options": {
                "disable_gc": false,
                "timer": "perf_counter",
                "min_rounds": 5,
                "max_time": 1.0,
                "min_time": 5e-06,
                "warmup": false
            },
            "stats": {
                "min": 4.475255059999995,
                "max": 5.793147462999997,
                "mean": 4.963877173799989,
                "stddev": 0.6327678921736145,
                "rounds": 5,
                "median": 4.559197593999983,
                "iqr": 1.0864341462499993,
                "q1": 4.487252899249988,
                "q3": 5.573687045499987,
                "iqr_outliers": 0,
                "stddev_outliers": 1,
                "outliers": "1;0",
                "ld15iqr": 4.475255059999995,
                "hd15iqr": 5.793147462999997,
                "ops": 0.20145542788168377,
                "total": 24.819385868999944,
                "iterations": 1
            }
        },
        {
            "group": null,
            "name": "test_frequency_dependant_squeezing",
            "fullname": "tests/benchmarks/test_benchmarks.py::test_frequency_dependant_squeezing",
            "params": null,
            "param": null,
            "extra_info": {},
            "options": {
                "disable_gc": false,
                "timer": "perf_counter",
                "min_rounds": 5,
                "max_time": 1.0,
                "min_time": 5e-06,
                "warmup": false
            },
            "stats": {
                "min": 1.5112605460000168,
                "max": 3.0559938629999976,
                "mean": 1.8364392230000022,
                "stddev": 0.6819930569079956,
                "rounds": 5,
                "median": 1.5357084539999732,
                "iqr": 0.4153683177499943,
                "q1": 1.5179351117500133,
                "q3": 1.9333034295000076,
                "iqr_outliers": 1,
                "stddev_outliers": 1,
                "outliers": "1;1",
                "ld15iqr": 1.5112605460000168,
                "hd15iqr": 3.0559938629999976,
                "ops": 0.5445320419406,
                "total": 9.18219611500001,
                "iterations": 1
            }
        },
        {
            "group": null,
            "name": "test_lock_actions",
            "fullname": "tests/benchmarks/test_benchmarks.py::test_lock_actions",
            "params": null,
            "param": null,
            "extra_info": {},
            "options": {
                "disable_gc": false,
                "timer": "perf_counter",
                "min_rounds": 5,
                "max_time": 1.0,
                "min_time": 5e-06,
                "warmup": false
            },
            "stats": {
                "min": 5.020132880000006,
                "max": 6.72393664400002,
                "mean": 5.552099026800005,
                "stddev": 0.6742649251524392,
                "rounds": 5,
                "median": 5.29709105500001,
                "iqr": 0.587688063750015,
                "q1": 5.1939151167499915,
                "q3": 5.7816031805000065,
                "iqr_outliers": 1,
                "stddev_outliers": 1,
                "outliers": "1;1",
                "ld15iqr": 5.020132880000006,
                "hd15iqr": 6.72393664400002,
                "ops": 0.1801120612534099,
                "total": 27.760495134000024,
                "iterations": 1
            }
        }
    ],
    "datetime": "2024-03-26T16:02:32.136224",
    "version": "4.0.0"
}