{
    "machine_info": {
        "node": "runner-j2nyww-s-project-39604133-concurrent-0",
        "processor": "",
        "machine": "x86_64",
        "python_compiler": "GCC 12.2.0",
        "python_implementation": "CPython",
        "python_implementation_version": "3.12.3",
        "python_version": "3.12.3",
        "python_build": [
            "main",
            "Apr 10 2024 14:35:18"
        ],
        "release": "5.4.109+",
        "system": "Linux",
        "cpu": {
            "python_version": "3.12.3.final.0 (64 bit)",
            "cpuinfo_version": [
                9,
                0,
                0
            ],
            "cpuinfo_version_string": "9.0.0",
            "arch": "X86_64",
            "bits": 64,
            "count": 2,
            "arch_string_raw": "x86_64",
            "vendor_id_raw": "AuthenticAMD",
            "brand_raw": "AMD EPYC 7B12",
            "hz_advertised_friendly": "2.2500 GHz",
            "hz_actual_friendly": "2.2500 GHz",
            "hz_advertised": [
                2249998000,
                0
            ],
            "hz_actual": [
                2249998000,
                0
            ],
            "model": 49,
            "family": 23,
            "flags": [
                "3dnowext",
                "3dnowprefetch",
                "abm",
                "adx",
                "aes",
                "apic",
                "arat",
                "avx",
                "avx2",
                "bmi1",
                "bmi2",
                "clflush",
                "clflushopt",
                "clwb",
                "clzero",
                "cmov",
                "cmp_legacy",
                "constant_tsc",
                "cpuid",
                "cr8_legacy",
                "cx16",
                "cx8",
                "de",
                "extd_apicid",
                "f16c",
                "fma",
                "fpu",
                "fsgsbase",
                "fxsr",
                "fxsr_opt",
                "ht",
                "hypervisor",
                "ibpb",
                "ibrs",
                "lahf_lm",
                "lm",
                "mca",
                "mce",
                "misalignsse",
                "mmx",
                "mmxext",
                "movbe",
                "msr",
                "mtrr",
                "nonstop_tsc",
                "nopl",
                "npt",
                "nrip_save",
                "nx",
                "osvw",
                "osxsave",
                "pae",
                "pat",
                "pclmulqdq",
                "pdpe1gb",
                "pge",
                "pni",
                "popcnt",
                "pse",
                "pse36",
                "rdpid",
                "rdrand",
                "rdrnd",
                "rdseed",
                "rdtscp",
                "rep_good",
                "sep",
                "sha",
                "sha_ni",
                "smap",
                "smep",
                "ssbd",
                "sse",
                "sse2",
                "sse4_1",
                "sse4_2",
                "sse4a",
                "ssse3",
                "stibp",
                "syscall",
                "topoext",
                "tsc",
                "tsc_adjust",
                "tsc_known_freq",
                "umip",
                "vme",
                "vmmcall",
                "x2apic",
                "xgetbv1",
                "xsave",
                "xsavec",
                "xsaveerptr",
                "xsaveopt"
            ],
            "l3_cache_size": 524288,
            "l2_cache_size": 524288,
            "l1_data_cache_size": 32768,
            "l1_instruction_cache_size": 32768,
            "l2_cache_line_size": 512,
            "l2_cache_associativity": 6
        }
    },
    "commit_info": {
        "id": "b520b04ccda4e1ae726da7582715fdfe82a87b09",
        "time": "2024-04-18T15:51:13+02:00",
        "author_time": "2024-04-18T15:51:13+02:00",
        "dirty": false,
        "project": "finesse3",
        "branch": "(detached head)"
    },
    "benchmarks": [
        {
            "group": null,
            "name": "test_01_simple_cav",
            "fullname": "tests/benchmarks/test_benchmarks.py::test_01_simple_cav",
            "params": null,
            "param": null,
            "extra_info": {},
            "options": {
                "disable_gc": false,
                "timer": "perf_counter",
                "min_rounds": 5,
                "max_time": 1.0,
                "min_time": 5e-06,
                "warmup": false
            },
            "stats": {
                "min": 0.38635324899999546,
                "max": 0.6144421850000015,
                "mean": 0.4667863753999967,
                "stddev": 0.10854395767119288,
                "rounds": 5,
                "median": 0.3919885119999975,
                "iqr": 0.17903054575000965,
                "q1": 0.3885146304999907,
                "q3": 0.5675451762500003,
                "iqr_outliers": 0,
                "stddev_outliers": 1,
                "outliers": "1;0",
                "ld15iqr": 0.38635324899999546,
                "hd15iqr": 0.6144421850000015,
                "ops": 2.1423076008657795,
                "total": 2.3339318769999835,
                "iterations": 1
            }
        },
        {
            "group": null,
            "name": "test_02_pdh_lock",
            "fullname": "tests/benchmarks/test_benchmarks.py::test_02_pdh_lock",
            "params": null,
            "param": null,
            "extra_info": {},
            "options": {
                "disable_gc": false,
                "timer": "perf_counter",
                "min_rounds": 5,
                "max_time": 1.0,
                "min_time": 5e-06,
                "warmup": false
            },
            "stats": {
                "min": 1.2946921420000024,
                "max": 1.5437489730000067,
                "mean": 1.3587282297999992,
                "stddev": 0.10409943288429614,
                "rounds": 5,
                "median": 1.3218116979999905,
                "iqr": 0.0737329182500055,
                "q1": 1.3054593062499968,
                "q3": 1.3791922245000023,
                "iqr_outliers": 1,
                "stddev_outliers": 1,
                "outliers": "1;1",
                "ld15iqr": 1.2946921420000024,
                "hd15iqr": 1.5437489730000067,
                "ops": 0.7359823532533781,
                "total": 6.7936411489999955,
                "iterations": 1
            }
        },
        {
            "group": null,
            "name": "test_03_near_unstable",
            "fullname": "tests/benchmarks/test_benchmarks.py::test_03_near_unstable",
            "params": null,
            "param": null,
            "extra_info": {},
            "options": {
                "disable_gc": false,
                "timer": "perf_counter",
                "min_rounds": 5,
                "max_time": 1.0,
                "min_time": 5e-06,
                "warmup": false
            },
            "stats": {
                "min": 1.7299999939268673e-06,
                "max": 9.87309999942454e-05,
                "mean": 2.536880255350662e-06,
                "stddev": 1.1956603600994447e-06,
                "rounds": 58583,
                "median": 1.8699999912996645e-06,
                "iqr": 1.4399999912484418e-06,
                "q1": 1.810000000546097e-06,
                "q3": 3.249999991794539e-06,
                "iqr_outliers": 338,
                "stddev_outliers": 706,
                "outliers": "706;338",
                "ld15iqr": 1.7299999939268673e-06,
                "hd15iqr": 5.420000007916315e-06,
                "ops": 394184.94345204096,
                "total": 0.14861805599920785,
                "iterations": 1
            }
        },
        {
            "group": null,
            "name": "test_04_geometrical_params",
            "fullname": "tests/benchmarks/test_benchmarks.py::test_04_geometrical_params",
            "params": null,
            "param": null,
            "extra_info": {},
            "options": {
                "disable_gc": false,
                "timer": "perf_counter",
                "min_rounds": 5,
                "max_time": 1.0,
                "min_time": 5e-06,
                "warmup": false
            },
            "stats": {
                "min": 0.5217668500000059,
                "max": 0.8799321170000098,
                "mean": 0.5992843051999955,
                "stddev": 0.15724460165580875,
                "rounds": 5,
                "median": 0.5247155329999771,
                "iqr": 0.10811851824999508,
                "q1": 0.5224057464999987,
                "q3": 0.6305242647499938,
                "iqr_outliers": 1,
                "stddev_outliers": 1,
                "outliers": "1;1",
                "ld15iqr": 0.5217668500000059,
                "hd15iqr": 0.8799321170000098,
                "ops": 1.6686570819942899,
                "total": 2.9964215259999776,
                "iterations": 1
            }
        },
        {
            "group": null,
            "name": "test_05_modulation",
            "fullname": "tests/benchmarks/test_benchmarks.py::test_05_modulation",
            "params": null,
            "param": null,
            "extra_info": {},
            "options": {
                "disable_gc": false,
                "timer": "perf_counter",
                "min_rounds": 5,
                "max_time": 1.0,
                "min_time": 5e-06,
                "warmup": false
            },
            "stats": {
                "min": 0.17247855200000117,
                "max": 0.5644261129999961,
                "mean": 0.2238657672499933,
                "stddev": 0.13763500212065083,
                "rounds": 8,
                "median": 0.17522240249999754,
                "iqr": 0.005606471999996643,
                "q1": 0.17309093099999018,
                "q3": 0.17869740299998682,
                "iqr_outliers": 1,
                "stddev_outliers": 1,
                "outliers": "1;1",
                "ld15iqr": 0.17247855200000117,
                "hd15iqr": 0.5644261129999961,
                "ops": 4.466962556554211,
                "total": 1.7909261379999464,
                "iterations": 1
            }
        },
        {
            "group": null,
            "name": "test_06_radiation_pressure",
            "fullname": "tests/benchmarks/test_benchmarks.py::test_06_radiation_pressure",
            "params": null,
            "param": null,
            "extra_info": {},
            "options": {
                "disable_gc": false,
                "timer": "perf_counter",
                "min_rounds": 5,
                "max_time": 1.0,
                "min_time": 5e-06,
                "warmup": false
            },
            "stats": {
                "min": 0.23742776200001003,
                "max": 0.24399923800001488,
                "mean": 0.2398042842000052,
                "stddev": 0.002700805087429847,
                "rounds": 5,
                "median": 0.23877640099999553,
                "iqr": 0.003908531999975651,
                "q1": 0.2377808665000174,
                "q3": 0.24168939849999305,
                "iqr_outliers": 0,
                "stddev_outliers": 1,
                "outliers": "1;0",
                "ld15iqr": 0.23742776200001003,
                "hd15iqr": 0.24399923800001488,
                "ops": 4.170067283560142,
                "total": 1.199021421000026,
                "iterations": 1
            }
        },
        {
            "group": null,
            "name": "test_07_homodyne",
            "fullname": "tests/benchmarks/test_benchmarks.py::test_07_homodyne",
            "params": null,
            "param": null,
            "extra_info": {},
            "options": {
                "disable_gc": false,
                "timer": "perf_counter",
                "min_rounds": 5,
                "max_time": 1.0,
                "min_time": 5e-06,
                "warmup": false
            },
            "stats": {
                "min": 0.10688768299999651,
                "max": 0.643010481999994,
                "mean": 0.16634834340000282,
                "stddev": 0.16750614769890107,
                "rounds": 10,
                "median": 0.11369021250000344,
                "iqr": 0.0029237430000250697,
                "q1": 0.11291315099998656,
                "q3": 0.11583689400001163,
                "iqr_outliers": 2,
                "stddev_outliers": 1,
                "outliers": "1;2",
                "ld15iqr": 0.11167281300001264,
                "hd15iqr": 0.643010481999994,
                "ops": 6.011481566698807,
                "total": 1.6634834340000282,
                "iterations": 1
            }
        },
        {
            "group": null,
            "name": "test_08_optical_spring",
            "fullname": "tests/benchmarks/test_benchmarks.py::test_08_optical_spring",
            "params": null,
            "param": null,
            "extra_info": {},
            "options": {
                "disable_gc": false,
                "timer": "perf_counter",
                "min_rounds": 5,
                "max_time": 1.0,
                "min_time": 5e-06,
                "warmup": false
            },
            "stats": {
                "min": 0.29812376900000004,
                "max": 0.3017724430000044,
                "mean": 0.3002502105999952,
                "stddev": 0.0017361857888835322,
                "rounds": 5,
                "median": 0.30097240099999567,
                "iqr": 0.0032091529999931367,
                "q1": 0.2985258649999949,
                "q3": 0.30173501799998803,
                "iqr_outliers": 0,
                "stddev_outliers": 1,
                "outliers": "1;0",
                "ld15iqr": 0.29812376900000004,
                "hd15iqr": 0.3017724430000044,
                "ops": 3.330555532339787,
                "total": 1.5012510529999759,
                "iterations": 1
            }
        },
        {
            "group": null,
            "name": "test_09_aligo_sensitivity",
            "fullname": "tests/benchmarks/test_benchmarks.py::test_09_aligo_sensitivity",
            "params": null,
            "param": null,
            "extra_info": {},
            "options": {
                "disable_gc": false,
                "timer": "perf_counter",
                "min_rounds": 5,
                "max_time": 1.0,
                "min_time": 5e-06,
                "warmup": false
            },
            "stats": {
                "min": 0.32606323799998904,
                "max": 0.9858822160000216,
                "mean": 0.46030986300000337,
                "stddev": 0.29381623547759245,
                "rounds": 5,
                "median": 0.32972479099998964,
                "iqr": 0.16947476050000176,
                "q1": 0.32671045275000665,
                "q3": 0.4961852132500084,
                "iqr_outliers": 1,
                "stddev_outliers": 1,
                "outliers": "1;1",
                "ld15iqr": 0.32606323799998904,
                "hd15iqr": 0.9858822160000216,
                "ops": 2.1724496483361095,
                "total": 2.301549315000017,
                "iterations": 1
            }
        },
        {
            "group": null,
            "name": "test_10_shifted_beam",
            "fullname": "tests/benchmarks/test_benchmarks.py::test_10_shifted_beam",
            "params": null,
            "param": null,
            "extra_info": {},
            "options": {
                "disable_gc": false,
                "timer": "perf_counter",
                "min_rounds": 5,
                "max_time": 1.0,
                "min_time": 5e-06,
                "warmup": false
            },
            "stats": {
                "min": 0.7303834659999779,
                "max": 0.7437755900000127,
                "mean": 0.7358331439999972,
                "stddev": 0.005097362784426852,
                "rounds": 5,
                "median": 0.7356458330000066,
                "iqr": 0.006432772750002869,
                "q1": 0.7320638072499932,
                "q3": 0.7384965799999961,
                "iqr_outliers": 0,
                "stddev_outliers": 2,
                "outliers": "2;0",
                "ld15iqr": 0.7303834659999779,
                "hd15iqr": 0.7437755900000127,
                "ops": 1.3590037471864733,
                "total": 3.679165719999986,
                "iterations": 1
            }
        },
        {
            "group": null,
            "name": "test_angular_radiation_pressure",
            "fullname": "tests/benchmarks/test_benchmarks.py::test_angular_radiation_pressure",
            "params": null,
            "param": null,
            "extra_info": {},
            "options": {
                "disable_gc": false,
                "timer": "perf_counter",
                "min_rounds": 5,
                "max_time": 1.0,
                "min_time": 5e-06,
                "warmup": false
            },
            "stats": {
                "min": 0.35568523599999935,
                "max": 0.36348908100001154,
                "mean": 0.3607697518000009,
                "stddev": 0.0035051959248222505,
                "rounds": 5,
                "median": 0.36273950599999694,
                "iqr": 0.005616064249998942,
                "q1": 0.35781435850000065,
                "q3": 0.3634304227499996,
                "iqr_outliers": 0,
                "stddev_outliers": 1,
                "outliers": "1;0",
                "ld15iqr": 0.35568523599999935,
                "hd15iqr": 0.36348908100001154,
                "ops": 2.7718510074934657,
                "total": 1.8038487590000045,
                "iterations": 1
            }
        },
        {
            "group": null,
            "name": "test_cavity_eigenmodes",
            "fullname": "tests/benchmarks/test_benchmarks.py::test_cavity_eigenmodes",
            "params": null,
            "param": null,
            "extra_info": {},
            "options": {
                "disable_gc": false,
                "timer": "perf_counter",
                "min_rounds": 5,
                "max_time": 1.0,
                "min_time": 5e-06,
                "warmup": false
            },
            "stats": {
                "min": 0.27181384499999695,
                "max": 1.1863324480000017,
                "mean": 0.4614249646000019,
                "stddev": 0.4052917893963009,
                "rounds": 5,
                "median": 0.2838635090000139,
                "iqr": 0.2385398305000237,
                "q1": 0.2749165042499868,
                "q3": 0.5134563347500105,
                "iqr_outliers": 1,
                "stddev_outliers": 1,
                "outliers": "1;1",
                "ld15iqr": 0.27181384499999695,
                "hd15iqr": 1.1863324480000017,
                "ops": 2.1671996027932208,
                "total": 2.3071248230000094,
                "iterations": 1
            }
        },
        {
            "group": null,
            "name": "test_coupled_cavity_commands",
            "fullname": "tests/benchmarks/test_benchmarks.py::test_coupled_cavity_commands",
            "params": null,
            "param": null,
            "extra_info": {},
            "options": {
                "disable_gc": false,
                "timer": "perf_counter",
                "min_rounds": 5,
                "max_time": 1.0,
                "min_time": 5e-06,
                "warmup": false
            },
            "stats": {
                "min": 5.8053570099999945,
                "max": 7.189144899000013,
                "mean": 6.310463518799992,
                "stddev": 0.6628996686215549,
                "rounds": 5,
                "median": 5.8671676359999765,
                "iqr": 1.1192755910000258,
                "q1": 5.823667961499979,
                "q3": 6.9429435525000045,
                "iqr_outliers": 0,
                "stddev_outliers": 1,
                "outliers": "1;0",
                "ld15iqr": 5.8053570099999945,
                "hd15iqr": 7.189144899000013,
                "ops": 0.15846696475161015,
                "total": 31.55231759399996,
                "iterations": 1
            }
        },
        {
            "group": null,
            "name": "test_frequency_dependant_squeezing",
            "fullname": "tests/benchmarks/test_benchmarks.py::test_frequency_dependant_squeezing",
            "params": null,
            "param": null,
            "extra_info": {},
            "options": {
                "disable_gc": false,
                "timer": "perf_counter",
                "min_rounds": 5,
                "max_time": 1.0,
                "min_time": 5e-06,
                "warmup": false
            },
            "stats": {
                "min": 1.547320778999989,
                "max": 3.0917710829999976,
                "mean": 1.8703973586000018,
                "stddev": 0.6828850069958594,
                "rounds": 5,
                "median": 1.573728917000011,
                "iqr": 0.4012903109999968,
                "q1": 1.5564285825000042,
                "q3": 1.957718893500001,
                "iqr_outliers": 1,
                "stddev_outliers": 1,
                "outliers": "1;1",
                "ld15iqr": 1.547320778999989,
                "hd15iqr": 3.0917710829999976,
                "ops": 0.5346457507556058,
                "total": 9.351986793000009,
                "iterations": 1
            }
        },
        {
            "group": null,
            "name": "test_lock_actions",
            "fullname": "tests/benchmarks/test_benchmarks.py::test_lock_actions",
            "params": null,
            "param": null,
            "extra_info": {},
            "options": {
                "disable_gc": false,
                "timer": "perf_counter",
                "min_rounds": 5,
                "max_time": 1.0,
                "min_time": 5e-06,
                "warmup": false
            },
            "stats": {
                "min": 5.36109687299998,
                "max": 5.947152590999991,
                "mean": 5.654913762199993,
                "stddev": 0.22140499592299576,
                "rounds": 5,
                "median": 5.713672482999982,
                "iqr": 0.2937180869999949,
                "q1": 5.486414713500004,
                "q3": 5.780132800499999,
                "iqr_outliers": 0,
                "stddev_outliers": 2,
                "outliers": "2;0",
                "ld15iqr": 5.36109687299998,
                "hd15iqr": 5.947152590999991,
                "ops": 0.17683735633325715,
                "total": 28.274568810999966,
                "iterations": 1
            }
        }
    ],
    "datetime": "2024-04-18T13:58:20.665544",
    "version": "4.0.0"
}