{
    "machine_info": {
        "node": "runner-ns46nmmj-project-39604133-concurrent-0",
        "processor": "",
        "machine": "x86_64",
        "python_compiler": "GCC 12.2.0",
        "python_implementation": "CPython",
        "python_implementation_version": "3.12.5",
        "python_version": "3.12.5",
        "python_build": [
            "main",
            "Sep  5 2024 00:16:34"
        ],
        "release": "5.15.154+",
        "system": "Linux",
        "cpu": {
            "python_version": "3.12.5.final.0 (64 bit)",
            "cpuinfo_version": [
                9,
                0,
                0
            ],
            "cpuinfo_version_string": "9.0.0",
            "arch": "X86_64",
            "bits": 64,
            "count": 2,
            "arch_string_raw": "x86_64",
            "vendor_id_raw": "AuthenticAMD",
            "brand_raw": "AMD EPYC 7B13",
            "hz_advertised_friendly": "2.4500 GHz",
            "hz_actual_friendly": "2.4500 GHz",
            "hz_advertised": [
                2449998000,
                0
            ],
            "hz_actual": [
                2449998000,
                0
            ],
            "model": 1,
            "family": 25,
            "flags": [
                "3dnowext",
                "3dnowprefetch",
                "abm",
                "adx",
                "aes",
                "apic",
                "arat",
                "avx",
                "avx2",
                "bmi1",
                "bmi2",
                "clflush",
                "clflushopt",
                "clwb",
                "clzero",
                "cmov",
                "cmp_legacy",
                "constant_tsc",
                "cpuid",
                "cr8_legacy",
                "cx16",
                "cx8",
                "de",
                "erms",
                "extd_apicid",
                "f16c",
                "fma",
                "fpu",
                "fsgsbase",
                "fsrm",
                "fxsr",
                "fxsr_opt",
                "ht",
                "hypervisor",
                "ibpb",
                "ibrs",
                "invpcid",
                "invpcid_single",
                "lahf_lm",
                "lm",
                "mca",
                "mce",
                "misalignsse",
                "mmx",
                "mmxext",
                "movbe",
                "msr",
                "mtrr",
                "nonstop_tsc",
                "nopl",
                "npt",
                "nrip_save",
                "nx",
                "osvw",
                "osxsave",
                "pae",
                "pat",
                "pcid",
                "pclmulqdq",
                "pdpe1gb",
                "pge",
                "pni",
                "popcnt",
                "pse",
                "pse36",
                "rdpid",
                "rdrand",
                "rdrnd",
                "rdseed",
                "rdtscp",
                "rep_good",
                "sep",
                "sha",
                "sha_ni",
                "smap",
                "smep",
                "ssbd",
                "sse",
                "sse2",
                "sse4_1",
                "sse4_2",
                "sse4a",
                "ssse3",
                "stibp",
                "syscall",
                "topoext",
                "tsc",
                "tsc_adjust",
                "tsc_known_freq",
                "umip",
                "vaes",
                "vme",
                "vmmcall",
                "vpclmulqdq",
                "x2apic",
                "xgetbv1",
                "xsave",
                "xsavec",
                "xsaveerptr",
                "xsaveopt"
            ],
            "l3_cache_size": 524288,
            "l2_cache_size": 524288,
            "l1_data_cache_size": 32768,
            "l1_instruction_cache_size": 32768,
            "l2_cache_line_size": 512,
            "l2_cache_associativity": 6
        }
    },
    "commit_info": {
        "id": "643ef1cd0b06937413f1dc0fe90bf9e4070c659a",
        "time": "2024-09-08T15:54:59+02:00",
        "author_time": "2024-09-08T15:54:59+02:00",
        "dirty": false,
        "project": "finesse3",
        "branch": "(detached head)"
    },
    "benchmarks": [
        {
            "group": null,
            "name": "test_01_simple_cav",
            "fullname": "tests/benchmarks/test_benchmarks.py::test_01_simple_cav",
            "params": null,
            "param": null,
            "extra_info": {},
            "options": {
                "disable_gc": false,
                "timer": "perf_counter",
                "min_rounds": 5,
                "max_time": 1.0,
                "min_time": 5e-06,
                "warmup": false
            },
            "stats": {
                "min": 0.26873698199999296,
                "max": 0.4852199909999939,
                "mean": 0.31408746799999676,
                "stddev": 0.09572109909099753,
                "rounds": 5,
                "median": 0.2700378720000032,
                "iqr": 0.0595957905000013,
                "q1": 0.26936266199999537,
                "q3": 0.32895845249999667,
                "iqr_outliers": 1,
                "stddev_outliers": 1,
                "outliers": "1;1",
                "ld15iqr": 0.26873698199999296,
                "hd15iqr": 0.4852199909999939,
                "ops": 3.18382648746753,
                "total": 1.5704373399999838,
                "iterations": 1
            }
        },
        {
            "group": null,
            "name": "test_02_pdh_lock",
            "fullname": "tests/benchmarks/test_benchmarks.py::test_02_pdh_lock",
            "params": null,
            "param": null,
            "extra_info": {},
            "options": {
                "disable_gc": false,
                "timer": "perf_counter",
                "min_rounds": 5,
                "max_time": 1.0,
                "min_time": 5e-06,
                "warmup": false
            },
            "stats": {
                "min": 1.2003272150000015,
                "max": 1.4829008600000009,
                "mean": 1.3059050293999974,
                "stddev": 0.1416208284178867,
                "rounds": 5,
                "median": 1.2087634370000018,
                "iqr": 0.24807603000001066,
                "q1": 1.2004406074999885,
                "q3": 1.4485166374999991,
                "iqr_outliers": 0,
                "stddev_outliers": 1,
                "outliers": "1;0",
                "ld15iqr": 1.2003272150000015,
                "hd15iqr": 1.4829008600000009,
                "ops": 0.7657524685845291,
                "total": 6.529525146999987,
                "iterations": 1
            }
        },
        {
            "group": null,
            "name": "test_03_near_unstable",
            "fullname": "tests/benchmarks/test_benchmarks.py::test_03_near_unstable",
            "params": null,
            "param": null,
            "extra_info": {},
            "options": {
                "disable_gc": false,
                "timer": "perf_counter",
                "min_rounds": 5,
                "max_time": 1.0,
                "min_time": 5e-06,
                "warmup": false
            },
            "stats": {
                "min": 1.9499999837080395e-06,
                "max": 2.941999997574385e-05,
                "mean": 2.0633995363113443e-06,
                "stddev": 5.066297557034537e-07,
                "rounds": 62540,
                "median": 2.02900000090267e-06,
                "iqr": 4.000000330961484e-08,
                "q1": 2.0100000028833165e-06,
                "q3": 2.0500000061929313e-06,
                "iqr_outliers": 1927,
                "stddev_outliers": 477,
                "outliers": "477;1927",
                "ld15iqr": 1.950000012129749e-06,
                "hd15iqr": 2.1100000253682083e-06,
                "ops": 484637.11578982876,
                "total": 0.12904500700091148,
                "iterations": 1
            }
        },
        {
            "group": null,
            "name": "test_04_geometrical_params",
            "fullname": "tests/benchmarks/test_benchmarks.py::test_04_geometrical_params",
            "params": null,
            "param": null,
            "extra_info": {},
            "options": {
                "disable_gc": false,
                "timer": "perf_counter",
                "min_rounds": 5,
                "max_time": 1.0,
                "min_time": 5e-06,
                "warmup": false
            },
            "stats": {
                "min": 0.45558114499999647,
                "max": 0.8143095169999981,
                "mean": 0.5290553155999987,
                "stddev": 0.15948475525150266,
                "rounds": 5,
                "median": 0.4567752149999933,
                "iqr": 0.09425737125002343,
                "q1": 0.45608665999998976,
                "q3": 0.5503440312500132,
                "iqr_outliers": 1,
                "stddev_outliers": 1,
                "outliers": "1;1",
                "ld15iqr": 0.45558114499999647,
                "hd15iqr": 0.8143095169999981,
                "ops": 1.8901615209477776,
                "total": 2.6452765779999936,
                "iterations": 1
            }
        },
        {
            "group": null,
            "name": "test_05_modulation",
            "fullname": "tests/benchmarks/test_benchmarks.py::test_05_modulation",
            "params": null,
            "param": null,
            "extra_info": {},
            "options": {
                "disable_gc": false,
                "timer": "perf_counter",
                "min_rounds": 5,
                "max_time": 1.0,
                "min_time": 5e-06,
                "warmup": false
            },
            "stats": {
                "min": 0.11787836700000298,
                "max": 0.5823003129999904,
                "mean": 0.17744832187499782,
                "stddev": 0.16358842375731397,
                "rounds": 8,
                "median": 0.11961470299999633,
                "iqr": 0.001878170500006604,
                "q1": 0.11910553699999582,
                "q3": 0.12098370750000242,
                "iqr_outliers": 1,
                "stddev_outliers": 1,
                "outliers": "1;1",
                "ld15iqr": 0.11787836700000298,
                "hd15iqr": 0.5823003129999904,
                "ops": 5.635443544540493,
                "total": 1.4195865749999825,
                "iterations": 1
            }
        },
        {
            "group": null,
            "name": "test_06_radiation_pressure",
            "fullname": "tests/benchmarks/test_benchmarks.py::test_06_radiation_pressure",
            "params": null,
            "param": null,
            "extra_info": {},
            "options": {
                "disable_gc": false,
                "timer": "perf_counter",
                "min_rounds": 5,
                "max_time": 1.0,
                "min_time": 5e-06,
                "warmup": false
            },
            "stats": {
                "min": 0.2342446339999924,
                "max": 0.24189246599999592,
                "mean": 0.23738370840000017,
                "stddev": 0.002875059068790755,
                "rounds": 5,
                "median": 0.23648127399999908,
                "iqr": 0.0033959829999972158,
                "q1": 0.23568170900000496,
                "q3": 0.23907769200000217,
                "iqr_outliers": 0,
                "stddev_outliers": 2,
                "outliers": "2;0",
                "ld15iqr": 0.2342446339999924,
                "hd15iqr": 0.24189246599999592,
                "ops": 4.212589005118092,
                "total": 1.1869185420000008,
                "iterations": 1
            }
        },
        {
            "group": null,
            "name": "test_07_homodyne",
            "fullname": "tests/benchmarks/test_benchmarks.py::test_07_homodyne",
            "params": null,
            "param": null,
            "extra_info": {},
            "options": {
                "disable_gc": false,
                "timer": "perf_counter",
                "min_rounds": 5,
                "max_time": 1.0,
                "min_time": 5e-06,
                "warmup": false
            },
            "stats": {
                "min": 0.08269882899998038,
                "max": 0.0878023799999994,
                "mean": 0.08482929783332811,
                "stddev": 0.0015227956680948188,
                "rounds": 12,
                "median": 0.08445124949999183,
                "iqr": 0.0018236745000024257,
                "q1": 0.08396310499999515,
                "q3": 0.08578677949999758,
                "iqr_outliers": 0,
                "stddev_outliers": 4,
                "outliers": "4;0",
                "ld15iqr": 0.08269882899998038,
                "hd15iqr": 0.0878023799999994,
                "ops": 11.78838002366578,
                "total": 1.0179515739999374,
                "iterations": 1
            }
        },
        {
            "group": null,
            "name": "test_08_optical_spring",
            "fullname": "tests/benchmarks/test_benchmarks.py::test_08_optical_spring",
            "params": null,
            "param": null,
            "extra_info": {},
            "options": {
                "disable_gc": false,
                "timer": "perf_counter",
                "min_rounds": 5,
                "max_time": 1.0,
                "min_time": 5e-06,
                "warmup": false
            },
            "stats": {
                "min": 0.2218122110000138,
                "max": 0.24698860600000216,
                "mean": 0.2313359872000035,
                "stddev": 0.010626902406216467,
                "rounds": 5,
                "median": 0.22554183199997624,
                "iqr": 0.015921550999983936,
                "q1": 0.22401580925001952,
                "q3": 0.23993736025000345,
                "iqr_outliers": 0,
                "stddev_outliers": 1,
                "outliers": "1;0",
                "ld15iqr": 0.2218122110000138,
                "hd15iqr": 0.24698860600000216,
                "ops": 4.322716980196606,
                "total": 1.1566799360000175,
                "iterations": 1
            }
        },
        {
            "group": null,
            "name": "test_09_aligo_sensitivity",
            "fullname": "tests/benchmarks/test_benchmarks.py::test_09_aligo_sensitivity",
            "params": null,
            "param": null,
            "extra_info": {},
            "options": {
                "disable_gc": false,
                "timer": "perf_counter",
                "min_rounds": 5,
                "max_time": 1.0,
                "min_time": 5e-06,
                "warmup": false
            },
            "stats": {
                "min": 0.24912200399998596,
                "max": 0.2557312339999953,
                "mean": 0.2521013919999916,
                "stddev": 0.002992937031399559,
                "rounds": 5,
                "median": 0.25100869400000647,
                "iqr": 0.005400267500000666,
                "q1": 0.2496484064999862,
                "q3": 0.2550486739999869,
                "iqr_outliers": 0,
                "stddev_outliers": 1,
                "outliers": "1;0",
                "ld15iqr": 0.24912200399998596,
                "hd15iqr": 0.2557312339999953,
                "ops": 3.9666579865613483,
                "total": 1.260506959999958,
                "iterations": 1
            }
        },
        {
            "group": null,
            "name": "test_10_shifted_beam",
            "fullname": "tests/benchmarks/test_benchmarks.py::test_10_shifted_beam",
            "params": null,
            "param": null,
            "extra_info": {},
            "options": {
                "disable_gc": false,
                "timer": "perf_counter",
                "min_rounds": 5,
                "max_time": 1.0,
                "min_time": 5e-06,
                "warmup": false
            },
            "stats": {
                "min": 0.7202087520000191,
                "max": 1.4550930339999866,
                "mean": 0.871823102400009,
                "stddev": 0.3260780100937537,
                "rounds": 5,
                "median": 0.7284027120000189,
                "iqr": 0.1866411280000051,
                "q1": 0.7243712895000058,
                "q3": 0.9110124175000109,
                "iqr_outliers": 1,
                "stddev_outliers": 1,
                "outliers": "1;1",
                "ld15iqr": 0.7202087520000191,
                "hd15iqr": 1.4550930339999866,
                "ops": 1.1470216804844213,
                "total": 4.359115512000045,
                "iterations": 1
            }
        },
        {
            "group": null,
            "name": "test_angular_radiation_pressure",
            "fullname": "tests/benchmarks/test_benchmarks.py::test_angular_radiation_pressure",
            "params": null,
            "param": null,
            "extra_info": {},
            "options": {
                "disable_gc": false,
                "timer": "perf_counter",
                "min_rounds": 5,
                "max_time": 1.0,
                "min_time": 5e-06,
                "warmup": false
            },
            "stats": {
                "min": 0.29790303499999027,
                "max": 0.30587210500002016,
                "mean": 0.3006341431999999,
                "stddev": 0.003076787714709638,
                "rounds": 5,
                "median": 0.2996320560000072,
                "iqr": 0.002961454999990565,
                "q1": 0.2989024849999993,
                "q3": 0.30186393999998984,
                "iqr_outliers": 0,
                "stddev_outliers": 1,
                "outliers": "1;0",
                "ld15iqr": 0.29790303499999027,
                "hd15iqr": 0.30587210500002016,
                "ops": 3.3263021603462377,
                "total": 1.5031707159999996,
                "iterations": 1
            }
        },
        {
            "group": null,
            "name": "test_cavity_eigenmodes",
            "fullname": "tests/benchmarks/test_benchmarks.py::test_cavity_eigenmodes",
            "params": null,
            "param": null,
            "extra_info": {},
            "options": {
                "disable_gc": false,
                "timer": "perf_counter",
                "min_rounds": 5,
                "max_time": 1.0,
                "min_time": 5e-06,
                "warmup": false
            },
            "stats": {
                "min": 0.2579892039999834,
                "max": 1.1330195290000233,
                "mean": 0.4338551972000005,
                "stddev": 0.39084692218533934,
                "rounds": 5,
                "median": 0.2588318539999932,
                "iqr": 0.22106899950000525,
                "q1": 0.25812986649999914,
                "q3": 0.4791988660000044,
                "iqr_outliers": 1,
                "stddev_outliers": 1,
                "outliers": "1;1",
                "ld15iqr": 0.2579892039999834,
                "hd15iqr": 1.1330195290000233,
                "ops": 2.304916493921855,
                "total": 2.1692759860000024,
                "iterations": 1
            }
        },
        {
            "group": null,
            "name": "test_coupled_cavity_commands",
            "fullname": "tests/benchmarks/test_benchmarks.py::test_coupled_cavity_commands",
            "params": null,
            "param": null,
            "extra_info": {},
            "options": {
                "disable_gc": false,
                "timer": "perf_counter",
                "min_rounds": 5,
                "max_time": 1.0,
                "min_time": 5e-06,
                "warmup": false
            },
            "stats": {
                "min": 5.642159784,
                "max": 6.797243363000007,
                "mean": 6.108857603200005,
                "stddev": 0.6115980848629894,
                "rounds": 5,
                "median": 5.699923613999999,
                "iqr": 1.1237802964999801,
                "q1": 5.6448957157500175,
                "q3": 6.768676012249998,
                "iqr_outliers": 0,
                "stddev_outliers": 2,
                "outliers": "2;0",
                "ld15iqr": 5.642159784,
                "hd15iqr": 6.797243363000007,
                "ops": 0.16369672776071417,
                "total": 30.544288016000024,
                "iterations": 1
            }
        },
        {
            "group": null,
            "name": "test_frequency_dependant_squeezing",
            "fullname": "tests/benchmarks/test_benchmarks.py::test_frequency_dependant_squeezing",
            "params": null,
            "param": null,
            "extra_info": {},
            "options": {
                "disable_gc": false,
                "timer": "perf_counter",
                "min_rounds": 5,
                "max_time": 1.0,
                "min_time": 5e-06,
                "warmup": false
            },
            "stats": {
                "min": 1.465752613999996,
                "max": 2.8286339069999826,
                "mean": 1.7584811431999925,
                "stddev": 0.5984240003646109,
                "rounds": 5,
                "median": 1.5011007649999897,
                "iqr": 0.34898679324999193,
                "q1": 1.486149329749999,
                "q3": 1.835136122999991,
                "iqr_outliers": 1,
                "stddev_outliers": 1,
                "outliers": "1;1",
                "ld15iqr": 1.465752613999996,
                "hd15iqr": 2.8286339069999826,
                "ops": 0.568672575118009,
                "total": 8.792405715999962,
                "iterations": 1
            }
        },
        {
            "group": null,
            "name": "test_lock_actions",
            "fullname": "tests/benchmarks/test_benchmarks.py::test_lock_actions",
            "params": null,
            "param": null,
            "extra_info": {},
            "options": {
                "disable_gc": false,
                "timer": "perf_counter",
                "min_rounds": 5,
                "max_time": 1.0,
                "min_time": 5e-06,
                "warmup": false
            },
            "stats": {
                "min": 3.032630124999997,
                "max": 4.464580988999984,
                "mean": 3.323252794599995,
                "stddev": 0.6380324027857719,
                "rounds": 5,
                "median": 3.040673276000007,
                "iqr": 0.3621012192500004,
                "q1": 3.035493123249992,
                "q3": 3.3975943424999926,
                "iqr_outliers": 1,
                "stddev_outliers": 1,
                "outliers": "1;1",
                "ld15iqr": 3.032630124999997,
                "hd15iqr": 4.464580988999984,
                "ops": 0.30091000047450966,
                "total": 16.616263972999974,
                "iterations": 1
            }
        }
    ],
    "datetime": "2024-09-08T14:05:15.734578",
    "version": "4.0.0"
}