{
    "machine_info": {
        "node": "runner-xxurkrix-project-39604133-concurrent-0",
        "processor": "",
        "machine": "x86_64",
        "python_compiler": "GCC 12.2.0",
        "python_implementation": "CPython",
        "python_implementation_version": "3.12.3",
        "python_version": "3.12.3",
        "python_build": [
            "main",
            "Apr 24 2024 11:17:35"
        ],
        "release": "5.4.109+",
        "system": "Linux",
        "cpu": {
            "python_version": "3.12.3.final.0 (64 bit)",
            "cpuinfo_version": [
                9,
                0,
                0
            ],
            "cpuinfo_version_string": "9.0.0",
            "arch": "X86_64",
            "bits": 64,
            "count": 2,
            "arch_string_raw": "x86_64",
            "vendor_id_raw": "AuthenticAMD",
            "brand_raw": "AMD EPYC 7B13",
            "hz_advertised_friendly": "2.4500 GHz",
            "hz_actual_friendly": "2.4500 GHz",
            "hz_advertised": [
                2449998000,
                0
            ],
            "hz_actual": [
                2449998000,
                0
            ],
            "model": 1,
            "family": 25,
            "flags": [
                "3dnowext",
                "3dnowprefetch",
                "abm",
                "adx",
                "aes",
                "apic",
                "arat",
                "avx",
                "avx2",
                "bmi1",
                "bmi2",
                "clflush",
                "clflushopt",
                "clwb",
                "clzero",
                "cmov",
                "cmp_legacy",
                "constant_tsc",
                "cpuid",
                "cr8_legacy",
                "cx16",
                "cx8",
                "de",
                "erms",
                "extd_apicid",
                "f16c",
                "fma",
                "fpu",
                "fsgsbase",
                "fxsr",
                "fxsr_opt",
                "ht",
                "hypervisor",
                "ibpb",
                "ibrs",
                "invpcid",
                "invpcid_single",
                "lahf_lm",
                "lm",
                "mca",
                "mce",
                "misalignsse",
                "mmx",
                "mmxext",
                "movbe",
                "msr",
                "mtrr",
                "nonstop_tsc",
                "nopl",
                "npt",
                "nrip_save",
                "nx",
                "osvw",
                "osxsave",
                "pae",
                "pat",
                "pcid",
                "pclmulqdq",
                "pdpe1gb",
                "pge",
                "pni",
                "popcnt",
                "pse",
                "pse36",
                "rdpid",
                "rdrand",
                "rdrnd",
                "rdseed",
                "rdtscp",
                "rep_good",
                "sep",
                "sha",
                "sha_ni",
                "smap",
                "smep",
                "ssbd",
                "sse",
                "sse2",
                "sse4_1",
                "sse4_2",
                "sse4a",
                "ssse3",
                "stibp",
                "syscall",
                "topoext",
                "tsc",
                "tsc_adjust",
                "tsc_known_freq",
                "umip",
                "vaes",
                "vme",
                "vmmcall",
                "vpclmulqdq",
                "x2apic",
                "xgetbv1",
                "xsave",
                "xsavec",
                "xsaveerptr",
                "xsaveopt"
            ],
            "l3_cache_size": 524288,
            "l2_cache_size": 524288,
            "l1_data_cache_size": 32768,
            "l1_instruction_cache_size": 32768,
            "l2_cache_line_size": 512,
            "l2_cache_associativity": 6
        }
    },
    "commit_info": {
        "id": "e67c69fed067fffb170673d781fc5bdfa1a40406",
        "time": "2024-04-25T14:00:48+02:00",
        "author_time": "2024-04-25T14:00:48+02:00",
        "dirty": false,
        "project": "finesse3",
        "branch": "(detached head)"
    },
    "benchmarks": [
        {
            "group": null,
            "name": "test_01_simple_cav",
            "fullname": "tests/benchmarks/test_benchmarks.py::test_01_simple_cav",
            "params": null,
            "param": null,
            "extra_info": {},
            "options": {
                "disable_gc": false,
                "timer": "perf_counter",
                "min_rounds": 5,
                "max_time": 1.0,
                "min_time": 5e-06,
                "warmup": false
            },
            "stats": {
                "min": 0.3581539550000059,
                "max": 0.5211202200000002,
                "mean": 0.39553011800000204,
                "stddev": 0.07031993322702948,
                "rounds": 5,
                "median": 0.36707354100001055,
                "iqr": 0.04477665324999691,
                "q1": 0.3617595229999999,
                "q3": 0.40653617624999683,
                "iqr_outliers": 1,
                "stddev_outliers": 1,
                "outliers": "1;1",
                "ld15iqr": 0.3581539550000059,
                "hd15iqr": 0.5211202200000002,
                "ops": 2.5282524755801146,
                "total": 1.9776505900000103,
                "iterations": 1
            }
        },
        {
            "group": null,
            "name": "test_02_pdh_lock",
            "fullname": "tests/benchmarks/test_benchmarks.py::test_02_pdh_lock",
            "params": null,
            "param": null,
            "extra_info": {},
            "options": {
                "disable_gc": false,
                "timer": "perf_counter",
                "min_rounds": 5,
                "max_time": 1.0,
                "min_time": 5e-06,
                "warmup": false
            },
            "stats": {
                "min": 1.308912921000001,
                "max": 1.5409010520000095,
                "mean": 1.3578224604000013,
                "stddev": 0.1023699406173753,
                "rounds": 5,
                "median": 1.3124291120000038,
                "iqr": 0.06087967800000271,
                "q1": 1.310862863999997,
                "q3": 1.3717425419999998,
                "iqr_outliers": 1,
                "stddev_outliers": 1,
                "outliers": "1;1",
                "ld15iqr": 1.308912921000001,
                "hd15iqr": 1.5409010520000095,
                "ops": 0.7364733086720407,
                "total": 6.789112302000007,
                "iterations": 1
            }
        },
        {
            "group": null,
            "name": "test_03_near_unstable",
            "fullname": "tests/benchmarks/test_benchmarks.py::test_03_near_unstable",
            "params": null,
            "param": null,
            "extra_info": {},
            "options": {
                "disable_gc": false,
                "timer": "perf_counter",
                "min_rounds": 5,
                "max_time": 1.0,
                "min_time": 5e-06,
                "warmup": false
            },
            "stats": {
                "min": 1.6899999906172525e-06,
                "max": 3.2879000002594694e-05,
                "mean": 2.5041408306197227e-06,
                "stddev": 9.435103531916733e-07,
                "rounds": 50685,
                "median": 3.039999995735343e-06,
                "iqr": 1.3599999988400668e-06,
                "q1": 1.7699999972364822e-06,
                "q3": 3.129999996076549e-06,
                "iqr_outliers": 291,
                "stddev_outliers": 522,
                "outliers": "522;291",
                "ld15iqr": 1.6899999906172525e-06,
                "hd15iqr": 5.209999997646264e-06,
                "ops": 399338.5626608392,
                "total": 0.12692237799996064,
                "iterations": 1
            }
        },
        {
            "group": null,
            "name": "test_04_geometrical_params",
            "fullname": "tests/benchmarks/test_benchmarks.py::test_04_geometrical_params",
            "params": null,
            "param": null,
            "extra_info": {},
            "options": {
                "disable_gc": false,
                "timer": "perf_counter",
                "min_rounds": 5,
                "max_time": 1.0,
                "min_time": 5e-06,
                "warmup": false
            },
            "stats": {
                "min": 0.4958123399999863,
                "max": 0.8470899200000019,
                "mean": 0.5752857308000046,
                "stddev": 0.15251216179349752,
                "rounds": 5,
                "median": 0.5025561369999991,
                "iqr": 0.10915114024999895,
                "q1": 0.49990105875001234,
                "q3": 0.6090521990000113,
                "iqr_outliers": 1,
                "stddev_outliers": 1,
                "outliers": "1;1",
                "ld15iqr": 0.4958123399999863,
                "hd15iqr": 0.8470899200000019,
                "ops": 1.7382666498774075,
                "total": 2.876428654000023,
                "iterations": 1
            }
        },
        {
            "group": null,
            "name": "test_05_modulation",
            "fullname": "tests/benchmarks/test_benchmarks.py::test_05_modulation",
            "params": null,
            "param": null,
            "extra_info": {},
            "options": {
                "disable_gc": false,
                "timer": "perf_counter",
                "min_rounds": 5,
                "max_time": 1.0,
                "min_time": 5e-06,
                "warmup": false
            },
            "stats": {
                "min": 0.16697106999998823,
                "max": 0.5452757660000032,
                "mean": 0.21801754112499694,
                "stddev": 0.13226195529408266,
                "rounds": 8,
                "median": 0.17157031150000535,
                "iqr": 0.005356484999992972,
                "q1": 0.16950997499999687,
                "q3": 0.17486645999998984,
                "iqr_outliers": 1,
                "stddev_outliers": 1,
                "outliers": "1;1",
                "ld15iqr": 0.16697106999998823,
                "hd15iqr": 0.5452757660000032,
                "ops": 4.586786892650375,
                "total": 1.7441403289999755,
                "iterations": 1
            }
        },
        {
            "group": null,
            "name": "test_06_radiation_pressure",
            "fullname": "tests/benchmarks/test_benchmarks.py::test_06_radiation_pressure",
            "params": null,
            "param": null,
            "extra_info": {},
            "options": {
                "disable_gc": false,
                "timer": "perf_counter",
                "min_rounds": 5,
                "max_time": 1.0,
                "min_time": 5e-06,
                "warmup": false
            },
            "stats": {
                "min": 0.23066595899999243,
                "max": 0.24073912899999073,
                "mean": 0.23443433439999808,
                "stddev": 0.0038701480646421726,
                "rounds": 5,
                "median": 0.23429198800002382,
                "iqr": 0.004378244500010453,
                "q1": 0.23166448724998645,
                "q3": 0.2360427317499969,
                "iqr_outliers": 0,
                "stddev_outliers": 1,
                "outliers": "1;0",
                "ld15iqr": 0.23066595899999243,
                "hd15iqr": 0.24073912899999073,
                "ops": 4.265586790259883,
                "total": 1.1721716719999904,
                "iterations": 1
            }
        },
        {
            "group": null,
            "name": "test_07_homodyne",
            "fullname": "tests/benchmarks/test_benchmarks.py::test_07_homodyne",
            "params": null,
            "param": null,
            "extra_info": {},
            "options": {
                "disable_gc": false,
                "timer": "perf_counter",
                "min_rounds": 5,
                "max_time": 1.0,
                "min_time": 5e-06,
                "warmup": false
            },
            "stats": {
                "min": 0.10790860700001303,
                "max": 0.5780880720000141,
                "mean": 0.15689948020000202,
                "stddev": 0.14800442797573043,
                "rounds": 10,
                "median": 0.10971786700000052,
                "iqr": 0.0037331300000005285,
                "q1": 0.10863574600000447,
                "q3": 0.112368876000005,
                "iqr_outliers": 1,
                "stddev_outliers": 1,
                "outliers": "1;1",
                "ld15iqr": 0.10790860700001303,
                "hd15iqr": 0.5780880720000141,
                "ops": 6.373507412040407,
                "total": 1.5689948020000202,
                "iterations": 1
            }
        },
        {
            "group": null,
            "name": "test_08_optical_spring",
            "fullname": "tests/benchmarks/test_benchmarks.py::test_08_optical_spring",
            "params": null,
            "param": null,
            "extra_info": {},
            "options": {
                "disable_gc": false,
                "timer": "perf_counter",
                "min_rounds": 5,
                "max_time": 1.0,
                "min_time": 5e-06,
                "warmup": false
            },
            "stats": {
                "min": 0.2856096179999952,
                "max": 0.29408908100000986,
                "mean": 0.2908654038000066,
                "stddev": 0.0031401226982663275,
                "rounds": 5,
                "median": 0.29157748600002265,
                "iqr": 0.0023517777500075,
                "q1": 0.2899305112499988,
                "q3": 0.2922822890000063,
                "iqr_outliers": 1,
                "stddev_outliers": 2,
                "outliers": "2;1",
                "ld15iqr": 0.291370809,
                "hd15iqr": 0.29408908100000986,
                "ops": 3.4380163021642156,
                "total": 1.4543270190000328,
                "iterations": 1
            }
        },
        {
            "group": null,
            "name": "test_09_aligo_sensitivity",
            "fullname": "tests/benchmarks/test_benchmarks.py::test_09_aligo_sensitivity",
            "params": null,
            "param": null,
            "extra_info": {},
            "options": {
                "disable_gc": false,
                "timer": "perf_counter",
                "min_rounds": 5,
                "max_time": 1.0,
                "min_time": 5e-06,
                "warmup": false
            },
            "stats": {
                "min": 0.31589640999999347,
                "max": 0.87417770899998,
                "mean": 0.4299740373999953,
                "stddev": 0.2483521560118847,
                "rounds": 5,
                "median": 0.31743757099999925,
                "iqr": 0.1468802815000103,
                "q1": 0.3162035604999929,
                "q3": 0.4630838420000032,
                "iqr_outliers": 1,
                "stddev_outliers": 1,
                "outliers": "1;1",
                "ld15iqr": 0.31589640999999347,
                "hd15iqr": 0.87417770899998,
                "ops": 2.3257218181053156,
                "total": 2.1498701869999763,
                "iterations": 1
            }
        },
        {
            "group": null,
            "name": "test_10_shifted_beam",
            "fullname": "tests/benchmarks/test_benchmarks.py::test_10_shifted_beam",
            "params": null,
            "param": null,
            "extra_info": {},
            "options": {
                "disable_gc": false,
                "timer": "perf_counter",
                "min_rounds": 5,
                "max_time": 1.0,
                "min_time": 5e-06,
                "warmup": false
            },
            "stats": {
                "min": 0.6974167160000206,
                "max": 0.7068724660000214,
                "mean": 0.7024407004000068,
                "stddev": 0.003739453729166959,
                "rounds": 5,
                "median": 0.7036223570000004,
                "iqr": 0.0056301957500224376,
                "q1": 0.6993305359999908,
                "q3": 0.7049607317500133,
                "iqr_outliers": 0,
                "stddev_outliers": 2,
                "outliers": "2;0",
                "ld15iqr": 0.6974167160000206,
                "hd15iqr": 0.7068724660000214,
                "ops": 1.4236077144028632,
                "total": 3.512203502000034,
                "iterations": 1
            }
        },
        {
            "group": null,
            "name": "test_angular_radiation_pressure",
            "fullname": "tests/benchmarks/test_benchmarks.py::test_angular_radiation_pressure",
            "params": null,
            "param": null,
            "extra_info": {},
            "options": {
                "disable_gc": false,
                "timer": "perf_counter",
                "min_rounds": 5,
                "max_time": 1.0,
                "min_time": 5e-06,
                "warmup": false
            },
            "stats": {
                "min": 0.33042943299997773,
                "max": 0.3442238050000128,
                "mean": 0.33620246419999944,
                "stddev": 0.005630495080852998,
                "rounds": 5,
                "median": 0.33558022200000437,
                "iqr": 0.009003746250030531,
                "q1": 0.3313718544999844,
                "q3": 0.34037560075001494,
                "iqr_outliers": 0,
                "stddev_outliers": 2,
                "outliers": "2;0",
                "ld15iqr": 0.33042943299997773,
                "hd15iqr": 0.3442238050000128,
                "ops": 2.974398187055292,
                "total": 1.6810123209999972,
                "iterations": 1
            }
        },
        {
            "group": null,
            "name": "test_cavity_eigenmodes",
            "fullname": "tests/benchmarks/test_benchmarks.py::test_cavity_eigenmodes",
            "params": null,
            "param": null,
            "extra_info": {},
            "options": {
                "disable_gc": false,
                "timer": "perf_counter",
                "min_rounds": 5,
                "max_time": 1.0,
                "min_time": 5e-06,
                "warmup": false
            },
            "stats": {
                "min": 0.25831882100001735,
                "max": 1.1171987190000152,
                "mean": 0.43483578500000136,
                "stddev": 0.3814806681303135,
                "rounds": 5,
                "median": 0.2660404679999999,
                "iqr": 0.22135719624999695,
                "q1": 0.26099393824999595,
                "q3": 0.4823511344999929,
                "iqr_outliers": 1,
                "stddev_outliers": 1,
                "outliers": "1;1",
                "ld15iqr": 0.25831882100001735,
                "hd15iqr": 1.1171987190000152,
                "ops": 2.2997187317506467,
                "total": 2.1741789250000068,
                "iterations": 1
            }
        },
        {
            "group": null,
            "name": "test_coupled_cavity_commands",
            "fullname": "tests/benchmarks/test_benchmarks.py::test_coupled_cavity_commands",
            "params": null,
            "param": null,
            "extra_info": {},
            "options": {
                "disable_gc": false,
                "timer": "perf_counter",
                "min_rounds": 5,
                "max_time": 1.0,
                "min_time": 5e-06,
                "warmup": false
            },
            "stats": {
                "min": 4.248599438999975,
                "max": 5.477752577000018,
                "mean": 4.700567319799996,
                "stddev": 0.5759874330840112,
                "rounds": 5,
                "median": 4.3131204620000005,
                "iqr": 0.949581629750007,
                "q1": 4.2897647324999895,
                "q3": 5.2393463622499965,
                "iqr_outliers": 0,
                "stddev_outliers": 1,
                "outliers": "1;0",
                "ld15iqr": 4.248599438999975,
                "hd15iqr": 5.477752577000018,
                "ops": 0.21274027834634843,
                "total": 23.502836598999977,
                "iterations": 1
            }
        },
        {
            "group": null,
            "name": "test_frequency_dependant_squeezing",
            "fullname": "tests/benchmarks/test_benchmarks.py::test_frequency_dependant_squeezing",
            "params": null,
            "param": null,
            "extra_info": {},
            "options": {
                "disable_gc": false,
                "timer": "perf_counter",
                "min_rounds": 5,
                "max_time": 1.0,
                "min_time": 5e-06,
                "warmup": false
            },
            "stats": {
                "min": 1.5008176159999778,
                "max": 2.8112170230000117,
                "mean": 1.7842569541999922,
                "stddev": 0.5745742088231985,
                "rounds": 5,
                "median": 1.53745242399998,
                "iqr": 0.36556609974999077,
                "q1": 1.5081454205,
                "q3": 1.8737115202499908,
                "iqr_outliers": 1,
                "stddev_outliers": 1,
                "outliers": "1;1",
                "ld15iqr": 1.5008176159999778,
                "hd15iqr": 2.8112170230000117,
                "ops": 0.560457392443439,
                "total": 8.92128477099996,
                "iterations": 1
            }
        },
        {
            "group": null,
            "name": "test_lock_actions",
            "fullname": "tests/benchmarks/test_benchmarks.py::test_lock_actions",
            "params": null,
            "param": null,
            "extra_info": {},
            "options": {
                "disable_gc": false,
                "timer": "perf_counter",
                "min_rounds": 5,
                "max_time": 1.0,
                "min_time": 5e-06,
                "warmup": false
            },
            "stats": {
                "min": 4.851278984999993,
                "max": 5.154213220000003,
                "mean": 5.0019271694,
                "stddev": 0.12931100976798085,
                "rounds": 5,
                "median": 4.952747380000005,
                "iqr": 0.21584778474998956,
                "q1": 4.912036231500004,
                "q3": 5.127884016249993,
                "iqr_outliers": 0,
                "stddev_outliers": 2,
                "outliers": "2;0",
                "ld15iqr": 4.851278984999993,
                "hd15iqr": 5.154213220000003,
                "ops": 0.19992294292440763,
                "total": 25.009635847,
                "iterations": 1
            }
        }
    ],
    "datetime": "2024-04-25T12:07:24.467299",
    "version": "4.0.0"
}