{
    "machine_info": {
        "node": "runner-nthfetyx-project-39604133-concurrent-0",
        "processor": "",
        "machine": "x86_64",
        "python_compiler": "GCC 12.2.0",
        "python_implementation": "CPython",
        "python_implementation_version": "3.12.3",
        "python_version": "3.12.3",
        "python_build": [
            "main",
            "May 14 2024 07:23:41"
        ],
        "release": "5.15.154+",
        "system": "Linux",
        "cpu": {
            "python_version": "3.12.3.final.0 (64 bit)",
            "cpuinfo_version": [
                9,
                0,
                0
            ],
            "cpuinfo_version_string": "9.0.0",
            "arch": "X86_64",
            "bits": 64,
            "count": 2,
            "arch_string_raw": "x86_64",
            "vendor_id_raw": "AuthenticAMD",
            "brand_raw": "AMD EPYC 7B13",
            "hz_advertised_friendly": "2.4500 GHz",
            "hz_actual_friendly": "2.4500 GHz",
            "hz_advertised": [
                2449998000,
                0
            ],
            "hz_actual": [
                2449998000,
                0
            ],
            "model": 1,
            "family": 25,
            "flags": [
                "3dnowext",
                "3dnowprefetch",
                "abm",
                "adx",
                "aes",
                "apic",
                "arat",
                "avx",
                "avx2",
                "bmi1",
                "bmi2",
                "clflush",
                "clflushopt",
                "clwb",
                "clzero",
                "cmov",
                "cmp_legacy",
                "constant_tsc",
                "cpuid",
                "cr8_legacy",
                "cx16",
                "cx8",
                "de",
                "erms",
                "extd_apicid",
                "f16c",
                "fma",
                "fpu",
                "fsgsbase",
                "fsrm",
                "fxsr",
                "fxsr_opt",
                "ht",
                "hypervisor",
                "ibpb",
                "ibrs",
                "invpcid",
                "invpcid_single",
                "lahf_lm",
                "lm",
                "mca",
                "mce",
                "misalignsse",
                "mmx",
                "mmxext",
                "movbe",
                "msr",
                "mtrr",
                "nonstop_tsc",
                "nopl",
                "npt",
                "nrip_save",
                "nx",
                "osvw",
                "osxsave",
                "pae",
                "pat",
                "pcid",
                "pclmulqdq",
                "pdpe1gb",
                "pge",
                "pni",
                "popcnt",
                "pse",
                "pse36",
                "rdpid",
                "rdrand",
                "rdrnd",
                "rdseed",
                "rdtscp",
                "rep_good",
                "sep",
                "sha",
                "sha_ni",
                "smap",
                "smep",
                "ssbd",
                "sse",
                "sse2",
                "sse4_1",
                "sse4_2",
                "sse4a",
                "ssse3",
                "stibp",
                "syscall",
                "topoext",
                "tsc",
                "tsc_adjust",
                "tsc_known_freq",
                "umip",
                "vaes",
                "vme",
                "vmmcall",
                "vpclmulqdq",
                "x2apic",
                "xgetbv1",
                "xsave",
                "xsavec",
                "xsaveerptr",
                "xsaveopt"
            ],
            "l3_cache_size": 524288,
            "l2_cache_size": 524288,
            "l1_data_cache_size": 32768,
            "l1_instruction_cache_size": 32768,
            "l2_cache_line_size": 512,
            "l2_cache_associativity": 6
        }
    },
    "commit_info": {
        "id": "2c6030ce1df3f7e3118a18d6d95080db3f432501",
        "time": "2024-05-23T12:53:19+09:30",
        "author_time": "2024-05-23T12:53:19+09:30",
        "dirty": false,
        "project": "finesse3",
        "branch": "(detached head)"
    },
    "benchmarks": [
        {
            "group": null,
            "name": "test_01_simple_cav",
            "fullname": "tests/benchmarks/test_benchmarks.py::test_01_simple_cav",
            "params": null,
            "param": null,
            "extra_info": {},
            "options": {
                "disable_gc": false,
                "timer": "perf_counter",
                "min_rounds": 5,
                "max_time": 1.0,
                "min_time": 5e-06,
                "warmup": false
            },
            "stats": {
                "min": 0.3505273159999973,
                "max": 0.5729739899999942,
                "mean": 0.43527606480000147,
                "stddev": 0.10556623081915675,
                "rounds": 5,
                "median": 0.36533199200000865,
                "iqr": 0.17837940999999446,
                "q1": 0.3590780930000044,
                "q3": 0.5374575029999988,
                "iqr_outliers": 0,
                "stddev_outliers": 1,
                "outliers": "1;0",
                "ld15iqr": 0.3505273159999973,
                "hd15iqr": 0.5729739899999942,
                "ops": 2.2973925765007897,
                "total": 2.1763803240000072,
                "iterations": 1
            }
        },
        {
            "group": null,
            "name": "test_02_pdh_lock",
            "fullname": "tests/benchmarks/test_benchmarks.py::test_02_pdh_lock",
            "params": null,
            "param": null,
            "extra_info": {},
            "options": {
                "disable_gc": false,
                "timer": "perf_counter",
                "min_rounds": 5,
                "max_time": 1.0,
                "min_time": 5e-06,
                "warmup": false
            },
            "stats": {
                "min": 1.3111797410000179,
                "max": 1.5868823590000147,
                "mean": 1.4194998908000058,
                "stddev": 0.13052643101201009,
                "rounds": 5,
                "median": 1.3365697030000092,
                "iqr": 0.22349189375000122,
                "q1": 1.3240871847499989,
                "q3": 1.5475790785,
                "iqr_outliers": 0,
                "stddev_outliers": 1,
                "outliers": "1;0",
                "ld15iqr": 1.3111797410000179,
                "hd15iqr": 1.5868823590000147,
                "ops": 0.7044734603229994,
                "total": 7.09749945400003,
                "iterations": 1
            }
        },
        {
            "group": null,
            "name": "test_03_near_unstable",
            "fullname": "tests/benchmarks/test_benchmarks.py::test_03_near_unstable",
            "params": null,
            "param": null,
            "extra_info": {},
            "options": {
                "disable_gc": false,
                "timer": "perf_counter",
                "min_rounds": 5,
                "max_time": 1.0,
                "min_time": 5e-06,
                "warmup": false
            },
            "stats": {
                "min": 1.7499999955816747e-06,
                "max": 4.017000000544613e-05,
                "mean": 2.6220609424281284e-06,
                "stddev": 1.0495351097249258e-06,
                "rounds": 48193,
                "median": 3.1200000023545726e-06,
                "iqr": 1.39000002263856e-06,
                "q1": 1.8199999942680734e-06,
                "q3": 3.2100000169066334e-06,
                "iqr_outliers": 280,
                "stddev_outliers": 398,
                "outliers": "398;280",
                "ld15iqr": 1.7499999955816747e-06,
                "hd15iqr": 5.329999993364254e-06,
                "ops": 381379.38894507993,
                "total": 0.1263649829984388,
                "iterations": 1
            }
        },
        {
            "group": null,
            "name": "test_04_geometrical_params",
            "fullname": "tests/benchmarks/test_benchmarks.py::test_04_geometrical_params",
            "params": null,
            "param": null,
            "extra_info": {},
            "options": {
                "disable_gc": false,
                "timer": "perf_counter",
                "min_rounds": 5,
                "max_time": 1.0,
                "min_time": 5e-06,
                "warmup": false
            },
            "stats": {
                "min": 0.5015147109999987,
                "max": 0.8206146269999977,
                "mean": 0.5673474897999995,
                "stddev": 0.1416089952718787,
                "rounds": 5,
                "median": 0.5033641109999962,
                "iqr": 0.08455238750001115,
                "q1": 0.5022064734999958,
                "q3": 0.586758861000007,
                "iqr_outliers": 1,
                "stddev_outliers": 1,
                "outliers": "1;1",
                "ld15iqr": 0.5015147109999987,
                "hd15iqr": 0.8206146269999977,
                "ops": 1.762588216178622,
                "total": 2.8367374489999975,
                "iterations": 1
            }
        },
        {
            "group": null,
            "name": "test_05_modulation",
            "fullname": "tests/benchmarks/test_benchmarks.py::test_05_modulation",
            "params": null,
            "param": null,
            "extra_info": {},
            "options": {
                "disable_gc": false,
                "timer": "perf_counter",
                "min_rounds": 5,
                "max_time": 1.0,
                "min_time": 5e-06,
                "warmup": false
            },
            "stats": {
                "min": 0.17080847500000118,
                "max": 0.17445767500001352,
                "mean": 0.17296409600000118,
                "stddev": 0.0012613426254494593,
                "rounds": 8,
                "median": 0.17335430900000404,
                "iqr": 0.0015971999999919717,
                "q1": 0.17213590000000067,
                "q3": 0.17373309999999265,
                "iqr_outliers": 0,
                "stddev_outliers": 3,
                "outliers": "3;0",
                "ld15iqr": 0.17080847500000118,
                "hd15iqr": 0.17445767500001352,
                "ops": 5.781546708977065,
                "total": 1.3837127680000094,
                "iterations": 1
            }
        },
        {
            "group": null,
            "name": "test_06_radiation_pressure",
            "fullname": "tests/benchmarks/test_benchmarks.py::test_06_radiation_pressure",
            "params": null,
            "param": null,
            "extra_info": {},
            "options": {
                "disable_gc": false,
                "timer": "perf_counter",
                "min_rounds": 5,
                "max_time": 1.0,
                "min_time": 5e-06,
                "warmup": false
            },
            "stats": {
                "min": 0.3014397839999958,
                "max": 0.7473551549999797,
                "mean": 0.39827439899999606,
                "stddev": 0.19523022944237528,
                "rounds": 5,
                "median": 0.31383177200001455,
                "iqr": 0.11565280274998457,
                "q1": 0.30905244750000094,
                "q3": 0.4247052502499855,
                "iqr_outliers": 1,
                "stddev_outliers": 1,
                "outliers": "1;1",
                "ld15iqr": 0.3014397839999958,
                "hd15iqr": 0.7473551549999797,
                "ops": 2.510831734379216,
                "total": 1.9913719949999802,
                "iterations": 1
            }
        },
        {
            "group": null,
            "name": "test_07_homodyne",
            "fullname": "tests/benchmarks/test_benchmarks.py::test_07_homodyne",
            "params": null,
            "param": null,
            "extra_info": {},
            "options": {
                "disable_gc": false,
                "timer": "perf_counter",
                "min_rounds": 5,
                "max_time": 1.0,
                "min_time": 5e-06,
                "warmup": false
            },
            "stats": {
                "min": 0.11053052000002594,
                "max": 0.1144422899999995,
                "mean": 0.1119324802000051,
                "stddev": 0.0014037217960656127,
                "rounds": 10,
                "median": 0.11135134500000277,
                "iqr": 0.0020645989999650283,
                "q1": 0.11081676100002369,
                "q3": 0.11288135999998872,
                "iqr_outliers": 0,
                "stddev_outliers": 2,
                "outliers": "2;0",
                "ld15iqr": 0.11053052000002594,
                "hd15iqr": 0.1144422899999995,
                "ops": 8.933957312597407,
                "total": 1.119324802000051,
                "iterations": 1
            }
        },
        {
            "group": null,
            "name": "test_08_optical_spring",
            "fullname": "tests/benchmarks/test_benchmarks.py::test_08_optical_spring",
            "params": null,
            "param": null,
            "extra_info": {},
            "options": {
                "disable_gc": false,
                "timer": "perf_counter",
                "min_rounds": 5,
                "max_time": 1.0,
                "min_time": 5e-06,
                "warmup": false
            },
            "stats": {
                "min": 0.2871846049999931,
                "max": 0.2953361540000117,
                "mean": 0.2917126462000056,
                "stddev": 0.003330015819112149,
                "rounds": 5,
                "median": 0.2906953550000253,
                "iqr": 0.00500801400001194,
                "q1": 0.2898162567499938,
                "q3": 0.2948242707500057,
                "iqr_outliers": 0,
                "stddev_outliers": 2,
                "outliers": "2;0",
                "ld15iqr": 0.2871846049999931,
                "hd15iqr": 0.2953361540000117,
                "ops": 3.428031019657525,
                "total": 1.4585632310000278,
                "iterations": 1
            }
        },
        {
            "group": null,
            "name": "test_09_aligo_sensitivity",
            "fullname": "tests/benchmarks/test_benchmarks.py::test_09_aligo_sensitivity",
            "params": null,
            "param": null,
            "extra_info": {},
            "options": {
                "disable_gc": false,
                "timer": "perf_counter",
                "min_rounds": 5,
                "max_time": 1.0,
                "min_time": 5e-06,
                "warmup": false
            },
            "stats": {
                "min": 0.3152587520000054,
                "max": 0.32259784200002173,
                "mean": 0.31858093420000844,
                "stddev": 0.0028579404832329834,
                "rounds": 5,
                "median": 0.31842654300001527,
                "iqr": 0.0042832749999988096,
                "q1": 0.31632351200000386,
                "q3": 0.32060678700000267,
                "iqr_outliers": 0,
                "stddev_outliers": 2,
                "outliers": "2;0",
                "ld15iqr": 0.3152587520000054,
                "hd15iqr": 0.32259784200002173,
                "ops": 3.1389197928969272,
                "total": 1.592904671000042,
                "iterations": 1
            }
        },
        {
            "group": null,
            "name": "test_10_shifted_beam",
            "fullname": "tests/benchmarks/test_benchmarks.py::test_10_shifted_beam",
            "params": null,
            "param": null,
            "extra_info": {},
            "options": {
                "disable_gc": false,
                "timer": "perf_counter",
                "min_rounds": 5,
                "max_time": 1.0,
                "min_time": 5e-06,
                "warmup": false
            },
            "stats": {
                "min": 0.702565299000014,
                "max": 1.3362795129999938,
                "mean": 0.8339444508000099,
                "stddev": 0.28085335415929774,
                "rounds": 5,
                "median": 0.7125672770000051,
                "iqr": 0.16481358025000503,
                "q1": 0.7043151232500122,
                "q3": 0.8691287035000173,
                "iqr_outliers": 1,
                "stddev_outliers": 1,
                "outliers": "1;1",
                "ld15iqr": 0.702565299000014,
                "hd15iqr": 1.3362795129999938,
                "ops": 1.1991206357218296,
                "total": 4.16972225400005,
                "iterations": 1
            }
        },
        {
            "group": null,
            "name": "test_angular_radiation_pressure",
            "fullname": "tests/benchmarks/test_benchmarks.py::test_angular_radiation_pressure",
            "params": null,
            "param": null,
            "extra_info": {},
            "options": {
                "disable_gc": false,
                "timer": "perf_counter",
                "min_rounds": 5,
                "max_time": 1.0,
                "min_time": 5e-06,
                "warmup": false
            },
            "stats": {
                "min": 0.33311430099999484,
                "max": 0.3389833600000145,
                "mean": 0.33669394620000614,
                "stddev": 0.0022952856010475093,
                "rounds": 5,
                "median": 0.3376000099999885,
                "iqr": 0.003012819749997675,
                "q1": 0.3351703202500147,
                "q3": 0.33818314000001237,
                "iqr_outliers": 0,
                "stddev_outliers": 1,
                "outliers": "1;0",
                "ld15iqr": 0.33311430099999484,
                "hd15iqr": 0.3389833600000145,
                "ops": 2.9700563710342758,
                "total": 1.6834697310000308,
                "iterations": 1
            }
        },
        {
            "group": null,
            "name": "test_cavity_eigenmodes",
            "fullname": "tests/benchmarks/test_benchmarks.py::test_cavity_eigenmodes",
            "params": null,
            "param": null,
            "extra_info": {},
            "options": {
                "disable_gc": false,
                "timer": "perf_counter",
                "min_rounds": 5,
                "max_time": 1.0,
                "min_time": 5e-06,
                "warmup": false
            },
            "stats": {
                "min": 0.2656079170000112,
                "max": 0.2729648359999999,
                "mean": 0.26885501040000576,
                "stddev": 0.002988774703594879,
                "rounds": 5,
                "median": 0.26967372699999714,
                "iqr": 0.004482994749984925,
                "q1": 0.26609081125001666,
                "q3": 0.2705738060000016,
                "iqr_outliers": 0,
                "stddev_outliers": 2,
                "outliers": "2;0",
                "ld15iqr": 0.2656079170000112,
                "hd15iqr": 0.2729648359999999,
                "ops": 3.7194768976489887,
                "total": 1.3442750520000288,
                "iterations": 1
            }
        },
        {
            "group": null,
            "name": "test_coupled_cavity_commands",
            "fullname": "tests/benchmarks/test_benchmarks.py::test_coupled_cavity_commands",
            "params": null,
            "param": null,
            "extra_info": {},
            "options": {
                "disable_gc": false,
                "timer": "perf_counter",
                "min_rounds": 5,
                "max_time": 1.0,
                "min_time": 5e-06,
                "warmup": false
            },
            "stats": {
                "min": 4.212791549000002,
                "max": 5.276800354000017,
                "mean": 4.620626008200008,
                "stddev": 0.5437232143339266,
                "rounds": 5,
                "median": 4.248286804999992,
                "iqr": 0.9690219890000193,
                "q1": 4.213657243250005,
                "q3": 5.182679232250024,
                "iqr_outliers": 0,
                "stddev_outliers": 1,
                "outliers": "1;0",
                "ld15iqr": 4.212791549000002,
                "hd15iqr": 5.276800354000017,
                "ops": 0.2164208915037371,
                "total": 23.103130041000043,
                "iterations": 1
            }
        },
        {
            "group": null,
            "name": "test_frequency_dependant_squeezing",
            "fullname": "tests/benchmarks/test_benchmarks.py::test_frequency_dependant_squeezing",
            "params": null,
            "param": null,
            "extra_info": {},
            "options": {
                "disable_gc": false,
                "timer": "perf_counter",
                "min_rounds": 5,
                "max_time": 1.0,
                "min_time": 5e-06,
                "warmup": false
            },
            "stats": {
                "min": 1.4909487479999939,
                "max": 1.5113073370000052,
                "mean": 1.5025112453999951,
                "stddev": 0.008189184672280447,
                "rounds": 5,
                "median": 1.505241006999995,
                "iqr": 0.012569831499995132,
                "q1": 1.4958942704999956,
                "q3": 1.5084641019999907,
                "iqr_outliers": 0,
                "stddev_outliers": 2,
                "outliers": "2;0",
                "ld15iqr": 1.4909487479999939,
                "hd15iqr": 1.5113073370000052,
                "ops": 0.6655524230261466,
                "total": 7.512556226999976,
                "iterations": 1
            }
        },
        {
            "group": null,
            "name": "test_lock_actions",
            "fullname": "tests/benchmarks/test_benchmarks.py::test_lock_actions",
            "params": null,
            "param": null,
            "extra_info": {},
            "options": {
                "disable_gc": false,
                "timer": "perf_counter",
                "min_rounds": 5,
                "max_time": 1.0,
                "min_time": 5e-06,
                "warmup": false
            },
            "stats": {
                "min": 4.729797502999986,
                "max": 5.120538530000005,
                "mean": 4.894892280399995,
                "stddev": 0.1443096378478781,
                "rounds": 5,
                "median": 4.880207117999987,
                "iqr": 0.16359193200000277,
                "q1": 4.803465382249996,
                "q3": 4.967057314249999,
                "iqr_outliers": 0,
                "stddev_outliers": 2,
                "outliers": "2;0",
                "ld15iqr": 4.729797502999986,
                "hd15iqr": 5.120538530000005,
                "ops": 0.20429458764683647,
                "total": 24.474461401999974,
                "iterations": 1
            }
        }
    ],
    "datetime": "2024-05-23T03:30:24.909365",
    "version": "4.0.0"
}