{
    "machine_info": {
        "node": "runner-nthfetyx-project-39604133-concurrent-0",
        "processor": "",
        "machine": "x86_64",
        "python_compiler": "GCC 12.2.0",
        "python_implementation": "CPython",
        "python_implementation_version": "3.12.4",
        "python_version": "3.12.4",
        "python_build": [
            "main",
            "Jun 27 2024 00:07:20"
        ],
        "release": "5.15.154+",
        "system": "Linux",
        "cpu": {
            "python_version": "3.12.4.final.0 (64 bit)",
            "cpuinfo_version": [
                9,
                0,
                0
            ],
            "cpuinfo_version_string": "9.0.0",
            "arch": "X86_64",
            "bits": 64,
            "count": 2,
            "arch_string_raw": "x86_64",
            "vendor_id_raw": "AuthenticAMD",
            "brand_raw": "AMD EPYC 7B13",
            "hz_advertised_friendly": "2.4500 GHz",
            "hz_actual_friendly": "2.4500 GHz",
            "hz_advertised": [
                2449996000,
                0
            ],
            "hz_actual": [
                2449996000,
                0
            ],
            "model": 1,
            "family": 25,
            "flags": [
                "3dnowext",
                "3dnowprefetch",
                "abm",
                "adx",
                "aes",
                "apic",
                "arat",
                "avx",
                "avx2",
                "bmi1",
                "bmi2",
                "clflush",
                "clflushopt",
                "clwb",
                "clzero",
                "cmov",
                "cmp_legacy",
                "constant_tsc",
                "cpuid",
                "cr8_legacy",
                "cx16",
                "cx8",
                "de",
                "erms",
                "extd_apicid",
                "f16c",
                "fma",
                "fpu",
                "fsgsbase",
                "fsrm",
                "fxsr",
                "fxsr_opt",
                "ht",
                "hypervisor",
                "ibpb",
                "ibrs",
                "invpcid",
                "invpcid_single",
                "lahf_lm",
                "lm",
                "mca",
                "mce",
                "misalignsse",
                "mmx",
                "mmxext",
                "movbe",
                "msr",
                "mtrr",
                "nonstop_tsc",
                "nopl",
                "npt",
                "nrip_save",
                "nx",
                "osvw",
                "osxsave",
                "pae",
                "pat",
                "pcid",
                "pclmulqdq",
                "pdpe1gb",
                "pge",
                "pni",
                "popcnt",
                "pse",
                "pse36",
                "rdpid",
                "rdrand",
                "rdrnd",
                "rdseed",
                "rdtscp",
                "rep_good",
                "sep",
                "sha",
                "sha_ni",
                "smap",
                "smep",
                "ssbd",
                "sse",
                "sse2",
                "sse4_1",
                "sse4_2",
                "sse4a",
                "ssse3",
                "stibp",
                "syscall",
                "topoext",
                "tsc",
                "tsc_adjust",
                "tsc_known_freq",
                "umip",
                "vaes",
                "vme",
                "vmmcall",
                "vpclmulqdq",
                "x2apic",
                "xgetbv1",
                "xsave",
                "xsavec",
                "xsaveerptr",
                "xsaveopt"
            ],
            "l3_cache_size": 524288,
            "l2_cache_size": 524288,
            "l1_data_cache_size": 32768,
            "l1_instruction_cache_size": 32768,
            "l2_cache_line_size": 512,
            "l2_cache_associativity": 6
        }
    },
    "commit_info": {
        "id": "6387c06bc2efb148b1a6e2683f38ba0df8b03076",
        "time": "2024-06-28T16:51:03+02:00",
        "author_time": "2024-06-28T16:51:03+02:00",
        "dirty": false,
        "project": "finesse3",
        "branch": "(detached head)"
    },
    "benchmarks": [
        {
            "group": null,
            "name": "test_01_simple_cav",
            "fullname": "tests/benchmarks/test_benchmarks.py::test_01_simple_cav",
            "params": null,
            "param": null,
            "extra_info": {},
            "options": {
                "disable_gc": false,
                "timer": "perf_counter",
                "min_rounds": 5,
                "max_time": 1.0,
                "min_time": 5e-06,
                "warmup": false
            },
            "stats": {
                "min": 0.28427450399999543,
                "max": 0.4898897639999973,
                "mean": 0.32896618179999565,
                "stddev": 0.09000808866833164,
                "rounds": 5,
                "median": 0.29122016400000916,
                "iqr": 0.054269496750009694,
                "q1": 0.28692821399998536,
                "q3": 0.34119771074999505,
                "iqr_outliers": 1,
                "stddev_outliers": 1,
                "outliers": "1;1",
                "ld15iqr": 0.28427450399999543,
                "hd15iqr": 0.4898897639999973,
                "ops": 3.039826144220437,
                "total": 1.6448309089999782,
                "iterations": 1
            }
        },
        {
            "group": null,
            "name": "test_02_pdh_lock",
            "fullname": "tests/benchmarks/test_benchmarks.py::test_02_pdh_lock",
            "params": null,
            "param": null,
            "extra_info": {},
            "options": {
                "disable_gc": false,
                "timer": "perf_counter",
                "min_rounds": 5,
                "max_time": 1.0,
                "min_time": 5e-06,
                "warmup": false
            },
            "stats": {
                "min": 1.2363329499999907,
                "max": 1.5369506399999864,
                "mean": 1.3022991305999938,
                "stddev": 0.13138151789194993,
                "rounds": 5,
                "median": 1.2461456780000049,
                "iqr": 0.08799775624998318,
                "q1": 1.2371864650000006,
                "q3": 1.3251842212499838,
                "iqr_outliers": 1,
                "stddev_outliers": 1,
                "outliers": "1;1",
                "ld15iqr": 1.2363329499999907,
                "hd15iqr": 1.5369506399999864,
                "ops": 0.7678727386843,
                "total": 6.511495652999969,
                "iterations": 1
            }
        },
        {
            "group": null,
            "name": "test_03_near_unstable",
            "fullname": "tests/benchmarks/test_benchmarks.py::test_03_near_unstable",
            "params": null,
            "param": null,
            "extra_info": {},
            "options": {
                "disable_gc": false,
                "timer": "perf_counter",
                "min_rounds": 5,
                "max_time": 1.0,
                "min_time": 5e-06,
                "warmup": false
            },
            "stats": {
                "min": 1.7289999902914133e-06,
                "max": 3.058999999439038e-05,
                "mean": 1.871422409373837e-06,
                "stddev": 5.206203287046174e-07,
                "rounds": 46320,
                "median": 1.8199999942680734e-06,
                "iqr": 5.000001124244591e-08,
                "q1": 1.8000000068241206e-06,
                "q3": 1.8500000180665666e-06,
                "iqr_outliers": 2136,
                "stddev_outliers": 750,
                "outliers": "750;2136",
                "ld15iqr": 1.7289999902914133e-06,
                "hd15iqr": 1.928999978417778e-06,
                "ops": 534352.9045025127,
                "total": 0.08668428600219613,
                "iterations": 1
            }
        },
        {
            "group": null,
            "name": "test_04_geometrical_params",
            "fullname": "tests/benchmarks/test_benchmarks.py::test_04_geometrical_params",
            "params": null,
            "param": null,
            "extra_info": {},
            "options": {
                "disable_gc": false,
                "timer": "perf_counter",
                "min_rounds": 5,
                "max_time": 1.0,
                "min_time": 5e-06,
                "warmup": false
            },
            "stats": {
                "min": 0.48625714499999617,
                "max": 0.9290327189999914,
                "mean": 0.5839626081999996,
                "stddev": 0.19329664254551635,
                "rounds": 5,
                "median": 0.5005061729999909,
                "iqr": 0.13285893899998058,
                "q1": 0.48698814000001533,
                "q3": 0.6198470789999959,
                "iqr_outliers": 1,
                "stddev_outliers": 1,
                "outliers": "1;1",
                "ld15iqr": 0.48625714499999617,
                "hd15iqr": 0.9290327189999914,
                "ops": 1.712438409511167,
                "total": 2.9198130409999976,
                "iterations": 1
            }
        },
        {
            "group": null,
            "name": "test_05_modulation",
            "fullname": "tests/benchmarks/test_benchmarks.py::test_05_modulation",
            "params": null,
            "param": null,
            "extra_info": {},
            "options": {
                "disable_gc": false,
                "timer": "perf_counter",
                "min_rounds": 5,
                "max_time": 1.0,
                "min_time": 5e-06,
                "warmup": false
            },
            "stats": {
                "min": 0.12402923600001259,
                "max": 0.12974703399999044,
                "mean": 0.126008866625007,
                "stddev": 0.002230674562307843,
                "rounds": 8,
                "median": 0.12520861000000139,
                "iqr": 0.003185209499989128,
                "q1": 0.12437675600001796,
                "q3": 0.1275619655000071,
                "iqr_outliers": 0,
                "stddev_outliers": 2,
                "outliers": "2;0",
                "ld15iqr": 0.12402923600001259,
                "hd15iqr": 0.12974703399999044,
                "ops": 7.935949483427429,
                "total": 1.008070933000056,
                "iterations": 1
            }
        },
        {
            "group": null,
            "name": "test_06_radiation_pressure",
            "fullname": "tests/benchmarks/test_benchmarks.py::test_06_radiation_pressure",
            "params": null,
            "param": null,
            "extra_info": {},
            "options": {
                "disable_gc": false,
                "timer": "perf_counter",
                "min_rounds": 5,
                "max_time": 1.0,
                "min_time": 5e-06,
                "warmup": false
            },
            "stats": {
                "min": 0.24950548199998934,
                "max": 0.8224815909999847,
                "mean": 0.3677669607999917,
                "stddev": 0.25420855060420605,
                "rounds": 5,
                "median": 0.25514533999998434,
                "iqr": 0.14504089899999428,
                "q1": 0.25336633124999963,
                "q3": 0.3984072302499939,
                "iqr_outliers": 1,
                "stddev_outliers": 1,
                "outliers": "1;1",
                "ld15iqr": 0.24950548199998934,
                "hd15iqr": 0.8224815909999847,
                "ops": 2.7191132064303223,
                "total": 1.8388348039999585,
                "iterations": 1
            }
        },
        {
            "group": null,
            "name": "test_07_homodyne",
            "fullname": "tests/benchmarks/test_benchmarks.py::test_07_homodyne",
            "params": null,
            "param": null,
            "extra_info": {},
            "options": {
                "disable_gc": false,
                "timer": "perf_counter",
                "min_rounds": 5,
                "max_time": 1.0,
                "min_time": 5e-06,
                "warmup": false
            },
            "stats": {
                "min": 0.08267450299999268,
                "max": 0.08522206399999277,
                "mean": 0.08417337899999987,
                "stddev": 0.0008915504702130372,
                "rounds": 11,
                "median": 0.0841742440000246,
                "iqr": 0.0012882842499877256,
                "q1": 0.08361979374999606,
                "q3": 0.08490807799998379,
                "iqr_outliers": 0,
                "stddev_outliers": 4,
                "outliers": "4;0",
                "ld15iqr": 0.08267450299999268,
                "hd15iqr": 0.08522206399999277,
                "ops": 11.880240663737661,
                "total": 0.9259071689999985,
                "iterations": 1
            }
        },
        {
            "group": null,
            "name": "test_08_optical_spring",
            "fullname": "tests/benchmarks/test_benchmarks.py::test_08_optical_spring",
            "params": null,
            "param": null,
            "extra_info": {},
            "options": {
                "disable_gc": false,
                "timer": "perf_counter",
                "min_rounds": 5,
                "max_time": 1.0,
                "min_time": 5e-06,
                "warmup": false
            },
            "stats": {
                "min": 0.2338230249999924,
                "max": 0.9230514909999954,
                "mean": 0.37374846120000027,
                "stddev": 0.30707939062304157,
                "rounds": 5,
                "median": 0.2380819029999941,
                "iqr": 0.17624470574998696,
                "q1": 0.23415666925001233,
                "q3": 0.4104013749999993,
                "iqr_outliers": 1,
                "stddev_outliers": 1,
                "outliers": "1;1",
                "ld15iqr": 0.2338230249999924,
                "hd15iqr": 0.9230514909999954,
                "ops": 2.675596300220966,
                "total": 1.8687423060000015,
                "iterations": 1
            }
        },
        {
            "group": null,
            "name": "test_09_aligo_sensitivity",
            "fullname": "tests/benchmarks/test_benchmarks.py::test_09_aligo_sensitivity",
            "params": null,
            "param": null,
            "extra_info": {},
            "options": {
                "disable_gc": false,
                "timer": "perf_counter",
                "min_rounds": 5,
                "max_time": 1.0,
                "min_time": 5e-06,
                "warmup": false
            },
            "stats": {
                "min": 0.2575719400000196,
                "max": 0.2644596179999894,
                "mean": 0.2623268489999987,
                "stddev": 0.0027958659762305905,
                "rounds": 5,
                "median": 0.2626994889999992,
                "iqr": 0.002994984499991915,
                "q1": 0.2613451517499996,
                "q3": 0.26434013624999153,
                "iqr_outliers": 0,
                "stddev_outliers": 1,
                "outliers": "1;0",
                "ld15iqr": 0.2575719400000196,
                "hd15iqr": 0.2644596179999894,
                "ops": 3.812038317130112,
                "total": 1.3116342449999934,
                "iterations": 1
            }
        },
        {
            "group": null,
            "name": "test_10_shifted_beam",
            "fullname": "tests/benchmarks/test_benchmarks.py::test_10_shifted_beam",
            "params": null,
            "param": null,
            "extra_info": {},
            "options": {
                "disable_gc": false,
                "timer": "perf_counter",
                "min_rounds": 5,
                "max_time": 1.0,
                "min_time": 5e-06,
                "warmup": false
            },
            "stats": {
                "min": 0.733214447000023,
                "max": 1.5460299289999853,
                "mean": 0.9017638922000003,
                "stddev": 0.3602297360048389,
                "rounds": 5,
                "median": 0.7418620449999764,
                "iqr": 0.2155791899999855,
                "q1": 0.7350083420000146,
                "q3": 0.9505875320000001,
                "iqr_outliers": 1,
                "stddev_outliers": 1,
                "outliers": "1;1",
                "ld15iqr": 0.733214447000023,
                "hd15iqr": 1.5460299289999853,
                "ops": 1.1089377259942585,
                "total": 4.508819461000002,
                "iterations": 1
            }
        },
        {
            "group": null,
            "name": "test_angular_radiation_pressure",
            "fullname": "tests/benchmarks/test_benchmarks.py::test_angular_radiation_pressure",
            "params": null,
            "param": null,
            "extra_info": {},
            "options": {
                "disable_gc": false,
                "timer": "perf_counter",
                "min_rounds": 5,
                "max_time": 1.0,
                "min_time": 5e-06,
                "warmup": false
            },
            "stats": {
                "min": 0.3029473710000161,
                "max": 0.3131759789999933,
                "mean": 0.30845954220000066,
                "stddev": 0.0037548733338039655,
                "rounds": 5,
                "median": 0.30906221000000755,
                "iqr": 0.004508778749972464,
                "q1": 0.30617808600000984,
                "q3": 0.3106868647499823,
                "iqr_outliers": 0,
                "stddev_outliers": 2,
                "outliers": "2;0",
                "ld15iqr": 0.3029473710000161,
                "hd15iqr": 0.3131759789999933,
                "ops": 3.241916242460136,
                "total": 1.5422977110000033,
                "iterations": 1
            }
        },
        {
            "group": null,
            "name": "test_cavity_eigenmodes",
            "fullname": "tests/benchmarks/test_benchmarks.py::test_cavity_eigenmodes",
            "params": null,
            "param": null,
            "extra_info": {},
            "options": {
                "disable_gc": false,
                "timer": "perf_counter",
                "min_rounds": 5,
                "max_time": 1.0,
                "min_time": 5e-06,
                "warmup": false
            },
            "stats": {
                "min": 0.28217318499997646,
                "max": 1.2154279629999962,
                "mean": 0.47271353059999227,
                "stddev": 0.41521054385561623,
                "rounds": 5,
                "median": 0.28658434700000157,
                "iqr": 0.23915435550001263,
                "q1": 0.28489127499998546,
                "q3": 0.5240456304999981,
                "iqr_outliers": 1,
                "stddev_outliers": 1,
                "outliers": "1;1",
                "ld15iqr": 0.28217318499997646,
                "hd15iqr": 1.2154279629999962,
                "ops": 2.1154461111590113,
                "total": 2.3635676529999614,
                "iterations": 1
            }
        },
        {
            "group": null,
            "name": "test_coupled_cavity_commands",
            "fullname": "tests/benchmarks/test_benchmarks.py::test_coupled_cavity_commands",
            "params": null,
            "param": null,
            "extra_info": {},
            "options": {
                "disable_gc": false,
                "timer": "perf_counter",
                "min_rounds": 5,
                "max_time": 1.0,
                "min_time": 5e-06,
                "warmup": false
            },
            "stats": {
                "min": 4.579241343999996,
                "max": 6.072036314000002,
                "mean": 5.1649563156,
                "stddev": 0.7153211584597124,
                "rounds": 5,
                "median": 4.696139340000002,
                "iqr": 1.2284756005000048,
                "q1": 4.646183624499997,
                "q3": 5.874659225000002,
                "iqr_outliers": 0,
                "stddev_outliers": 1,
                "outliers": "1;0",
                "ld15iqr": 4.579241343999996,
                "hd15iqr": 6.072036314000002,
                "ops": 0.19361247973765922,
                "total": 25.824781578,
                "iterations": 1
            }
        },
        {
            "group": null,
            "name": "test_frequency_dependant_squeezing",
            "fullname": "tests/benchmarks/test_benchmarks.py::test_frequency_dependant_squeezing",
            "params": null,
            "param": null,
            "extra_info": {},
            "options": {
                "disable_gc": false,
                "timer": "perf_counter",
                "min_rounds": 5,
                "max_time": 1.0,
                "min_time": 5e-06,
                "warmup": false
            },
            "stats": {
                "min": 1.5298081519999869,
                "max": 1.6101864750000061,
                "mean": 1.5657528952000006,
                "stddev": 0.03689563785078863,
                "rounds": 5,
                "median": 1.5440693820000035,
                "iqr": 0.06280588299998868,
                "q1": 1.5403590620000074,
                "q3": 1.603164944999996,
                "iqr_outliers": 0,
                "stddev_outliers": 1,
                "outliers": "1;0",
                "ld15iqr": 1.5298081519999869,
                "hd15iqr": 1.6101864750000061,
                "ops": 0.6386703821948005,
                "total": 7.8287644760000035,
                "iterations": 1
            }
        },
        {
            "group": null,
            "name": "test_lock_actions",
            "fullname": "tests/benchmarks/test_benchmarks.py::test_lock_actions",
            "params": null,
            "param": null,
            "extra_info": {},
            "options": {
                "disable_gc": false,
                "timer": "perf_counter",
                "min_rounds": 5,
                "max_time": 1.0,
                "min_time": 5e-06,
                "warmup": false
            },
            "stats": {
                "min": 3.2097610099999656,
                "max": 3.2488033519999817,
                "mean": 3.21851735759999,
                "stddev": 0.016977442109077704,
                "rounds": 5,
                "median": 3.2107597899999973,
                "iqr": 0.011883004500020888,
                "q1": 3.2101025314999845,
                "q3": 3.2219855360000054,
                "iqr_outliers": 1,
                "stddev_outliers": 1,
                "outliers": "1;1",
                "ld15iqr": 3.2097610099999656,
                "hd15iqr": 3.2488033519999817,
                "ops": 0.31070206834170633,
                "total": 16.09258678799995,
                "iterations": 1
            }
        }
    ],
    "datetime": "2024-06-28T14:59:08.383472",
    "version": "4.0.0"
}