{
    "machine_info": {
        "node": "runner-nn8vmrs9z-project-39604133-concurrent-0",
        "processor": "",
        "machine": "x86_64",
        "python_compiler": "GCC 12.2.0",
        "python_implementation": "CPython",
        "python_implementation_version": "3.12.2",
        "python_version": "3.12.2",
        "python_build": [
            "main",
            "Mar 12 2024 11:02:14"
        ],
        "release": "5.4.109+",
        "system": "Linux",
        "cpu": {
            "python_version": "3.12.2.final.0 (64 bit)",
            "cpuinfo_version": [
                9,
                0,
                0
            ],
            "cpuinfo_version_string": "9.0.0",
            "arch": "X86_64",
            "bits": 64,
            "count": 2,
            "arch_string_raw": "x86_64",
            "vendor_id_raw": "AuthenticAMD",
            "brand_raw": "AMD EPYC 7B12",
            "hz_advertised_friendly": "2.2500 GHz",
            "hz_actual_friendly": "2.2500 GHz",
            "hz_advertised": [
                2249998000,
                0
            ],
            "hz_actual": [
                2249998000,
                0
            ],
            "model": 49,
            "family": 23,
            "flags": [
                "3dnowext",
                "3dnowprefetch",
                "abm",
                "adx",
                "aes",
                "apic",
                "arat",
                "avx",
                "avx2",
                "bmi1",
                "bmi2",
                "clflush",
                "clflushopt",
                "clwb",
                "clzero",
                "cmov",
                "cmp_legacy",
                "constant_tsc",
                "cpuid",
                "cr8_legacy",
                "cx16",
                "cx8",
                "de",
                "extd_apicid",
                "f16c",
                "fma",
                "fpu",
                "fsgsbase",
                "fxsr",
                "fxsr_opt",
                "ht",
                "hypervisor",
                "ibpb",
                "ibrs",
                "lahf_lm",
                "lm",
                "mca",
                "mce",
                "misalignsse",
                "mmx",
                "mmxext",
                "movbe",
                "msr",
                "mtrr",
                "nonstop_tsc",
                "nopl",
                "npt",
                "nrip_save",
                "nx",
                "osvw",
                "osxsave",
                "pae",
                "pat",
                "pclmulqdq",
                "pdpe1gb",
                "pge",
                "pni",
                "popcnt",
                "pse",
                "pse36",
                "rdpid",
                "rdrand",
                "rdrnd",
                "rdseed",
                "rdtscp",
                "rep_good",
                "sep",
                "sha",
                "sha_ni",
                "smap",
                "smep",
                "ssbd",
                "sse",
                "sse2",
                "sse4_1",
                "sse4_2",
                "sse4a",
                "ssse3",
                "stibp",
                "syscall",
                "topoext",
                "tsc",
                "tsc_adjust",
                "tsc_known_freq",
                "umip",
                "vme",
                "vmmcall",
                "x2apic",
                "xgetbv1",
                "xsave",
                "xsavec",
                "xsaveerptr",
                "xsaveopt"
            ],
            "l3_cache_size": 524288,
            "l2_cache_size": 524288,
            "l1_data_cache_size": 32768,
            "l1_instruction_cache_size": 32768,
            "l2_cache_line_size": 512,
            "l2_cache_associativity": 6
        }
    },
    "commit_info": {
        "id": "3a7be7cc464cffe2c16354caf22b1a57311b23a3",
        "time": "2024-04-09T16:50:46+02:00",
        "author_time": "2024-04-09T16:50:46+02:00",
        "dirty": false,
        "project": "finesse3",
        "branch": "(detached head)"
    },
    "benchmarks": [
        {
            "group": null,
            "name": "test_01_simple_cav",
            "fullname": "tests/benchmarks/test_benchmarks.py::test_01_simple_cav",
            "params": null,
            "param": null,
            "extra_info": {},
            "options": {
                "disable_gc": false,
                "timer": "perf_counter",
                "min_rounds": 5,
                "max_time": 1.0,
                "min_time": 5e-06,
                "warmup": false
            },
            "stats": {
                "min": 0.36361277999999686,
                "max": 0.5340716799999967,
                "mean": 0.40340843500000007,
                "stddev": 0.07328827825600327,
                "rounds": 5,
                "median": 0.3745251210000049,
                "iqr": 0.05166695499999463,
                "q1": 0.36568930275000255,
                "q3": 0.4173562577499972,
                "iqr_outliers": 1,
                "stddev_outliers": 1,
                "outliers": "1;1",
                "ld15iqr": 0.36361277999999686,
                "hd15iqr": 0.5340716799999967,
                "ops": 2.4788772698815777,
                "total": 2.0170421750000003,
                "iterations": 1
            }
        },
        {
            "group": null,
            "name": "test_02_pdh_lock",
            "fullname": "tests/benchmarks/test_benchmarks.py::test_02_pdh_lock",
            "params": null,
            "param": null,
            "extra_info": {},
            "options": {
                "disable_gc": false,
                "timer": "perf_counter",
                "min_rounds": 5,
                "max_time": 1.0,
                "min_time": 5e-06,
                "warmup": false
            },
            "stats": {
                "min": 1.297113022000005,
                "max": 1.5829234210000038,
                "mean": 1.3603142204000023,
                "stddev": 0.12477589147892197,
                "rounds": 5,
                "median": 1.3043087620000051,
                "iqr": 0.0880271010000051,
                "q1": 1.2974507162499975,
                "q3": 1.3854778172500026,
                "iqr_outliers": 1,
                "stddev_outliers": 1,
                "outliers": "1;1",
                "ld15iqr": 1.297113022000005,
                "hd15iqr": 1.5829234210000038,
                "ops": 0.7351242712922229,
                "total": 6.801571102000011,
                "iterations": 1
            }
        },
        {
            "group": null,
            "name": "test_03_near_unstable",
            "fullname": "tests/benchmarks/test_benchmarks.py::test_03_near_unstable",
            "params": null,
            "param": null,
            "extra_info": {},
            "options": {
                "disable_gc": false,
                "timer": "perf_counter",
                "min_rounds": 5,
                "max_time": 1.0,
                "min_time": 5e-06,
                "warmup": false
            },
            "stats": {
                "min": 1.6999999985500835e-06,
                "max": 7.254800000566775e-05,
                "mean": 2.600849060394966e-06,
                "stddev": 1.1475449432675416e-06,
                "rounds": 50179,
                "median": 3.1000000006997652e-06,
                "iqr": 1.3889999905813966e-06,
                "q1": 1.7899999988912896e-06,
                "q3": 3.178999989472686e-06,
                "iqr_outliers": 322,
                "stddev_outliers": 381,
                "outliers": "381;322",
                "ld15iqr": 1.6999999985500835e-06,
                "hd15iqr": 5.268999998975232e-06,
                "ops": 384489.8249682123,
                "total": 0.130508005001559,
                "iterations": 1
            }
        },
        {
            "group": null,
            "name": "test_04_geometrical_params",
            "fullname": "tests/benchmarks/test_benchmarks.py::test_04_geometrical_params",
            "params": null,
            "param": null,
            "extra_info": {},
            "options": {
                "disable_gc": false,
                "timer": "perf_counter",
                "min_rounds": 5,
                "max_time": 1.0,
                "min_time": 5e-06,
                "warmup": false
            },
            "stats": {
                "min": 0.5109545419999932,
                "max": 0.8939569280000228,
                "mean": 0.6531546674000026,
                "stddev": 0.19180981483959125,
                "rounds": 5,
                "median": 0.5197378490000091,
                "iqr": 0.33422544750001393,
                "q1": 0.5114227167499905,
                "q3": 0.8456481642500044,
                "iqr_outliers": 0,
                "stddev_outliers": 1,
                "outliers": "1;0",
                "ld15iqr": 0.5109545419999932,
                "hd15iqr": 0.8939569280000228,
                "ops": 1.5310309332714047,
                "total": 3.265773337000013,
                "iterations": 1
            }
        },
        {
            "group": null,
            "name": "test_05_modulation",
            "fullname": "tests/benchmarks/test_benchmarks.py::test_05_modulation",
            "params": null,
            "param": null,
            "extra_info": {},
            "options": {
                "disable_gc": false,
                "timer": "perf_counter",
                "min_rounds": 5,
                "max_time": 1.0,
                "min_time": 5e-06,
                "warmup": false
            },
            "stats": {
                "min": 0.1699998530000073,
                "max": 0.1854911419999894,
                "mean": 0.17904270028571595,
                "stddev": 0.005327023839438243,
                "rounds": 7,
                "median": 0.17989496100000224,
                "iqr": 0.007498860999987755,
                "q1": 0.1758881345000063,
                "q3": 0.18338699549999404,
                "iqr_outliers": 0,
                "stddev_outliers": 2,
                "outliers": "2;0",
                "ld15iqr": 0.1699998530000073,
                "hd15iqr": 0.1854911419999894,
                "ops": 5.585259820166933,
                "total": 1.2532989020000116,
                "iterations": 1
            }
        },
        {
            "group": null,
            "name": "test_06_radiation_pressure",
            "fullname": "tests/benchmarks/test_benchmarks.py::test_06_radiation_pressure",
            "params": null,
            "param": null,
            "extra_info": {},
            "options": {
                "disable_gc": false,
                "timer": "perf_counter",
                "min_rounds": 5,
                "max_time": 1.0,
                "min_time": 5e-06,
                "warmup": false
            },
            "stats": {
                "min": 0.2378154879999954,
                "max": 0.7297294630000124,
                "mean": 0.33896484800000054,
                "stddev": 0.21847907975113445,
                "rounds": 5,
                "median": 0.24151474999999323,
                "iqr": 0.13001494950001558,
                "q1": 0.2380973462499938,
                "q3": 0.36811229575000937,
                "iqr_outliers": 1,
                "stddev_outliers": 1,
                "outliers": "1;1",
                "ld15iqr": 0.2378154879999954,
                "hd15iqr": 0.7297294630000124,
                "ops": 2.9501584187868306,
                "total": 1.6948242400000026,
                "iterations": 1
            }
        },
        {
            "group": null,
            "name": "test_07_homodyne",
            "fullname": "tests/benchmarks/test_benchmarks.py::test_07_homodyne",
            "params": null,
            "param": null,
            "extra_info": {},
            "options": {
                "disable_gc": false,
                "timer": "perf_counter",
                "min_rounds": 5,
                "max_time": 1.0,
                "min_time": 5e-06,
                "warmup": false
            },
            "stats": {
                "min": 0.11026490200001149,
                "max": 0.11742137300001332,
                "mean": 0.11411924850000048,
                "stddev": 0.0022336931390437836,
                "rounds": 10,
                "median": 0.11454715949999184,
                "iqr": 0.0032088960000180577,
                "q1": 0.11216788199999428,
                "q3": 0.11537677800001234,
                "iqr_outliers": 0,
                "stddev_outliers": 3,
                "outliers": "3;0",
                "ld15iqr": 0.11026490200001149,
                "hd15iqr": 0.11742137300001332,
                "ops": 8.76276362790801,
                "total": 1.1411924850000048,
                "iterations": 1
            }
        },
        {
            "group": null,
            "name": "test_08_optical_spring",
            "fullname": "tests/benchmarks/test_benchmarks.py::test_08_optical_spring",
            "params": null,
            "param": null,
            "extra_info": {},
            "options": {
                "disable_gc": false,
                "timer": "perf_counter",
                "min_rounds": 5,
                "max_time": 1.0,
                "min_time": 5e-06,
                "warmup": false
            },
            "stats": {
                "min": 0.29646011599999156,
                "max": 0.30318855900000585,
                "mean": 0.2993666996000002,
                "stddev": 0.002556991152453663,
                "rounds": 5,
                "median": 0.29937030900001105,
                "iqr": 0.0034171217499832096,
                "q1": 0.2974279662500052,
                "q3": 0.30084508799998844,
                "iqr_outliers": 0,
                "stddev_outliers": 2,
                "outliers": "2;0",
                "ld15iqr": 0.29646011599999156,
                "hd15iqr": 0.30318855900000585,
                "ops": 3.3403848902905815,
                "total": 1.4968334980000009,
                "iterations": 1
            }
        },
        {
            "group": null,
            "name": "test_09_aligo_sensitivity",
            "fullname": "tests/benchmarks/test_benchmarks.py::test_09_aligo_sensitivity",
            "params": null,
            "param": null,
            "extra_info": {},
            "options": {
                "disable_gc": false,
                "timer": "perf_counter",
                "min_rounds": 5,
                "max_time": 1.0,
                "min_time": 5e-06,
                "warmup": false
            },
            "stats": {
                "min": 0.3216391109999961,
                "max": 0.33866434999998773,
                "mean": 0.32703681780000127,
                "stddev": 0.006860569358585533,
                "rounds": 5,
                "median": 0.32467521000000943,
                "iqr": 0.007754263249992732,
                "q1": 0.3224878327500065,
                "q3": 0.3302420959999992,
                "iqr_outliers": 0,
                "stddev_outliers": 1,
                "outliers": "1;0",
                "ld15iqr": 0.3216391109999961,
                "hd15iqr": 0.33866434999998773,
                "ops": 3.0577596942358585,
                "total": 1.6351840890000062,
                "iterations": 1
            }
        },
        {
            "group": null,
            "name": "test_10_shifted_beam",
            "fullname": "tests/benchmarks/test_benchmarks.py::test_10_shifted_beam",
            "params": null,
            "param": null,
            "extra_info": {},
            "options": {
                "disable_gc": false,
                "timer": "perf_counter",
                "min_rounds": 5,
                "max_time": 1.0,
                "min_time": 5e-06,
                "warmup": false
            },
            "stats": {
                "min": 0.7301751969999941,
                "max": 1.4597097319999932,
                "mean": 0.8815303002000008,
                "stddev": 0.3232480161303034,
                "rounds": 5,
                "median": 0.738494381999999,
                "iqr": 0.188202036249983,
                "q1": 0.7343616692500134,
                "q3": 0.9225637054999964,
                "iqr_outliers": 1,
                "stddev_outliers": 1,
                "outliers": "1;1",
                "ld15iqr": 0.7301751969999941,
                "hd15iqr": 1.4597097319999932,
                "ops": 1.134390956014922,
                "total": 4.407651501000004,
                "iterations": 1
            }
        },
        {
            "group": null,
            "name": "test_angular_radiation_pressure",
            "fullname": "tests/benchmarks/test_benchmarks.py::test_angular_radiation_pressure",
            "params": null,
            "param": null,
            "extra_info": {},
            "options": {
                "disable_gc": false,
                "timer": "perf_counter",
                "min_rounds": 5,
                "max_time": 1.0,
                "min_time": 5e-06,
                "warmup": false
            },
            "stats": {
                "min": 0.3308105560000172,
                "max": 0.3508509600000025,
                "mean": 0.337027150199998,
                "stddev": 0.008233385009985085,
                "rounds": 5,
                "median": 0.33448978100000204,
                "iqr": 0.009998682499990252,
                "q1": 0.33107751849999545,
                "q3": 0.3410762009999857,
                "iqr_outliers": 0,
                "stddev_outliers": 1,
                "outliers": "1;0",
                "ld15iqr": 0.3308105560000172,
                "hd15iqr": 0.3508509600000025,
                "ops": 2.9671200062267444,
                "total": 1.68513575099999,
                "iterations": 1
            }
        },
        {
            "group": null,
            "name": "test_cavity_eigenmodes",
            "fullname": "tests/benchmarks/test_benchmarks.py::test_cavity_eigenmodes",
            "params": null,
            "param": null,
            "extra_info": {},
            "options": {
                "disable_gc": false,
                "timer": "perf_counter",
                "min_rounds": 5,
                "max_time": 1.0,
                "min_time": 5e-06,
                "warmup": false
            },
            "stats": {
                "min": 0.25422533700000827,
                "max": 1.173198305999989,
                "mean": 0.44824854400000047,
                "stddev": 0.4053705244494546,
                "rounds": 5,
                "median": 0.26808435499998495,
                "iqr": 0.24172599824998997,
                "q1": 0.26221547700001224,
                "q3": 0.5039414752500022,
                "iqr_outliers": 1,
                "stddev_outliers": 1,
                "outliers": "1;1",
                "ld15iqr": 0.25422533700000827,
                "hd15iqr": 1.173198305999989,
                "ops": 2.2309051828175015,
                "total": 2.2412427200000025,
                "iterations": 1
            }
        },
        {
            "group": null,
            "name": "test_coupled_cavity_commands",
            "fullname": "tests/benchmarks/test_benchmarks.py::test_coupled_cavity_commands",
            "params": null,
            "param": null,
            "extra_info": {},
            "options": {
                "disable_gc": false,
                "timer": "perf_counter",
                "min_rounds": 5,
                "max_time": 1.0,
                "min_time": 5e-06,
                "warmup": false
            },
            "stats": {
                "min": 4.351327760000004,
                "max": 5.481042204000005,
                "mean": 4.792017239800003,
                "stddev": 0.5937284169086525,
                "rounds": 5,
                "median": 4.366077654000009,
                "iqr": 1.0646573792499936,
                "q1": 4.357332023750004,
                "q3": 5.421989402999998,
                "iqr_outliers": 0,
                "stddev_outliers": 2,
                "outliers": "2;0",
                "ld15iqr": 4.351327760000004,
                "hd15iqr": 5.481042204000005,
                "ops": 0.2086803844724347,
                "total": 23.960086199000017,
                "iterations": 1
            }
        },
        {
            "group": null,
            "name": "test_frequency_dependant_squeezing",
            "fullname": "tests/benchmarks/test_benchmarks.py::test_frequency_dependant_squeezing",
            "params": null,
            "param": null,
            "extra_info": {},
            "options": {
                "disable_gc": false,
                "timer": "perf_counter",
                "min_rounds": 5,
                "max_time": 1.0,
                "min_time": 5e-06,
                "warmup": false
            },
            "stats": {
                "min": 1.492083569000016,
                "max": 1.5241871120000212,
                "mean": 1.5107429402000037,
                "stddev": 0.012205528352531764,
                "rounds": 5,
                "median": 1.5151286690000063,
                "iqr": 0.015328526999979886,
                "q1": 1.5027378282500052,
                "q3": 1.5180663552499851,
                "iqr_outliers": 0,
                "stddev_outliers": 2,
                "outliers": "2;0",
                "ld15iqr": 1.492083569000016,
                "hd15iqr": 1.5241871120000212,
                "ops": 0.661925979192471,
                "total": 7.553714701000018,
                "iterations": 1
            }
        },
        {
            "group": null,
            "name": "test_lock_actions",
            "fullname": "tests/benchmarks/test_benchmarks.py::test_lock_actions",
            "params": null,
            "param": null,
            "extra_info": {},
            "options": {
                "disable_gc": false,
                "timer": "perf_counter",
                "min_rounds": 5,
                "max_time": 1.0,
                "min_time": 5e-06,
                "warmup": false
            },
            "stats": {
                "min": 4.923467063999993,
                "max": 5.189578299999994,
                "mean": 5.004732312599993,
                "stddev": 0.11263726193518851,
                "rounds": 5,
                "median": 4.94780503299998,
                "iqr": 0.14623656999999213,
                "q1": 4.92706657275,
                "q3": 5.073303142749992,
                "iqr_outliers": 0,
                "stddev_outliers": 1,
                "outliers": "1;0",
                "ld15iqr": 4.923467063999993,
                "hd15iqr": 5.189578299999994,
                "ops": 0.19981088648485443,
                "total": 25.023661562999962,
                "iterations": 1
            }
        }
    ],
    "datetime": "2024-04-09T15:00:02.596865",
    "version": "4.0.0"
}