{
    "machine_info": {
        "node": "runner-j2nyww-s-project-39604133-concurrent-0",
        "processor": "",
        "machine": "x86_64",
        "python_compiler": "GCC 12.2.0",
        "python_implementation": "CPython",
        "python_implementation_version": "3.12.3",
        "python_version": "3.12.3",
        "python_build": [
            "main",
            "Apr 24 2024 11:17:35"
        ],
        "release": "5.4.109+",
        "system": "Linux",
        "cpu": {
            "python_version": "3.12.3.final.0 (64 bit)",
            "cpuinfo_version": [
                9,
                0,
                0
            ],
            "cpuinfo_version_string": "9.0.0",
            "arch": "X86_64",
            "bits": 64,
            "count": 2,
            "arch_string_raw": "x86_64",
            "vendor_id_raw": "AuthenticAMD",
            "brand_raw": "AMD EPYC 7B13",
            "hz_advertised_friendly": "2.4500 GHz",
            "hz_actual_friendly": "2.4500 GHz",
            "hz_advertised": [
                2449998000,
                0
            ],
            "hz_actual": [
                2449998000,
                0
            ],
            "model": 1,
            "family": 25,
            "flags": [
                "3dnowext",
                "3dnowprefetch",
                "abm",
                "adx",
                "aes",
                "apic",
                "arat",
                "avx",
                "avx2",
                "bmi1",
                "bmi2",
                "clflush",
                "clflushopt",
                "clwb",
                "clzero",
                "cmov",
                "cmp_legacy",
                "constant_tsc",
                "cpuid",
                "cr8_legacy",
                "cx16",
                "cx8",
                "de",
                "erms",
                "extd_apicid",
                "f16c",
                "fma",
                "fpu",
                "fsgsbase",
                "fxsr",
                "fxsr_opt",
                "ht",
                "hypervisor",
                "ibpb",
                "ibrs",
                "invpcid",
                "invpcid_single",
                "lahf_lm",
                "lm",
                "mca",
                "mce",
                "misalignsse",
                "mmx",
                "mmxext",
                "movbe",
                "msr",
                "mtrr",
                "nonstop_tsc",
                "nopl",
                "npt",
                "nrip_save",
                "nx",
                "osvw",
                "osxsave",
                "pae",
                "pat",
                "pcid",
                "pclmulqdq",
                "pdpe1gb",
                "pge",
                "pni",
                "popcnt",
                "pse",
                "pse36",
                "rdpid",
                "rdrand",
                "rdrnd",
                "rdseed",
                "rdtscp",
                "rep_good",
                "sep",
                "sha",
                "sha_ni",
                "smap",
                "smep",
                "ssbd",
                "sse",
                "sse2",
                "sse4_1",
                "sse4_2",
                "sse4a",
                "ssse3",
                "stibp",
                "syscall",
                "topoext",
                "tsc",
                "tsc_adjust",
                "tsc_known_freq",
                "umip",
                "vaes",
                "vme",
                "vmmcall",
                "vpclmulqdq",
                "x2apic",
                "xgetbv1",
                "xsave",
                "xsavec",
                "xsaveerptr",
                "xsaveopt"
            ],
            "l3_cache_size": 524288,
            "l2_cache_size": 524288,
            "l1_data_cache_size": 32768,
            "l1_instruction_cache_size": 32768,
            "l2_cache_line_size": 512,
            "l2_cache_associativity": 6
        }
    },
    "commit_info": {
        "id": "feb6fc3c749f92f3d4b44704cb31d7001a29584a",
        "time": "2024-04-24T09:07:38-05:00",
        "author_time": "2024-04-24T09:07:38-05:00",
        "dirty": false,
        "project": "finesse3",
        "branch": "(detached head)"
    },
    "benchmarks": [
        {
            "group": null,
            "name": "test_01_simple_cav",
            "fullname": "tests/benchmarks/test_benchmarks.py::test_01_simple_cav",
            "params": null,
            "param": null,
            "extra_info": {},
            "options": {
                "disable_gc": false,
                "timer": "perf_counter",
                "min_rounds": 5,
                "max_time": 1.0,
                "min_time": 5e-06,
                "warmup": false
            },
            "stats": {
                "min": 0.35066548600002534,
                "max": 0.554850346999956,
                "mean": 0.4287515210000038,
                "stddev": 0.0990638367720703,
                "rounds": 5,
                "median": 0.3622980960000177,
                "iqr": 0.1704359732499654,
                "q1": 0.3564503710000224,
                "q3": 0.5268863442499878,
                "iqr_outliers": 0,
                "stddev_outliers": 1,
                "outliers": "1;0",
                "ld15iqr": 0.35066548600002534,
                "hd15iqr": 0.554850346999956,
                "ops": 2.33235324196084,
                "total": 2.143757605000019,
                "iterations": 1
            }
        },
        {
            "group": null,
            "name": "test_02_pdh_lock",
            "fullname": "tests/benchmarks/test_benchmarks.py::test_02_pdh_lock",
            "params": null,
            "param": null,
            "extra_info": {},
            "options": {
                "disable_gc": false,
                "timer": "perf_counter",
                "min_rounds": 5,
                "max_time": 1.0,
                "min_time": 5e-06,
                "warmup": false
            },
            "stats": {
                "min": 1.3283713729999818,
                "max": 1.670706150000001,
                "mean": 1.4543191285999684,
                "stddev": 0.16518393875506973,
                "rounds": 5,
                "median": 1.340431080999906,
                "iqr": 0.27887819050008034,
                "q1": 1.33497823474994,
                "q3": 1.6138564252500203,
                "iqr_outliers": 0,
                "stddev_outliers": 1,
                "outliers": "1;0",
                "ld15iqr": 1.3283713729999818,
                "hd15iqr": 1.670706150000001,
                "ops": 0.6876069910203764,
                "total": 7.271595642999841,
                "iterations": 1
            }
        },
        {
            "group": null,
            "name": "test_03_near_unstable",
            "fullname": "tests/benchmarks/test_benchmarks.py::test_03_near_unstable",
            "params": null,
            "param": null,
            "extra_info": {},
            "options": {
                "disable_gc": false,
                "timer": "perf_counter",
                "min_rounds": 5,
                "max_time": 1.0,
                "min_time": 5e-06,
                "warmup": false
            },
            "stats": {
                "min": 1.740000016070553e-06,
                "max": 9.559000000081141e-05,
                "mean": 2.63099429883584e-06,
                "stddev": 1.313242716628017e-06,
                "rounds": 45956,
                "median": 3.11000007968687e-06,
                "iqr": 1.351000037175254e-06,
                "q1": 1.8289999843545957e-06,
                "q3": 3.1800000215298496e-06,
                "iqr_outliers": 268,
                "stddev_outliers": 555,
                "outliers": "555;268",
                "ld15iqr": 1.740000016070553e-06,
                "hd15iqr": 5.330000021785963e-06,
                "ops": 380084.4420082853,
                "total": 0.12090997399729986,
                "iterations": 1
            }
        },
        {
            "group": null,
            "name": "test_04_geometrical_params",
            "fullname": "tests/benchmarks/test_benchmarks.py::test_04_geometrical_params",
            "params": null,
            "param": null,
            "extra_info": {},
            "options": {
                "disable_gc": false,
                "timer": "perf_counter",
                "min_rounds": 5,
                "max_time": 1.0,
                "min_time": 5e-06,
                "warmup": false
            },
            "stats": {
                "min": 0.5047267019999708,
                "max": 0.8494898179999382,
                "mean": 0.5889413676000004,
                "stddev": 0.14701785576842097,
                "rounds": 5,
                "median": 0.5239301500000693,
                "iqr": 0.12066760850001401,
                "q1": 0.5089033237499905,
                "q3": 0.6295709322500045,
                "iqr_outliers": 1,
                "stddev_outliers": 1,
                "outliers": "1;1",
                "ld15iqr": 0.5047267019999708,
                "hd15iqr": 0.8494898179999382,
                "ops": 1.6979618940253898,
                "total": 2.944706838000002,
                "iterations": 1
            }
        },
        {
            "group": null,
            "name": "test_05_modulation",
            "fullname": "tests/benchmarks/test_benchmarks.py::test_05_modulation",
            "params": null,
            "param": null,
            "extra_info": {},
            "options": {
                "disable_gc": false,
                "timer": "perf_counter",
                "min_rounds": 5,
                "max_time": 1.0,
                "min_time": 5e-06,
                "warmup": false
            },
            "stats": {
                "min": 0.1670402740001009,
                "max": 0.17659834299990962,
                "mean": 0.1722373478571626,
                "stddev": 0.003301173739308359,
                "rounds": 7,
                "median": 0.17317133300002752,
                "iqr": 0.0039782262500409615,
                "q1": 0.1696606770000244,
                "q3": 0.17363890325006537,
                "iqr_outliers": 0,
                "stddev_outliers": 3,
                "outliers": "3;0",
                "ld15iqr": 0.1670402740001009,
                "hd15iqr": 0.17659834299990962,
                "ops": 5.8059416987151105,
                "total": 1.2056614350001382,
                "iterations": 1
            }
        },
        {
            "group": null,
            "name": "test_06_radiation_pressure",
            "fullname": "tests/benchmarks/test_benchmarks.py::test_06_radiation_pressure",
            "params": null,
            "param": null,
            "extra_info": {},
            "options": {
                "disable_gc": false,
                "timer": "perf_counter",
                "min_rounds": 5,
                "max_time": 1.0,
                "min_time": 5e-06,
                "warmup": false
            },
            "stats": {
                "min": 0.23323512799993296,
                "max": 0.24106120700002975,
                "mean": 0.236666973399997,
                "stddev": 0.0034622660444662817,
                "rounds": 5,
                "median": 0.2347832570000037,
                "iqr": 0.005764493999976139,
                "q1": 0.23425052300001425,
                "q3": 0.2400150169999904,
                "iqr_outliers": 0,
                "stddev_outliers": 1,
                "outliers": "1;0",
                "ld15iqr": 0.23323512799993296,
                "hd15iqr": 0.24106120700002975,
                "ops": 4.225346636388822,
                "total": 1.183334866999985,
                "iterations": 1
            }
        },
        {
            "group": null,
            "name": "test_07_homodyne",
            "fullname": "tests/benchmarks/test_benchmarks.py::test_07_homodyne",
            "params": null,
            "param": null,
            "extra_info": {},
            "options": {
                "disable_gc": false,
                "timer": "perf_counter",
                "min_rounds": 5,
                "max_time": 1.0,
                "min_time": 5e-06,
                "warmup": false
            },
            "stats": {
                "min": 0.11287428899993301,
                "max": 0.6135412219999807,
                "mean": 0.1653543261999971,
                "stddev": 0.15748929021739072,
                "rounds": 10,
                "median": 0.11586346400002867,
                "iqr": 0.003515330000141148,
                "q1": 0.11401188899992576,
                "q3": 0.11752721900006691,
                "iqr_outliers": 1,
                "stddev_outliers": 1,
                "outliers": "1;1",
                "ld15iqr": 0.11287428899993301,
                "hd15iqr": 0.6135412219999807,
                "ops": 6.047619212517571,
                "total": 1.653543261999971,
                "iterations": 1
            }
        },
        {
            "group": null,
            "name": "test_08_optical_spring",
            "fullname": "tests/benchmarks/test_benchmarks.py::test_08_optical_spring",
            "params": null,
            "param": null,
            "extra_info": {},
            "options": {
                "disable_gc": false,
                "timer": "perf_counter",
                "min_rounds": 5,
                "max_time": 1.0,
                "min_time": 5e-06,
                "warmup": false
            },
            "stats": {
                "min": 0.2879345019999846,
                "max": 0.29922771199994713,
                "mean": 0.2942891857999939,
                "stddev": 0.0044039109484361365,
                "rounds": 5,
                "median": 0.29366357200001403,
                "iqr": 0.006232441749972395,
                "q1": 0.2917616095000142,
                "q3": 0.29799405124998657,
                "iqr_outliers": 0,
                "stddev_outliers": 2,
                "outliers": "2;0",
                "ld15iqr": 0.2879345019999846,
                "hd15iqr": 0.29922771199994713,
                "ops": 3.398018168019345,
                "total": 1.4714459289999695,
                "iterations": 1
            }
        },
        {
            "group": null,
            "name": "test_09_aligo_sensitivity",
            "fullname": "tests/benchmarks/test_benchmarks.py::test_09_aligo_sensitivity",
            "params": null,
            "param": null,
            "extra_info": {},
            "options": {
                "disable_gc": false,
                "timer": "perf_counter",
                "min_rounds": 5,
                "max_time": 1.0,
                "min_time": 5e-06,
                "warmup": false
            },
            "stats": {
                "min": 0.31981691899989073,
                "max": 0.8800045659999114,
                "mean": 0.4334674447999305,
                "stddev": 0.249625294547526,
                "rounds": 5,
                "median": 0.3225756399999682,
                "iqr": 0.14133385100004148,
                "q1": 0.32116329724991033,
                "q3": 0.4624971482499518,
                "iqr_outliers": 1,
                "stddev_outliers": 1,
                "outliers": "1;1",
                "ld15iqr": 0.31981691899989073,
                "hd15iqr": 0.8800045659999114,
                "ops": 2.306978325584649,
                "total": 2.1673372239996525,
                "iterations": 1
            }
        },
        {
            "group": null,
            "name": "test_10_shifted_beam",
            "fullname": "tests/benchmarks/test_benchmarks.py::test_10_shifted_beam",
            "params": null,
            "param": null,
            "extra_info": {},
            "options": {
                "disable_gc": false,
                "timer": "perf_counter",
                "min_rounds": 5,
                "max_time": 1.0,
                "min_time": 5e-06,
                "warmup": false
            },
            "stats": {
                "min": 0.7106053019999763,
                "max": 1.4332720419999987,
                "mean": 0.8620892872000013,
                "stddev": 0.3193413637947933,
                "rounds": 5,
                "median": 0.7215281309999,
                "iqr": 0.18222087924999641,
                "q1": 0.718764588750048,
                "q3": 0.9009854680000444,
                "iqr_outliers": 1,
                "stddev_outliers": 1,
                "outliers": "1;1",
                "ld15iqr": 0.7106053019999763,
                "hd15iqr": 1.4332720419999987,
                "ops": 1.1599726557882675,
                "total": 4.3104464360000065,
                "iterations": 1
            }
        },
        {
            "group": null,
            "name": "test_angular_radiation_pressure",
            "fullname": "tests/benchmarks/test_benchmarks.py::test_angular_radiation_pressure",
            "params": null,
            "param": null,
            "extra_info": {},
            "options": {
                "disable_gc": false,
                "timer": "perf_counter",
                "min_rounds": 5,
                "max_time": 1.0,
                "min_time": 5e-06,
                "warmup": false
            },
            "stats": {
                "min": 0.3366954779999105,
                "max": 0.34058093800001643,
                "mean": 0.3388250635999839,
                "stddev": 0.0018361060109433748,
                "rounds": 5,
                "median": 0.33987581700000646,
                "iqr": 0.003229758249972292,
                "q1": 0.33690957974999947,
                "q3": 0.34013933799997176,
                "iqr_outliers": 0,
                "stddev_outliers": 2,
                "outliers": "2;0",
                "ld15iqr": 0.3366954779999105,
                "hd15iqr": 0.34058093800001643,
                "ops": 2.951375525101643,
                "total": 1.6941253179999194,
                "iterations": 1
            }
        },
        {
            "group": null,
            "name": "test_cavity_eigenmodes",
            "fullname": "tests/benchmarks/test_benchmarks.py::test_cavity_eigenmodes",
            "params": null,
            "param": null,
            "extra_info": {},
            "options": {
                "disable_gc": false,
                "timer": "perf_counter",
                "min_rounds": 5,
                "max_time": 1.0,
                "min_time": 5e-06,
                "warmup": false
            },
            "stats": {
                "min": 0.2631488150000223,
                "max": 1.1268987919999063,
                "mean": 0.4416286398000011,
                "stddev": 0.38312862682563725,
                "rounds": 5,
                "median": 0.26943705400003637,
                "iqr": 0.22492800524992163,
                "q1": 0.2670389000000455,
                "q3": 0.4919669052499671,
                "iqr_outliers": 1,
                "stddev_outliers": 1,
                "outliers": "1;1",
                "ld15iqr": 0.2631488150000223,
                "hd15iqr": 1.1268987919999063,
                "ops": 2.2643459003312527,
                "total": 2.2081431990000056,
                "iterations": 1
            }
        },
        {
            "group": null,
            "name": "test_coupled_cavity_commands",
            "fullname": "tests/benchmarks/test_benchmarks.py::test_coupled_cavity_commands",
            "params": null,
            "param": null,
            "extra_info": {},
            "options": {
                "disable_gc": false,
                "timer": "perf_counter",
                "min_rounds": 5,
                "max_time": 1.0,
                "min_time": 5e-06,
                "warmup": false
            },
            "stats": {
                "min": 4.456342250000034,
                "max": 5.614321439000037,
                "mean": 4.891702946200008,
                "stddev": 0.5810941992707259,
                "rounds": 5,
                "median": 4.491371194999942,
                "iqr": 1.0184292705000075,
                "q1": 4.460798268500014,
                "q3": 5.479227539000021,
                "iqr_outliers": 0,
                "stddev_outliers": 1,
                "outliers": "1;0",
                "ld15iqr": 4.456342250000034,
                "hd15iqr": 5.614321439000037,
                "ops": 0.2044277853741761,
                "total": 24.458514731000037,
                "iterations": 1
            }
        },
        {
            "group": null,
            "name": "test_frequency_dependant_squeezing",
            "fullname": "tests/benchmarks/test_benchmarks.py::test_frequency_dependant_squeezing",
            "params": null,
            "param": null,
            "extra_info": {},
            "options": {
                "disable_gc": false,
                "timer": "perf_counter",
                "min_rounds": 5,
                "max_time": 1.0,
                "min_time": 5e-06,
                "warmup": false
            },
            "stats": {
                "min": 1.5564826009999706,
                "max": 2.9242612749999353,
                "mean": 1.8431186003999982,
                "stddev": 0.6045075710530269,
                "rounds": 5,
                "median": 1.5722936390000086,
                "iqr": 0.3576948987499975,
                "q1": 1.5672038427500183,
                "q3": 1.9248987415000158,
                "iqr_outliers": 1,
                "stddev_outliers": 1,
                "outliers": "1;1",
                "ld15iqr": 1.5564826009999706,
                "hd15iqr": 2.9242612749999353,
                "ops": 0.542558682758113,
                "total": 9.215593001999991,
                "iterations": 1
            }
        },
        {
            "group": null,
            "name": "test_lock_actions",
            "fullname": "tests/benchmarks/test_benchmarks.py::test_lock_actions",
            "params": null,
            "param": null,
            "extra_info": {},
            "options": {
                "disable_gc": false,
                "timer": "perf_counter",
                "min_rounds": 5,
                "max_time": 1.0,
                "min_time": 5e-06,
                "warmup": false
            },
            "stats": {
                "min": 5.04507718800005,
                "max": 6.724611256999992,
                "mean": 5.50894714399999,
                "stddev": 0.690082996036445,
                "rounds": 5,
                "median": 5.2876156669999546,
                "iqr": 0.577778179250032,
                "q1": 5.115108818999971,
                "q3": 5.692886998250003,
                "iqr_outliers": 1,
                "stddev_outliers": 1,
                "outliers": "1;1",
                "ld15iqr": 5.04507718800005,
                "hd15iqr": 6.724611256999992,
                "ops": 0.18152288883169612,
                "total": 27.54473571999995,
                "iterations": 1
            }
        }
    ],
    "datetime": "2024-04-24T14:15:45.558516",
    "version": "4.0.0"
}