{
    "machine_info": {
        "node": "runner-ns46nmmj-project-39604133-concurrent-0",
        "processor": "",
        "machine": "x86_64",
        "python_compiler": "GCC 12.2.0",
        "python_implementation": "CPython",
        "python_implementation_version": "3.12.5",
        "python_version": "3.12.5",
        "python_build": [
            "main",
            "Aug  7 2024 19:13:43"
        ],
        "release": "5.15.154+",
        "system": "Linux",
        "cpu": {
            "python_version": "3.12.5.final.0 (64 bit)",
            "cpuinfo_version": [
                9,
                0,
                0
            ],
            "cpuinfo_version_string": "9.0.0",
            "arch": "X86_64",
            "bits": 64,
            "count": 2,
            "arch_string_raw": "x86_64",
            "vendor_id_raw": "AuthenticAMD",
            "brand_raw": "AMD EPYC 7B13",
            "hz_advertised_friendly": "2.4500 GHz",
            "hz_actual_friendly": "2.4500 GHz",
            "hz_advertised": [
                2449988000,
                0
            ],
            "hz_actual": [
                2449988000,
                0
            ],
            "model": 1,
            "family": 25,
            "flags": [
                "3dnowext",
                "3dnowprefetch",
                "abm",
                "adx",
                "aes",
                "apic",
                "arat",
                "avx",
                "avx2",
                "bmi1",
                "bmi2",
                "clflush",
                "clflushopt",
                "clwb",
                "clzero",
                "cmov",
                "cmp_legacy",
                "constant_tsc",
                "cpuid",
                "cr8_legacy",
                "cx16",
                "cx8",
                "de",
                "erms",
                "extd_apicid",
                "f16c",
                "fma",
                "fpu",
                "fsgsbase",
                "fsrm",
                "fxsr",
                "fxsr_opt",
                "ht",
                "hypervisor",
                "ibpb",
                "ibrs",
                "invpcid",
                "invpcid_single",
                "lahf_lm",
                "lm",
                "mca",
                "mce",
                "misalignsse",
                "mmx",
                "mmxext",
                "movbe",
                "msr",
                "mtrr",
                "nonstop_tsc",
                "nopl",
                "npt",
                "nrip_save",
                "nx",
                "osvw",
                "osxsave",
                "pae",
                "pat",
                "pcid",
                "pclmulqdq",
                "pdpe1gb",
                "pge",
                "pni",
                "popcnt",
                "pse",
                "pse36",
                "rdpid",
                "rdrand",
                "rdrnd",
                "rdseed",
                "rdtscp",
                "rep_good",
                "sep",
                "sha",
                "sha_ni",
                "smap",
                "smep",
                "ssbd",
                "sse",
                "sse2",
                "sse4_1",
                "sse4_2",
                "sse4a",
                "ssse3",
                "stibp",
                "syscall",
                "topoext",
                "tsc",
                "tsc_adjust",
                "tsc_known_freq",
                "umip",
                "vaes",
                "vme",
                "vmmcall",
                "vpclmulqdq",
                "x2apic",
                "xgetbv1",
                "xsave",
                "xsavec",
                "xsaveerptr",
                "xsaveopt"
            ],
            "l3_cache_size": 524288,
            "l2_cache_size": 524288,
            "l1_data_cache_size": 32768,
            "l1_instruction_cache_size": 32768,
            "l2_cache_line_size": 512,
            "l2_cache_associativity": 6
        }
    },
    "commit_info": {
        "id": "b630da160167d30010e7cd04d7d2bb8d01ec5527",
        "time": "2024-08-09T10:51:29+02:00",
        "author_time": "2024-08-09T10:51:29+02:00",
        "dirty": false,
        "project": "finesse3",
        "branch": "(detached head)"
    },
    "benchmarks": [
        {
            "group": null,
            "name": "test_01_simple_cav",
            "fullname": "tests/benchmarks/test_benchmarks.py::test_01_simple_cav",
            "params": null,
            "param": null,
            "extra_info": {},
            "options": {
                "disable_gc": false,
                "timer": "perf_counter",
                "min_rounds": 5,
                "max_time": 1.0,
                "min_time": 5e-06,
                "warmup": false
            },
            "stats": {
                "min": 0.2710044779999947,
                "max": 0.48561991100000057,
                "mean": 0.3505735869999995,
                "stddev": 0.10692680008628884,
                "rounds": 5,
                "median": 0.27664073500000086,
                "iqr": 0.185825214500003,
                "q1": 0.27151649549999846,
                "q3": 0.45734171000000146,
                "iqr_outliers": 0,
                "stddev_outliers": 1,
                "outliers": "1;0",
                "ld15iqr": 0.2710044779999947,
                "hd15iqr": 0.48561991100000057,
                "ops": 2.852468175247901,
                "total": 1.7528679349999976,
                "iterations": 1
            }
        },
        {
            "group": null,
            "name": "test_02_pdh_lock",
            "fullname": "tests/benchmarks/test_benchmarks.py::test_02_pdh_lock",
            "params": null,
            "param": null,
            "extra_info": {},
            "options": {
                "disable_gc": false,
                "timer": "perf_counter",
                "min_rounds": 5,
                "max_time": 1.0,
                "min_time": 5e-06,
                "warmup": false
            },
            "stats": {
                "min": 1.1646927660000017,
                "max": 1.4174406540000035,
                "mean": 1.2266806545999969,
                "stddev": 0.10732700386889704,
                "rounds": 5,
                "median": 1.186586602999995,
                "iqr": 0.08171167649998878,
                "q1": 1.1686670580000005,
                "q3": 1.2503787344999893,
                "iqr_outliers": 1,
                "stddev_outliers": 1,
                "outliers": "1;1",
                "ld15iqr": 1.1646927660000017,
                "hd15iqr": 1.4174406540000035,
                "ops": 0.8152080953180807,
                "total": 6.133403272999985,
                "iterations": 1
            }
        },
        {
            "group": null,
            "name": "test_03_near_unstable",
            "fullname": "tests/benchmarks/test_benchmarks.py::test_03_near_unstable",
            "params": null,
            "param": null,
            "extra_info": {},
            "options": {
                "disable_gc": false,
                "timer": "perf_counter",
                "min_rounds": 5,
                "max_time": 1.0,
                "min_time": 5e-06,
                "warmup": false
            },
            "stats": {
                "min": 1.8199999942680734e-06,
                "max": 0.00010255000000825021,
                "mean": 1.9518065516552107e-06,
                "stddev": 8.575840432690459e-07,
                "rounds": 62854,
                "median": 1.889999992954472e-06,
                "iqr": 4.0999992734214175e-08,
                "q1": 1.8700000055105193e-06,
                "q3": 1.9109999982447334e-06,
                "iqr_outliers": 2660,
                "stddev_outliers": 783,
                "outliers": "783;2660",
                "ld15iqr": 1.8199999942680734e-06,
                "hd15iqr": 1.9790000180819334e-06,
                "ops": 512345.8567919856,
                "total": 0.12267884899773662,
                "iterations": 1
            }
        },
        {
            "group": null,
            "name": "test_04_geometrical_params",
            "fullname": "tests/benchmarks/test_benchmarks.py::test_04_geometrical_params",
            "params": null,
            "param": null,
            "extra_info": {},
            "options": {
                "disable_gc": false,
                "timer": "perf_counter",
                "min_rounds": 5,
                "max_time": 1.0,
                "min_time": 5e-06,
                "warmup": false
            },
            "stats": {
                "min": 0.4550736879999988,
                "max": 0.8119457859999955,
                "mean": 0.5321541166000031,
                "stddev": 0.15654848358070722,
                "rounds": 5,
                "median": 0.46659883200001673,
                "iqr": 0.09990738524997766,
                "q1": 0.4561058455000122,
                "q3": 0.5560132307499899,
                "iqr_outliers": 1,
                "stddev_outliers": 1,
                "outliers": "1;1",
                "ld15iqr": 0.4550736879999988,
                "hd15iqr": 0.8119457859999955,
                "ops": 1.8791548703768763,
                "total": 2.6607705830000157,
                "iterations": 1
            }
        },
        {
            "group": null,
            "name": "test_05_modulation",
            "fullname": "tests/benchmarks/test_benchmarks.py::test_05_modulation",
            "params": null,
            "param": null,
            "extra_info": {},
            "options": {
                "disable_gc": false,
                "timer": "perf_counter",
                "min_rounds": 5,
                "max_time": 1.0,
                "min_time": 5e-06,
                "warmup": false
            },
            "stats": {
                "min": 0.11908479900000657,
                "max": 0.5565559179999866,
                "mean": 0.18687760714285315,
                "stddev": 0.16307660763647394,
                "rounds": 7,
                "median": 0.12820586299997672,
                "iqr": 0.009294426999993277,
                "q1": 0.12087561300000971,
                "q3": 0.13017004000000298,
                "iqr_outliers": 1,
                "stddev_outliers": 1,
                "outliers": "1;1",
                "ld15iqr": 0.11908479900000657,
                "hd15iqr": 0.5565559179999866,
                "ops": 5.3510959139988294,
                "total": 1.3081432499999721,
                "iterations": 1
            }
        },
        {
            "group": null,
            "name": "test_06_radiation_pressure",
            "fullname": "tests/benchmarks/test_benchmarks.py::test_06_radiation_pressure",
            "params": null,
            "param": null,
            "extra_info": {},
            "options": {
                "disable_gc": false,
                "timer": "perf_counter",
                "min_rounds": 5,
                "max_time": 1.0,
                "min_time": 5e-06,
                "warmup": false
            },
            "stats": {
                "min": 0.23868494800001372,
                "max": 0.2483697119999988,
                "mean": 0.2428135892000057,
                "stddev": 0.003491067739711638,
                "rounds": 5,
                "median": 0.24242106500000205,
                "iqr": 0.002824232749986777,
                "q1": 0.24119179900001342,
                "q3": 0.2440160317500002,
                "iqr_outliers": 1,
                "stddev_outliers": 2,
                "outliers": "2;1",
                "ld15iqr": 0.23868494800001372,
                "hd15iqr": 0.2483697119999988,
                "ops": 4.118385644290688,
                "total": 1.2140679460000285,
                "iterations": 1
            }
        },
        {
            "group": null,
            "name": "test_07_homodyne",
            "fullname": "tests/benchmarks/test_benchmarks.py::test_07_homodyne",
            "params": null,
            "param": null,
            "extra_info": {},
            "options": {
                "disable_gc": false,
                "timer": "perf_counter",
                "min_rounds": 5,
                "max_time": 1.0,
                "min_time": 5e-06,
                "warmup": false
            },
            "stats": {
                "min": 0.08380996000002483,
                "max": 0.6014658409999925,
                "mean": 0.12872282816666805,
                "stddev": 0.14888025067090455,
                "rounds": 12,
                "median": 0.08585415899999305,
                "iqr": 0.002152989499990099,
                "q1": 0.08482569400001694,
                "q3": 0.08697868350000704,
                "iqr_outliers": 1,
                "stddev_outliers": 1,
                "outliers": "1;1",
                "ld15iqr": 0.08380996000002483,
                "hd15iqr": 0.6014658409999925,
                "ops": 7.768629809043797,
                "total": 1.5446739380000167,
                "iterations": 1
            }
        },
        {
            "group": null,
            "name": "test_08_optical_spring",
            "fullname": "tests/benchmarks/test_benchmarks.py::test_08_optical_spring",
            "params": null,
            "param": null,
            "extra_info": {},
            "options": {
                "disable_gc": false,
                "timer": "perf_counter",
                "min_rounds": 5,
                "max_time": 1.0,
                "min_time": 5e-06,
                "warmup": false
            },
            "stats": {
                "min": 0.22547044499998492,
                "max": 0.25816120600001113,
                "mean": 0.23399301420000143,
                "stddev": 0.013644521232227739,
                "rounds": 5,
                "median": 0.22925440299999877,
                "iqr": 0.010775151999979471,
                "q1": 0.22647101175001438,
                "q3": 0.23724616374999385,
                "iqr_outliers": 1,
                "stddev_outliers": 1,
                "outliers": "1;1",
                "ld15iqr": 0.22547044499998492,
                "hd15iqr": 0.25816120600001113,
                "ops": 4.27363185785225,
                "total": 1.1699650710000071,
                "iterations": 1
            }
        },
        {
            "group": null,
            "name": "test_09_aligo_sensitivity",
            "fullname": "tests/benchmarks/test_benchmarks.py::test_09_aligo_sensitivity",
            "params": null,
            "param": null,
            "extra_info": {},
            "options": {
                "disable_gc": false,
                "timer": "perf_counter",
                "min_rounds": 5,
                "max_time": 1.0,
                "min_time": 5e-06,
                "warmup": false
            },
            "stats": {
                "min": 0.24722074400000338,
                "max": 0.8723429109999756,
                "mean": 0.374732830399995,
                "stddev": 0.2781794498600899,
                "rounds": 5,
                "median": 0.2517688860000078,
                "iqr": 0.15790646749999837,
                "q1": 0.24936657724999378,
                "q3": 0.40727304474999215,
                "iqr_outliers": 1,
                "stddev_outliers": 1,
                "outliers": "1;1",
                "ld15iqr": 0.24722074400000338,
                "hd15iqr": 0.8723429109999756,
                "ops": 2.668567893911473,
                "total": 1.873664151999975,
                "iterations": 1
            }
        },
        {
            "group": null,
            "name": "test_10_shifted_beam",
            "fullname": "tests/benchmarks/test_benchmarks.py::test_10_shifted_beam",
            "params": null,
            "param": null,
            "extra_info": {},
            "options": {
                "disable_gc": false,
                "timer": "perf_counter",
                "min_rounds": 5,
                "max_time": 1.0,
                "min_time": 5e-06,
                "warmup": false
            },
            "stats": {
                "min": 0.7168439000000149,
                "max": 0.7328712769999868,
                "mean": 0.7236025550000023,
                "stddev": 0.006918244208922366,
                "rounds": 5,
                "median": 0.7214074420000145,
                "iqr": 0.011872314750014823,
                "q1": 0.7178620482499909,
                "q3": 0.7297343630000057,
                "iqr_outliers": 0,
                "stddev_outliers": 1,
                "outliers": "1;0",
                "ld15iqr": 0.7168439000000149,
                "hd15iqr": 0.7328712769999868,
                "ops": 1.3819741142290425,
                "total": 3.618012775000011,
                "iterations": 1
            }
        },
        {
            "group": null,
            "name": "test_angular_radiation_pressure",
            "fullname": "tests/benchmarks/test_benchmarks.py::test_angular_radiation_pressure",
            "params": null,
            "param": null,
            "extra_info": {},
            "options": {
                "disable_gc": false,
                "timer": "perf_counter",
                "min_rounds": 5,
                "max_time": 1.0,
                "min_time": 5e-06,
                "warmup": false
            },
            "stats": {
                "min": 0.2900864229999911,
                "max": 0.3063706410000009,
                "mean": 0.2966774704000045,
                "stddev": 0.00605414616617184,
                "rounds": 5,
                "median": 0.2952551260000007,
                "iqr": 0.006620478500018123,
                "q1": 0.2931250795000011,
                "q3": 0.29974555800001923,
                "iqr_outliers": 0,
                "stddev_outliers": 2,
                "outliers": "2;0",
                "ld15iqr": 0.2900864229999911,
                "hd15iqr": 0.3063706410000009,
                "ops": 3.3706637671263655,
                "total": 1.4833873520000225,
                "iterations": 1
            }
        },
        {
            "group": null,
            "name": "test_cavity_eigenmodes",
            "fullname": "tests/benchmarks/test_benchmarks.py::test_cavity_eigenmodes",
            "params": null,
            "param": null,
            "extra_info": {},
            "options": {
                "disable_gc": false,
                "timer": "perf_counter",
                "min_rounds": 5,
                "max_time": 1.0,
                "min_time": 5e-06,
                "warmup": false
            },
            "stats": {
                "min": 0.2635423010000011,
                "max": 1.0979178649999994,
                "mean": 0.43179155239999434,
                "stddev": 0.37237868338580243,
                "rounds": 5,
                "median": 0.26619776199999023,
                "iqr": 0.21073394999998385,
                "q1": 0.26405298350000095,
                "q3": 0.4747869334999848,
                "iqr_outliers": 1,
                "stddev_outliers": 1,
                "outliers": "1;1",
                "ld15iqr": 0.2635423010000011,
                "hd15iqr": 1.0979178649999994,
                "ops": 2.3159322928894177,
                "total": 2.1589577619999716,
                "iterations": 1
            }
        },
        {
            "group": null,
            "name": "test_coupled_cavity_commands",
            "fullname": "tests/benchmarks/test_benchmarks.py::test_coupled_cavity_commands",
            "params": null,
            "param": null,
            "extra_info": {},
            "options": {
                "disable_gc": false,
                "timer": "perf_counter",
                "min_rounds": 5,
                "max_time": 1.0,
                "min_time": 5e-06,
                "warmup": false
            },
            "stats": {
                "min": 4.267552053000003,
                "max": 5.470117866999999,
                "mean": 4.756169978199995,
                "stddev": 0.6247605546983079,
                "rounds": 5,
                "median": 4.336044114999993,
                "iqr": 1.1340230650000152,
                "q1": 4.290373153499985,
                "q3": 5.4243962185,
                "iqr_outliers": 0,
                "stddev_outliers": 2,
                "outliers": "2;0",
                "ld15iqr": 4.267552053000003,
                "hd15iqr": 5.470117866999999,
                "ops": 0.21025320890202012,
                "total": 23.780849890999974,
                "iterations": 1
            }
        },
        {
            "group": null,
            "name": "test_frequency_dependant_squeezing",
            "fullname": "tests/benchmarks/test_benchmarks.py::test_frequency_dependant_squeezing",
            "params": null,
            "param": null,
            "extra_info": {},
            "options": {
                "disable_gc": false,
                "timer": "perf_counter",
                "min_rounds": 5,
                "max_time": 1.0,
                "min_time": 5e-06,
                "warmup": false
            },
            "stats": {
                "min": 1.4952622779999842,
                "max": 2.7835795409999946,
                "mean": 1.768236451599995,
                "stddev": 0.5678785518294931,
                "rounds": 5,
                "median": 1.531591794999997,
                "iqr": 0.3486700302499841,
                "q1": 1.497050953750005,
                "q3": 1.845720983999989,
                "iqr_outliers": 1,
                "stddev_outliers": 1,
                "outliers": "1;1",
                "ld15iqr": 1.4952622779999842,
                "hd15iqr": 2.7835795409999946,
                "ops": 0.5655352252777882,
                "total": 8.841182257999975,
                "iterations": 1
            }
        },
        {
            "group": null,
            "name": "test_lock_actions",
            "fullname": "tests/benchmarks/test_benchmarks.py::test_lock_actions",
            "params": null,
            "param": null,
            "extra_info": {},
            "options": {
                "disable_gc": false,
                "timer": "perf_counter",
                "min_rounds": 5,
                "max_time": 1.0,
                "min_time": 5e-06,
                "warmup": false
            },
            "stats": {
                "min": 3.0913338020000083,
                "max": 4.406744419999995,
                "mean": 3.362928168000002,
                "stddev": 0.5835862862891262,
                "rounds": 5,
                "median": 3.104023691000009,
                "iqr": 0.34374113474998325,
                "q1": 3.0950913080000078,
                "q3": 3.438832442749991,
                "iqr_outliers": 1,
                "stddev_outliers": 1,
                "outliers": "1;1",
                "ld15iqr": 3.0913338020000083,
                "hd15iqr": 4.406744419999995,
                "ops": 0.2973599048339826,
                "total": 16.81464084000001,
                "iterations": 1
            }
        }
    ],
    "datetime": "2024-08-09T09:25:07.954667",
    "version": "4.0.0"
}