{
    "machine_info": {
        "node": "runner-jlguopmm-project-39604133-concurrent-0",
        "processor": "",
        "machine": "x86_64",
        "python_compiler": "GCC 12.2.0",
        "python_implementation": "CPython",
        "python_implementation_version": "3.12.3",
        "python_version": "3.12.3",
        "python_build": [
            "main",
            "May 14 2024 07:23:41"
        ],
        "release": "5.15.154+",
        "system": "Linux",
        "cpu": {
            "python_version": "3.12.3.final.0 (64 bit)",
            "cpuinfo_version": [
                9,
                0,
                0
            ],
            "cpuinfo_version_string": "9.0.0",
            "arch": "X86_64",
            "bits": 64,
            "count": 2,
            "arch_string_raw": "x86_64",
            "vendor_id_raw": "AuthenticAMD",
            "brand_raw": "AMD EPYC 7B13",
            "hz_advertised_friendly": "2.4500 GHz",
            "hz_actual_friendly": "2.4500 GHz",
            "hz_advertised": [
                2449998000,
                0
            ],
            "hz_actual": [
                2449998000,
                0
            ],
            "model": 1,
            "family": 25,
            "flags": [
                "3dnowext",
                "3dnowprefetch",
                "abm",
                "adx",
                "aes",
                "apic",
                "arat",
                "avx",
                "avx2",
                "bmi1",
                "bmi2",
                "clflush",
                "clflushopt",
                "clwb",
                "clzero",
                "cmov",
                "cmp_legacy",
                "constant_tsc",
                "cpuid",
                "cr8_legacy",
                "cx16",
                "cx8",
                "de",
                "erms",
                "extd_apicid",
                "f16c",
                "fma",
                "fpu",
                "fsgsbase",
                "fsrm",
                "fxsr",
                "fxsr_opt",
                "ht",
                "hypervisor",
                "ibpb",
                "ibrs",
                "invpcid",
                "invpcid_single",
                "lahf_lm",
                "lm",
                "mca",
                "mce",
                "misalignsse",
                "mmx",
                "mmxext",
                "movbe",
                "msr",
                "mtrr",
                "nonstop_tsc",
                "nopl",
                "npt",
                "nrip_save",
                "nx",
                "osvw",
                "osxsave",
                "pae",
                "pat",
                "pcid",
                "pclmulqdq",
                "pdpe1gb",
                "pge",
                "pni",
                "popcnt",
                "pse",
                "pse36",
                "rdpid",
                "rdrand",
                "rdrnd",
                "rdseed",
                "rdtscp",
                "rep_good",
                "sep",
                "sha",
                "sha_ni",
                "smap",
                "smep",
                "ssbd",
                "sse",
                "sse2",
                "sse4_1",
                "sse4_2",
                "sse4a",
                "ssse3",
                "stibp",
                "syscall",
                "topoext",
                "tsc",
                "tsc_adjust",
                "tsc_known_freq",
                "umip",
                "vaes",
                "vme",
                "vmmcall",
                "vpclmulqdq",
                "x2apic",
                "xgetbv1",
                "xsave",
                "xsavec",
                "xsaveerptr",
                "xsaveopt"
            ],
            "l3_cache_size": 524288,
            "l2_cache_size": 524288,
            "l1_data_cache_size": 32768,
            "l1_instruction_cache_size": 32768,
            "l2_cache_line_size": 512,
            "l2_cache_associativity": 6
        }
    },
    "commit_info": {
        "id": "c5f32abd2515c33932648999a14c7ff1c5654209",
        "time": "2024-05-17T11:28:39+10:00",
        "author_time": "2024-05-17T11:28:18+10:00",
        "dirty": false,
        "project": "finesse3",
        "branch": "(detached head)"
    },
    "benchmarks": [
        {
            "group": null,
            "name": "test_01_simple_cav",
            "fullname": "tests/benchmarks/test_benchmarks.py::test_01_simple_cav",
            "params": null,
            "param": null,
            "extra_info": {},
            "options": {
                "disable_gc": false,
                "timer": "perf_counter",
                "min_rounds": 5,
                "max_time": 1.0,
                "min_time": 5e-06,
                "warmup": false
            },
            "stats": {
                "min": 0.3619105039999937,
                "max": 0.529701868999993,
                "mean": 0.3967903821999954,
                "stddev": 0.07432144650013944,
                "rounds": 5,
                "median": 0.36315420599999015,
                "iqr": 0.044921892749993475,
                "q1": 0.36243509975000165,
                "q3": 0.40735699249999513,
                "iqr_outliers": 1,
                "stddev_outliers": 1,
                "outliers": "1;1",
                "ld15iqr": 0.3619105039999937,
                "hd15iqr": 0.529701868999993,
                "ops": 2.5202223764989524,
                "total": 1.983951910999977,
                "iterations": 1
            }
        },
        {
            "group": null,
            "name": "test_02_pdh_lock",
            "fullname": "tests/benchmarks/test_benchmarks.py::test_02_pdh_lock",
            "params": null,
            "param": null,
            "extra_info": {},
            "options": {
                "disable_gc": false,
                "timer": "perf_counter",
                "min_rounds": 5,
                "max_time": 1.0,
                "min_time": 5e-06,
                "warmup": false
            },
            "stats": {
                "min": 1.3244641619999982,
                "max": 1.6251920489999918,
                "mean": 1.4029808885999955,
                "stddev": 0.12820355898856478,
                "rounds": 5,
                "median": 1.3316356260000077,
                "iqr": 0.12815752725001772,
                "q1": 1.3297329899999824,
                "q3": 1.45789051725,
                "iqr_outliers": 0,
                "stddev_outliers": 1,
                "outliers": "1;0",
                "ld15iqr": 1.3244641619999982,
                "hd15iqr": 1.6251920489999918,
                "ops": 0.7127680841026127,
                "total": 7.014904442999978,
                "iterations": 1
            }
        },
        {
            "group": null,
            "name": "test_03_near_unstable",
            "fullname": "tests/benchmarks/test_benchmarks.py::test_03_near_unstable",
            "params": null,
            "param": null,
            "extra_info": {},
            "options": {
                "disable_gc": false,
                "timer": "perf_counter",
                "min_rounds": 5,
                "max_time": 1.0,
                "min_time": 5e-06,
                "warmup": false
            },
            "stats": {
                "min": 1.6109999876334768e-06,
                "max": 0.0002836699999875236,
                "mean": 2.527927868712606e-06,
                "stddev": 1.5618974393435023e-06,
                "rounds": 49604,
                "median": 3.079999999044958e-06,
                "iqr": 1.4099999816608033e-06,
                "q1": 1.7600000035145058e-06,
                "q3": 3.169999985175309e-06,
                "iqr_outliers": 268,
                "stddev_outliers": 274,
                "outliers": "274;268",
                "ld15iqr": 1.6109999876334768e-06,
                "hd15iqr": 5.330000021785963e-06,
                "ops": 395580.9073418177,
                "total": 0.1253953339996201,
                "iterations": 1
            }
        },
        {
            "group": null,
            "name": "test_04_geometrical_params",
            "fullname": "tests/benchmarks/test_benchmarks.py::test_04_geometrical_params",
            "params": null,
            "param": null,
            "extra_info": {},
            "options": {
                "disable_gc": false,
                "timer": "perf_counter",
                "min_rounds": 5,
                "max_time": 1.0,
                "min_time": 5e-06,
                "warmup": false
            },
            "stats": {
                "min": 0.5052060630000028,
                "max": 0.8621214350000059,
                "mean": 0.5783486990000029,
                "stddev": 0.1586397736472393,
                "rounds": 5,
                "median": 0.5083189460000028,
                "iqr": 0.09034386875000422,
                "q1": 0.506780397,
                "q3": 0.5971242657500042,
                "iqr_outliers": 1,
                "stddev_outliers": 1,
                "outliers": "1;1",
                "ld15iqr": 0.5052060630000028,
                "hd15iqr": 0.8621214350000059,
                "ops": 1.7290606890428832,
                "total": 2.8917434950000143,
                "iterations": 1
            }
        },
        {
            "group": null,
            "name": "test_05_modulation",
            "fullname": "tests/benchmarks/test_benchmarks.py::test_05_modulation",
            "params": null,
            "param": null,
            "extra_info": {},
            "options": {
                "disable_gc": false,
                "timer": "perf_counter",
                "min_rounds": 5,
                "max_time": 1.0,
                "min_time": 5e-06,
                "warmup": false
            },
            "stats": {
                "min": 0.1725989820000109,
                "max": 0.5722351000000003,
                "mean": 0.22805555525000543,
                "stddev": 0.1391511240555807,
                "rounds": 8,
                "median": 0.1793850505000023,
                "iqr": 0.010097686500003533,
                "q1": 0.17516122150000513,
                "q3": 0.18525890800000866,
                "iqr_outliers": 1,
                "stddev_outliers": 1,
                "outliers": "1;1",
                "ld15iqr": 0.1725989820000109,
                "hd15iqr": 0.5722351000000003,
                "ops": 4.384896473597199,
                "total": 1.8244444420000434,
                "iterations": 1
            }
        },
        {
            "group": null,
            "name": "test_06_radiation_pressure",
            "fullname": "tests/benchmarks/test_benchmarks.py::test_06_radiation_pressure",
            "params": null,
            "param": null,
            "extra_info": {},
            "options": {
                "disable_gc": false,
                "timer": "perf_counter",
                "min_rounds": 5,
                "max_time": 1.0,
                "min_time": 5e-06,
                "warmup": false
            },
            "stats": {
                "min": 0.23174532200002318,
                "max": 0.2354982519999851,
                "mean": 0.23380653620000658,
                "stddev": 0.0013468155057264738,
                "rounds": 5,
                "median": 0.23394318200001862,
                "iqr": 0.0012725667500035343,
                "q1": 0.2332113852500015,
                "q3": 0.23448395200000505,
                "iqr_outliers": 0,
                "stddev_outliers": 2,
                "outliers": "2;0",
                "ld15iqr": 0.23174532200002318,
                "hd15iqr": 0.2354982519999851,
                "ops": 4.27704039524611,
                "total": 1.1690326810000329,
                "iterations": 1
            }
        },
        {
            "group": null,
            "name": "test_07_homodyne",
            "fullname": "tests/benchmarks/test_benchmarks.py::test_07_homodyne",
            "params": null,
            "param": null,
            "extra_info": {},
            "options": {
                "disable_gc": false,
                "timer": "perf_counter",
                "min_rounds": 5,
                "max_time": 1.0,
                "min_time": 5e-06,
                "warmup": false
            },
            "stats": {
                "min": 0.1117854320000049,
                "max": 0.11561330099999623,
                "mean": 0.11346776810000563,
                "stddev": 0.0012591649288014432,
                "rounds": 10,
                "median": 0.11373969699999975,
                "iqr": 0.0020660799999916435,
                "q1": 0.1121691920000103,
                "q3": 0.11423527200000194,
                "iqr_outliers": 0,
                "stddev_outliers": 4,
                "outliers": "4;0",
                "ld15iqr": 0.1117854320000049,
                "hd15iqr": 0.11561330099999623,
                "ops": 8.8130754375872,
                "total": 1.1346776810000563,
                "iterations": 1
            }
        },
        {
            "group": null,
            "name": "test_08_optical_spring",
            "fullname": "tests/benchmarks/test_benchmarks.py::test_08_optical_spring",
            "params": null,
            "param": null,
            "extra_info": {},
            "options": {
                "disable_gc": false,
                "timer": "perf_counter",
                "min_rounds": 5,
                "max_time": 1.0,
                "min_time": 5e-06,
                "warmup": false
            },
            "stats": {
                "min": 0.2908759530000111,
                "max": 0.2950268220000112,
                "mean": 0.29281410840000605,
                "stddev": 0.0018019947699785814,
                "rounds": 5,
                "median": 0.2934606620000011,
                "iqr": 0.0030203114999665104,
                "q1": 0.2909928555000221,
                "q3": 0.2940131669999886,
                "iqr_outliers": 0,
                "stddev_outliers": 2,
                "outliers": "2;0",
                "ld15iqr": 0.2908759530000111,
                "hd15iqr": 0.2950268220000112,
                "ops": 3.4151359900798393,
                "total": 1.4640705420000302,
                "iterations": 1
            }
        },
        {
            "group": null,
            "name": "test_09_aligo_sensitivity",
            "fullname": "tests/benchmarks/test_benchmarks.py::test_09_aligo_sensitivity",
            "params": null,
            "param": null,
            "extra_info": {},
            "options": {
                "disable_gc": false,
                "timer": "perf_counter",
                "min_rounds": 5,
                "max_time": 1.0,
                "min_time": 5e-06,
                "warmup": false
            },
            "stats": {
                "min": 0.3127742549999937,
                "max": 0.9290751300000011,
                "mean": 0.44127951659999665,
                "stddev": 0.2727134143070454,
                "rounds": 5,
                "median": 0.3215684529999976,
                "iqr": 0.1557205230000065,
                "q1": 0.3184883159999927,
                "q3": 0.4742088389999992,
                "iqr_outliers": 1,
                "stddev_outliers": 1,
                "outliers": "1;1",
                "ld15iqr": 0.3127742549999937,
                "hd15iqr": 0.9290751300000011,
                "ops": 2.2661373627873656,
                "total": 2.2063975829999833,
                "iterations": 1
            }
        },
        {
            "group": null,
            "name": "test_10_shifted_beam",
            "fullname": "tests/benchmarks/test_benchmarks.py::test_10_shifted_beam",
            "params": null,
            "param": null,
            "extra_info": {},
            "options": {
                "disable_gc": false,
                "timer": "perf_counter",
                "min_rounds": 5,
                "max_time": 1.0,
                "min_time": 5e-06,
                "warmup": false
            },
            "stats": {
                "min": 0.7098859930000003,
                "max": 0.7260947580000163,
                "mean": 0.7152487774000008,
                "stddev": 0.006455082675157986,
                "rounds": 5,
                "median": 0.7138079220000009,
                "iqr": 0.007411537250014533,
                "q1": 0.7107125304999897,
                "q3": 0.7181240677500043,
                "iqr_outliers": 0,
                "stddev_outliers": 1,
                "outliers": "1;0",
                "ld15iqr": 0.7098859930000003,
                "hd15iqr": 0.7260947580000163,
                "ops": 1.3981149379032813,
                "total": 3.576243887000004,
                "iterations": 1
            }
        },
        {
            "group": null,
            "name": "test_angular_radiation_pressure",
            "fullname": "tests/benchmarks/test_benchmarks.py::test_angular_radiation_pressure",
            "params": null,
            "param": null,
            "extra_info": {},
            "options": {
                "disable_gc": false,
                "timer": "perf_counter",
                "min_rounds": 5,
                "max_time": 1.0,
                "min_time": 5e-06,
                "warmup": false
            },
            "stats": {
                "min": 0.33448485799999617,
                "max": 0.34127958599998465,
                "mean": 0.33767230519999886,
                "stddev": 0.003107695257843478,
                "rounds": 5,
                "median": 0.336260368000012,
                "iqr": 0.005518985500017948,
                "q1": 0.33533733049998915,
                "q3": 0.3408563160000071,
                "iqr_outliers": 0,
                "stddev_outliers": 2,
                "outliers": "2;0",
                "ld15iqr": 0.33448485799999617,
                "hd15iqr": 0.34127958599998465,
                "ops": 2.961451041736198,
                "total": 1.6883615259999942,
                "iterations": 1
            }
        },
        {
            "group": null,
            "name": "test_cavity_eigenmodes",
            "fullname": "tests/benchmarks/test_benchmarks.py::test_cavity_eigenmodes",
            "params": null,
            "param": null,
            "extra_info": {},
            "options": {
                "disable_gc": false,
                "timer": "perf_counter",
                "min_rounds": 5,
                "max_time": 1.0,
                "min_time": 5e-06,
                "warmup": false
            },
            "stats": {
                "min": 0.25524299500000325,
                "max": 1.0742916019999882,
                "mean": 0.42434130259999847,
                "stddev": 0.3633956706075706,
                "rounds": 5,
                "median": 0.26182131299998446,
                "iqr": 0.21616834299997834,
                "q1": 0.25698912925001594,
                "q3": 0.47315747224999427,
                "iqr_outliers": 1,
                "stddev_outliers": 1,
                "outliers": "1;1",
                "ld15iqr": 0.25524299500000325,
                "hd15iqr": 1.0742916019999882,
                "ops": 2.3565936048950697,
                "total": 2.1217065129999924,
                "iterations": 1
            }
        },
        {
            "group": null,
            "name": "test_coupled_cavity_commands",
            "fullname": "tests/benchmarks/test_benchmarks.py::test_coupled_cavity_commands",
            "params": null,
            "param": null,
            "extra_info": {},
            "options": {
                "disable_gc": false,
                "timer": "perf_counter",
                "min_rounds": 5,
                "max_time": 1.0,
                "min_time": 5e-06,
                "warmup": false
            },
            "stats": {
                "min": 4.250719051999994,
                "max": 5.326529093000005,
                "mean": 4.661919955000007,
                "stddev": 0.5360553035304988,
                "rounds": 5,
                "median": 4.28446734100001,
                "iqr": 0.9300303390000053,
                "q1": 4.275097457000008,
                "q3": 5.2051277960000135,
                "iqr_outliers": 0,
                "stddev_outliers": 1,
                "outliers": "1;0",
                "ld15iqr": 4.250719051999994,
                "hd15iqr": 5.326529093000005,
                "ops": 0.2145038974612764,
                "total": 23.309599775000038,
                "iterations": 1
            }
        },
        {
            "group": null,
            "name": "test_frequency_dependant_squeezing",
            "fullname": "tests/benchmarks/test_benchmarks.py::test_frequency_dependant_squeezing",
            "params": null,
            "param": null,
            "extra_info": {},
            "options": {
                "disable_gc": false,
                "timer": "perf_counter",
                "min_rounds": 5,
                "max_time": 1.0,
                "min_time": 5e-06,
                "warmup": false
            },
            "stats": {
                "min": 1.4928417819999993,
                "max": 2.7314823179999905,
                "mean": 1.756982249999993,
                "stddev": 0.5448920963479208,
                "rounds": 5,
                "median": 1.5203432829999883,
                "iqr": 0.3121243182499924,
                "q1": 1.5120698034999975,
                "q3": 1.82419412174999,
                "iqr_outliers": 1,
                "stddev_outliers": 1,
                "outliers": "1;1",
                "ld15iqr": 1.4928417819999993,
                "hd15iqr": 2.7314823179999905,
                "ops": 0.5691577134601127,
                "total": 8.784911249999965,
                "iterations": 1
            }
        },
        {
            "group": null,
            "name": "test_lock_actions",
            "fullname": "tests/benchmarks/test_benchmarks.py::test_lock_actions",
            "params": null,
            "param": null,
            "extra_info": {},
            "options": {
                "disable_gc": false,
                "timer": "perf_counter",
                "min_rounds": 5,
                "max_time": 1.0,
                "min_time": 5e-06,
                "warmup": false
            },
            "stats": {
                "min": 4.663028076999979,
                "max": 6.402941005000002,
                "mean": 5.136417483200001,
                "stddev": 0.7146664590535093,
                "rounds": 5,
                "median": 4.897031928000018,
                "iqr": 0.5036272155000105,
                "q1": 4.776089929749993,
                "q3": 5.279717145250004,
                "iqr_outliers": 1,
                "stddev_outliers": 1,
                "outliers": "1;1",
                "ld15iqr": 4.663028076999979,
                "hd15iqr": 6.402941005000002,
                "ops": 0.1946882244815111,
                "total": 25.682087416,
                "iterations": 1
            }
        }
    ],
    "datetime": "2024-05-17T01:35:44.501822",
    "version": "4.0.0"
}