{
    "machine_info": {
        "node": "runner-jlguopmm-project-39604133-concurrent-0",
        "processor": "",
        "machine": "x86_64",
        "python_compiler": "GCC 12.2.0",
        "python_implementation": "CPython",
        "python_implementation_version": "3.12.3",
        "python_version": "3.12.3",
        "python_build": [
            "main",
            "May 14 2024 07:23:41"
        ],
        "release": "5.15.154+",
        "system": "Linux",
        "cpu": {
            "python_version": "3.12.3.final.0 (64 bit)",
            "cpuinfo_version": [
                9,
                0,
                0
            ],
            "cpuinfo_version_string": "9.0.0",
            "arch": "X86_64",
            "bits": 64,
            "count": 2,
            "arch_string_raw": "x86_64",
            "vendor_id_raw": "AuthenticAMD",
            "brand_raw": "AMD EPYC 7B13",
            "hz_advertised_friendly": "2.4500 GHz",
            "hz_actual_friendly": "2.4500 GHz",
            "hz_advertised": [
                2449996000,
                0
            ],
            "hz_actual": [
                2449996000,
                0
            ],
            "model": 1,
            "family": 25,
            "flags": [
                "3dnowext",
                "3dnowprefetch",
                "abm",
                "adx",
                "aes",
                "apic",
                "arat",
                "avx",
                "avx2",
                "bmi1",
                "bmi2",
                "clflush",
                "clflushopt",
                "clwb",
                "clzero",
                "cmov",
                "cmp_legacy",
                "constant_tsc",
                "cpuid",
                "cr8_legacy",
                "cx16",
                "cx8",
                "de",
                "erms",
                "extd_apicid",
                "f16c",
                "fma",
                "fpu",
                "fsgsbase",
                "fsrm",
                "fxsr",
                "fxsr_opt",
                "ht",
                "hypervisor",
                "ibpb",
                "ibrs",
                "invpcid",
                "invpcid_single",
                "lahf_lm",
                "lm",
                "mca",
                "mce",
                "misalignsse",
                "mmx",
                "mmxext",
                "movbe",
                "msr",
                "mtrr",
                "nonstop_tsc",
                "nopl",
                "npt",
                "nrip_save",
                "nx",
                "osvw",
                "osxsave",
                "pae",
                "pat",
                "pcid",
                "pclmulqdq",
                "pdpe1gb",
                "pge",
                "pni",
                "popcnt",
                "pse",
                "pse36",
                "rdpid",
                "rdrand",
                "rdrnd",
                "rdseed",
                "rdtscp",
                "rep_good",
                "sep",
                "sha",
                "sha_ni",
                "smap",
                "smep",
                "ssbd",
                "sse",
                "sse2",
                "sse4_1",
                "sse4_2",
                "sse4a",
                "ssse3",
                "stibp",
                "syscall",
                "topoext",
                "tsc",
                "tsc_adjust",
                "tsc_known_freq",
                "umip",
                "vaes",
                "vme",
                "vmmcall",
                "vpclmulqdq",
                "x2apic",
                "xgetbv1",
                "xsave",
                "xsavec",
                "xsaveerptr",
                "xsaveopt"
            ],
            "l3_cache_size": 524288,
            "l2_cache_size": 524288,
            "l1_data_cache_size": 32768,
            "l1_instruction_cache_size": 32768,
            "l2_cache_line_size": 512,
            "l2_cache_associativity": 6
        }
    },
    "commit_info": {
        "id": "2fa2f13638943aeb77207371a0a836a5910c0e7a",
        "time": "2024-05-22T23:19:49+09:30",
        "author_time": "2024-05-22T23:19:49+09:30",
        "dirty": false,
        "project": "finesse3",
        "branch": "(detached head)"
    },
    "benchmarks": [
        {
            "group": null,
            "name": "test_01_simple_cav",
            "fullname": "tests/benchmarks/test_benchmarks.py::test_01_simple_cav",
            "params": null,
            "param": null,
            "extra_info": {},
            "options": {
                "disable_gc": false,
                "timer": "perf_counter",
                "min_rounds": 5,
                "max_time": 1.0,
                "min_time": 5e-06,
                "warmup": false
            },
            "stats": {
                "min": 0.36619883899999195,
                "max": 0.5499789619999973,
                "mean": 0.4050962525999978,
                "stddev": 0.08101404678836185,
                "rounds": 5,
                "median": 0.37060520800000063,
                "iqr": 0.04799863575000529,
                "q1": 0.3675347524999957,
                "q3": 0.41553338825000097,
                "iqr_outliers": 1,
                "stddev_outliers": 1,
                "outliers": "1;1",
                "ld15iqr": 0.36619883899999195,
                "hd15iqr": 0.5499789619999973,
                "ops": 2.4685491252554863,
                "total": 2.025481262999989,
                "iterations": 1
            }
        },
        {
            "group": null,
            "name": "test_02_pdh_lock",
            "fullname": "tests/benchmarks/test_benchmarks.py::test_02_pdh_lock",
            "params": null,
            "param": null,
            "extra_info": {},
            "options": {
                "disable_gc": false,
                "timer": "perf_counter",
                "min_rounds": 5,
                "max_time": 1.0,
                "min_time": 5e-06,
                "warmup": false
            },
            "stats": {
                "min": 1.3272607320000134,
                "max": 1.6014324829999964,
                "mean": 1.3913347068000008,
                "stddev": 0.11779404544182946,
                "rounds": 5,
                "median": 1.3379524800000127,
                "iqr": 0.07988287549999029,
                "q1": 1.334905653749999,
                "q3": 1.4147885292499893,
                "iqr_outliers": 1,
                "stddev_outliers": 1,
                "outliers": "1;1",
                "ld15iqr": 1.3272607320000134,
                "hd15iqr": 1.6014324829999964,
                "ops": 0.7187343168488547,
                "total": 6.956673534000004,
                "iterations": 1
            }
        },
        {
            "group": null,
            "name": "test_03_near_unstable",
            "fullname": "tests/benchmarks/test_benchmarks.py::test_03_near_unstable",
            "params": null,
            "param": null,
            "extra_info": {},
            "options": {
                "disable_gc": false,
                "timer": "perf_counter",
                "min_rounds": 5,
                "max_time": 1.0,
                "min_time": 5e-06,
                "warmup": false
            },
            "stats": {
                "min": 1.6890000154035079e-06,
                "max": 0.0001241100000015649,
                "mean": 2.6498744489515906e-06,
                "stddev": 1.1900853350569646e-06,
                "rounds": 44229,
                "median": 3.1600000056641875e-06,
                "iqr": 1.4300000259481749e-06,
                "q1": 1.7999999784024112e-06,
                "q3": 3.230000004350586e-06,
                "iqr_outliers": 265,
                "stddev_outliers": 328,
                "outliers": "328;265",
                "ld15iqr": 1.6890000154035079e-06,
                "hd15iqr": 5.390000012539531e-06,
                "ops": 377376.3698108961,
                "total": 0.1172012970026799,
                "iterations": 1
            }
        },
        {
            "group": null,
            "name": "test_04_geometrical_params",
            "fullname": "tests/benchmarks/test_benchmarks.py::test_04_geometrical_params",
            "params": null,
            "param": null,
            "extra_info": {},
            "options": {
                "disable_gc": false,
                "timer": "perf_counter",
                "min_rounds": 5,
                "max_time": 1.0,
                "min_time": 5e-06,
                "warmup": false
            },
            "stats": {
                "min": 0.5168080720000034,
                "max": 0.9045759730000213,
                "mean": 0.6043656892000115,
                "stddev": 0.16799205644941378,
                "rounds": 5,
                "median": 0.5317662040000073,
                "iqr": 0.10100047050001848,
                "q1": 0.5279270942500034,
                "q3": 0.6289275647500219,
                "iqr_outliers": 1,
                "stddev_outliers": 1,
                "outliers": "1;1",
                "ld15iqr": 0.5168080720000034,
                "hd15iqr": 0.9045759730000213,
                "ops": 1.6546273520650765,
                "total": 3.0218284460000575,
                "iterations": 1
            }
        },
        {
            "group": null,
            "name": "test_05_modulation",
            "fullname": "tests/benchmarks/test_benchmarks.py::test_05_modulation",
            "params": null,
            "param": null,
            "extra_info": {},
            "options": {
                "disable_gc": false,
                "timer": "perf_counter",
                "min_rounds": 5,
                "max_time": 1.0,
                "min_time": 5e-06,
                "warmup": false
            },
            "stats": {
                "min": 0.17431407099999774,
                "max": 0.5757200810000143,
                "mean": 0.2305142267500031,
                "stddev": 0.13958837664441714,
                "rounds": 8,
                "median": 0.18163263550000863,
                "iqr": 0.011100320500005978,
                "q1": 0.1771534374999959,
                "q3": 0.18825375800000188,
                "iqr_outliers": 1,
                "stddev_outliers": 1,
                "outliers": "1;1",
                "ld15iqr": 0.17431407099999774,
                "hd15iqr": 0.5757200810000143,
                "ops": 4.338127039267378,
                "total": 1.8441138140000248,
                "iterations": 1
            }
        },
        {
            "group": null,
            "name": "test_06_radiation_pressure",
            "fullname": "tests/benchmarks/test_benchmarks.py::test_06_radiation_pressure",
            "params": null,
            "param": null,
            "extra_info": {},
            "options": {
                "disable_gc": false,
                "timer": "perf_counter",
                "min_rounds": 5,
                "max_time": 1.0,
                "min_time": 5e-06,
                "warmup": false
            },
            "stats": {
                "min": 0.3104926960000114,
                "max": 0.316592208000003,
                "mean": 0.31344335660000977,
                "stddev": 0.002366527342396628,
                "rounds": 5,
                "median": 0.3135499560000028,
                "iqr": 0.003571246249997273,
                "q1": 0.3115682110000151,
                "q3": 0.31513945725001236,
                "iqr_outliers": 0,
                "stddev_outliers": 2,
                "outliers": "2;0",
                "ld15iqr": 0.3104926960000114,
                "hd15iqr": 0.316592208000003,
                "ops": 3.190369101604908,
                "total": 1.567216783000049,
                "iterations": 1
            }
        },
        {
            "group": null,
            "name": "test_07_homodyne",
            "fullname": "tests/benchmarks/test_benchmarks.py::test_07_homodyne",
            "params": null,
            "param": null,
            "extra_info": {},
            "options": {
                "disable_gc": false,
                "timer": "perf_counter",
                "min_rounds": 5,
                "max_time": 1.0,
                "min_time": 5e-06,
                "warmup": false
            },
            "stats": {
                "min": 0.11401310299999068,
                "max": 0.6161552390000224,
                "mean": 0.16700054639999848,
                "stddev": 0.15783994602144039,
                "rounds": 10,
                "median": 0.1173766750000027,
                "iqr": 0.005266092999988814,
                "q1": 0.11472130399999969,
                "q3": 0.1199873969999885,
                "iqr_outliers": 1,
                "stddev_outliers": 1,
                "outliers": "1;1",
                "ld15iqr": 0.11401310299999068,
                "hd15iqr": 0.6161552390000224,
                "ops": 5.988004360206148,
                "total": 1.6700054639999848,
                "iterations": 1
            }
        },
        {
            "group": null,
            "name": "test_08_optical_spring",
            "fullname": "tests/benchmarks/test_benchmarks.py::test_08_optical_spring",
            "params": null,
            "param": null,
            "extra_info": {},
            "options": {
                "disable_gc": false,
                "timer": "perf_counter",
                "min_rounds": 5,
                "max_time": 1.0,
                "min_time": 5e-06,
                "warmup": false
            },
            "stats": {
                "min": 0.2921616570000083,
                "max": 0.3097567050000123,
                "mean": 0.2982026338000082,
                "stddev": 0.00702664493100024,
                "rounds": 5,
                "median": 0.29479664800001615,
                "iqr": 0.008322387750020255,
                "q1": 0.29394041099999413,
                "q3": 0.3022627987500144,
                "iqr_outliers": 0,
                "stddev_outliers": 1,
                "outliers": "1;0",
                "ld15iqr": 0.2921616570000083,
                "hd15iqr": 0.3097567050000123,
                "ops": 3.3534244391371044,
                "total": 1.4910131690000412,
                "iterations": 1
            }
        },
        {
            "group": null,
            "name": "test_09_aligo_sensitivity",
            "fullname": "tests/benchmarks/test_benchmarks.py::test_09_aligo_sensitivity",
            "params": null,
            "param": null,
            "extra_info": {},
            "options": {
                "disable_gc": false,
                "timer": "perf_counter",
                "min_rounds": 5,
                "max_time": 1.0,
                "min_time": 5e-06,
                "warmup": false
            },
            "stats": {
                "min": 0.32181305099999236,
                "max": 0.8963872109999897,
                "mean": 0.4405556187999878,
                "stddev": 0.2548424337067106,
                "rounds": 5,
                "median": 0.3282318739999823,
                "iqr": 0.14839727550000248,
                "q1": 0.32420612924998693,
                "q3": 0.4726034047499894,
                "iqr_outliers": 1,
                "stddev_outliers": 1,
                "outliers": "1;1",
                "ld15iqr": 0.32181305099999236,
                "hd15iqr": 0.8963872109999897,
                "ops": 2.2698609604023687,
                "total": 2.202778093999939,
                "iterations": 1
            }
        },
        {
            "group": null,
            "name": "test_10_shifted_beam",
            "fullname": "tests/benchmarks/test_benchmarks.py::test_10_shifted_beam",
            "params": null,
            "param": null,
            "extra_info": {},
            "options": {
                "disable_gc": false,
                "timer": "perf_counter",
                "min_rounds": 5,
                "max_time": 1.0,
                "min_time": 5e-06,
                "warmup": false
            },
            "stats": {
                "min": 0.7181291670000007,
                "max": 0.7407440380000025,
                "mean": 0.724857120200005,
                "stddev": 0.009307894398010184,
                "rounds": 5,
                "median": 0.7212111580000169,
                "iqr": 0.01044415074999705,
                "q1": 0.7187125395000038,
                "q3": 0.7291566902500008,
                "iqr_outliers": 0,
                "stddev_outliers": 1,
                "outliers": "1;0",
                "ld15iqr": 0.7181291670000007,
                "hd15iqr": 0.7407440380000025,
                "ops": 1.3795822268036446,
                "total": 3.6242856010000253,
                "iterations": 1
            }
        },
        {
            "group": null,
            "name": "test_angular_radiation_pressure",
            "fullname": "tests/benchmarks/test_benchmarks.py::test_angular_radiation_pressure",
            "params": null,
            "param": null,
            "extra_info": {},
            "options": {
                "disable_gc": false,
                "timer": "perf_counter",
                "min_rounds": 5,
                "max_time": 1.0,
                "min_time": 5e-06,
                "warmup": false
            },
            "stats": {
                "min": 0.33391328700000145,
                "max": 0.341164109999994,
                "mean": 0.3372648723999987,
                "stddev": 0.002746361440413485,
                "rounds": 5,
                "median": 0.33648236799999154,
                "iqr": 0.0036780614999898376,
                "q1": 0.33558236775000694,
                "q3": 0.3392604292499968,
                "iqr_outliers": 0,
                "stddev_outliers": 2,
                "outliers": "2;0",
                "ld15iqr": 0.33391328700000145,
                "hd15iqr": 0.341164109999994,
                "ops": 2.9650286224116233,
                "total": 1.6863243619999935,
                "iterations": 1
            }
        },
        {
            "group": null,
            "name": "test_cavity_eigenmodes",
            "fullname": "tests/benchmarks/test_benchmarks.py::test_cavity_eigenmodes",
            "params": null,
            "param": null,
            "extra_info": {},
            "options": {
                "disable_gc": false,
                "timer": "perf_counter",
                "min_rounds": 5,
                "max_time": 1.0,
                "min_time": 5e-06,
                "warmup": false
            },
            "stats": {
                "min": 0.2662032849999889,
                "max": 1.1473465379999936,
                "mean": 0.4493985229999907,
                "stddev": 0.39020263953293327,
                "rounds": 5,
                "median": 0.27779069099997855,
                "iqr": 0.22465878050002885,
                "q1": 0.2727338754999806,
                "q3": 0.4973926560000095,
                "iqr_outliers": 1,
                "stddev_outliers": 1,
                "outliers": "1;1",
                "ld15iqr": 0.2662032849999889,
                "hd15iqr": 1.1473465379999936,
                "ops": 2.2251964544174094,
                "total": 2.2469926149999537,
                "iterations": 1
            }
        },
        {
            "group": null,
            "name": "test_coupled_cavity_commands",
            "fullname": "tests/benchmarks/test_benchmarks.py::test_coupled_cavity_commands",
            "params": null,
            "param": null,
            "extra_info": {},
            "options": {
                "disable_gc": false,
                "timer": "perf_counter",
                "min_rounds": 5,
                "max_time": 1.0,
                "min_time": 5e-06,
                "warmup": false
            },
            "stats": {
                "min": 4.294664415,
                "max": 5.406090287000012,
                "mean": 4.727796776600007,
                "stddev": 0.5386476044490336,
                "rounds": 5,
                "median": 4.39837900400002,
                "iqr": 0.9493587222499897,
                "q1": 4.315358793000009,
                "q3": 5.264717515249998,
                "iqr_outliers": 0,
                "stddev_outliers": 1,
                "outliers": "1;0",
                "ld15iqr": 4.294664415,
                "hd15iqr": 5.406090287000012,
                "ops": 0.21151501370563341,
                "total": 23.638983883000037,
                "iterations": 1
            }
        },
        {
            "group": null,
            "name": "test_frequency_dependant_squeezing",
            "fullname": "tests/benchmarks/test_benchmarks.py::test_frequency_dependant_squeezing",
            "params": null,
            "param": null,
            "extra_info": {},
            "options": {
                "disable_gc": false,
                "timer": "perf_counter",
                "min_rounds": 5,
                "max_time": 1.0,
                "min_time": 5e-06,
                "warmup": false
            },
            "stats": {
                "min": 1.495546141999995,
                "max": 2.790638919999992,
                "mean": 1.786724793799999,
                "stddev": 0.561757962506635,
                "rounds": 5,
                "median": 1.5430646579999916,
                "iqr": 0.3413095767500067,
                "q1": 1.5292586877500014,
                "q3": 1.8705682645000081,
                "iqr_outliers": 1,
                "stddev_outliers": 1,
                "outliers": "1;1",
                "ld15iqr": 1.495546141999995,
                "hd15iqr": 2.790638919999992,
                "ops": 0.5596832838890672,
                "total": 8.933623968999996,
                "iterations": 1
            }
        },
        {
            "group": null,
            "name": "test_lock_actions",
            "fullname": "tests/benchmarks/test_benchmarks.py::test_lock_actions",
            "params": null,
            "param": null,
            "extra_info": {},
            "options": {
                "disable_gc": false,
                "timer": "perf_counter",
                "min_rounds": 5,
                "max_time": 1.0,
                "min_time": 5e-06,
                "warmup": false
            },
            "stats": {
                "min": 4.706296283,
                "max": 6.419418151000002,
                "mean": 5.139918405000003,
                "stddev": 0.7192514007358999,
                "rounds": 5,
                "median": 4.885838503999992,
                "iqr": 0.4992234627500096,
                "q1": 4.7741172305000035,
                "q3": 5.273340693250013,
                "iqr_outliers": 1,
                "stddev_outliers": 1,
                "outliers": "1;1",
                "ld15iqr": 4.706296283,
                "hd15iqr": 6.419418151000002,
                "ops": 0.19455561765868137,
                "total": 25.699592025000015,
                "iterations": 1
            }
        }
    ],
    "datetime": "2024-05-22T13:56:56.356997",
    "version": "4.0.0"
}