{
    "machine_info": {
        "node": "runner-jlguopmm-project-39604133-concurrent-0",
        "processor": "",
        "machine": "x86_64",
        "python_compiler": "GCC 12.2.0",
        "python_implementation": "CPython",
        "python_implementation_version": "3.12.5",
        "python_version": "3.12.5",
        "python_build": [
            "main",
            "Aug 13 2024 02:19:05"
        ],
        "release": "5.15.154+",
        "system": "Linux",
        "cpu": {
            "python_version": "3.12.5.final.0 (64 bit)",
            "cpuinfo_version": [
                9,
                0,
                0
            ],
            "cpuinfo_version_string": "9.0.0",
            "arch": "X86_64",
            "bits": 64,
            "count": 2,
            "arch_string_raw": "x86_64",
            "vendor_id_raw": "AuthenticAMD",
            "brand_raw": "AMD EPYC 7B13",
            "hz_advertised_friendly": "2.4500 GHz",
            "hz_actual_friendly": "2.4500 GHz",
            "hz_advertised": [
                2449996000,
                0
            ],
            "hz_actual": [
                2449996000,
                0
            ],
            "model": 1,
            "family": 25,
            "flags": [
                "3dnowext",
                "3dnowprefetch",
                "abm",
                "adx",
                "aes",
                "apic",
                "arat",
                "avx",
                "avx2",
                "bmi1",
                "bmi2",
                "clflush",
                "clflushopt",
                "clwb",
                "clzero",
                "cmov",
                "cmp_legacy",
                "constant_tsc",
                "cpuid",
                "cr8_legacy",
                "cx16",
                "cx8",
                "de",
                "erms",
                "extd_apicid",
                "f16c",
                "fma",
                "fpu",
                "fsgsbase",
                "fsrm",
                "fxsr",
                "fxsr_opt",
                "ht",
                "hypervisor",
                "ibpb",
                "ibrs",
                "invpcid",
                "invpcid_single",
                "lahf_lm",
                "lm",
                "mca",
                "mce",
                "misalignsse",
                "mmx",
                "mmxext",
                "movbe",
                "msr",
                "mtrr",
                "nonstop_tsc",
                "nopl",
                "npt",
                "nrip_save",
                "nx",
                "osvw",
                "osxsave",
                "pae",
                "pat",
                "pcid",
                "pclmulqdq",
                "pdpe1gb",
                "pge",
                "pni",
                "popcnt",
                "pse",
                "pse36",
                "rdpid",
                "rdrand",
                "rdrnd",
                "rdseed",
                "rdtscp",
                "rep_good",
                "sep",
                "sha",
                "sha_ni",
                "smap",
                "smep",
                "ssbd",
                "sse",
                "sse2",
                "sse4_1",
                "sse4_2",
                "sse4a",
                "ssse3",
                "stibp",
                "syscall",
                "topoext",
                "tsc",
                "tsc_adjust",
                "tsc_known_freq",
                "umip",
                "vaes",
                "vme",
                "vmmcall",
                "vpclmulqdq",
                "x2apic",
                "xgetbv1",
                "xsave",
                "xsavec",
                "xsaveerptr",
                "xsaveopt"
            ],
            "l3_cache_size": 524288,
            "l2_cache_size": 524288,
            "l1_data_cache_size": 32768,
            "l1_instruction_cache_size": 32768,
            "l2_cache_line_size": 512,
            "l2_cache_associativity": 6
        }
    },
    "commit_info": {
        "id": "4ff22316658c009228570f86de44b31c46ef5f03",
        "time": "2024-08-26T16:12:57+02:00",
        "author_time": "2024-08-26T16:12:57+02:00",
        "dirty": false,
        "project": "finesse3",
        "branch": "(detached head)"
    },
    "benchmarks": [
        {
            "group": null,
            "name": "test_01_simple_cav",
            "fullname": "tests/benchmarks/test_benchmarks.py::test_01_simple_cav",
            "params": null,
            "param": null,
            "extra_info": {},
            "options": {
                "disable_gc": false,
                "timer": "perf_counter",
                "min_rounds": 5,
                "max_time": 1.0,
                "min_time": 5e-06,
                "warmup": false
            },
            "stats": {
                "min": 0.2611905619999959,
                "max": 0.4479911720000018,
                "mean": 0.30205744220000097,
                "stddev": 0.08168278775505702,
                "rounds": 5,
                "median": 0.26513658999999734,
                "iqr": 0.05310535125000726,
                "q1": 0.2630833737499998,
                "q3": 0.31618872500000705,
                "iqr_outliers": 1,
                "stddev_outliers": 1,
                "outliers": "1;1",
                "ld15iqr": 0.2611905619999959,
                "hd15iqr": 0.4479911720000018,
                "ops": 3.310628576858143,
                "total": 1.510287211000005,
                "iterations": 1
            }
        },
        {
            "group": null,
            "name": "test_02_pdh_lock",
            "fullname": "tests/benchmarks/test_benchmarks.py::test_02_pdh_lock",
            "params": null,
            "param": null,
            "extra_info": {},
            "options": {
                "disable_gc": false,
                "timer": "perf_counter",
                "min_rounds": 5,
                "max_time": 1.0,
                "min_time": 5e-06,
                "warmup": false
            },
            "stats": {
                "min": 1.1800269820000153,
                "max": 1.4832122280000135,
                "mean": 1.285234224800007,
                "stddev": 0.13911799167639616,
                "rounds": 5,
                "median": 1.1954811630000108,
                "iqr": 0.22234885774999924,
                "q1": 1.1845245040000023,
                "q3": 1.4068733617500015,
                "iqr_outliers": 0,
                "stddev_outliers": 1,
                "outliers": "1;0",
                "ld15iqr": 1.1800269820000153,
                "hd15iqr": 1.4832122280000135,
                "ops": 0.7780682934704826,
                "total": 6.426171124000035,
                "iterations": 1
            }
        },
        {
            "group": null,
            "name": "test_03_near_unstable",
            "fullname": "tests/benchmarks/test_benchmarks.py::test_03_near_unstable",
            "params": null,
            "param": null,
            "extra_info": {},
            "options": {
                "disable_gc": false,
                "timer": "perf_counter",
                "min_rounds": 5,
                "max_time": 1.0,
                "min_time": 5e-06,
                "warmup": false
            },
            "stats": {
                "min": 1.879999985021641e-06,
                "max": 5.550000000198452e-05,
                "mean": 1.9999448641700192e-06,
                "stddev": 4.971160862093139e-07,
                "rounds": 69882,
                "median": 1.96000002006258e-06,
                "iqr": 4.999998282073648e-08,
                "q1": 1.940000004196918e-06,
                "q3": 1.9899999870176543e-06,
                "iqr_outliers": 1540,
                "stddev_outliers": 540,
                "outliers": "540;1540",
                "ld15iqr": 1.879999985021641e-06,
                "hd15iqr": 2.0689999757905753e-06,
                "ops": 500013.7843375007,
                "total": 0.13976014699792927,
                "iterations": 1
            }
        },
        {
            "group": null,
            "name": "test_04_geometrical_params",
            "fullname": "tests/benchmarks/test_benchmarks.py::test_04_geometrical_params",
            "params": null,
            "param": null,
            "extra_info": {},
            "options": {
                "disable_gc": false,
                "timer": "perf_counter",
                "min_rounds": 5,
                "max_time": 1.0,
                "min_time": 5e-06,
                "warmup": false
            },
            "stats": {
                "min": 0.4463052629999993,
                "max": 0.7993128359999844,
                "mean": 0.5265423555999973,
                "stddev": 0.15268590275254015,
                "rounds": 5,
                "median": 0.46338388199998803,
                "iqr": 0.0959214704999809,
                "q1": 0.45413270100001313,
                "q3": 0.550054171499994,
                "iqr_outliers": 1,
                "stddev_outliers": 1,
                "outliers": "1;1",
                "ld15iqr": 0.4463052629999993,
                "hd15iqr": 0.7993128359999844,
                "ops": 1.8991824482201354,
                "total": 2.6327117779999867,
                "iterations": 1
            }
        },
        {
            "group": null,
            "name": "test_05_modulation",
            "fullname": "tests/benchmarks/test_benchmarks.py::test_05_modulation",
            "params": null,
            "param": null,
            "extra_info": {},
            "options": {
                "disable_gc": false,
                "timer": "perf_counter",
                "min_rounds": 5,
                "max_time": 1.0,
                "min_time": 5e-06,
                "warmup": false
            },
            "stats": {
                "min": 0.11475633599999924,
                "max": 0.5083894739999835,
                "mean": 0.16052130477777382,
                "stddev": 0.13046683193988168,
                "rounds": 9,
                "median": 0.11622343499999488,
                "iqr": 0.004290637500012906,
                "q1": 0.11560987299999681,
                "q3": 0.11990051050000972,
                "iqr_outliers": 1,
                "stddev_outliers": 1,
                "outliers": "1;1",
                "ld15iqr": 0.11475633599999924,
                "hd15iqr": 0.5083894739999835,
                "ops": 6.2297026639822235,
                "total": 1.4446917429999644,
                "iterations": 1
            }
        },
        {
            "group": null,
            "name": "test_06_radiation_pressure",
            "fullname": "tests/benchmarks/test_benchmarks.py::test_06_radiation_pressure",
            "params": null,
            "param": null,
            "extra_info": {},
            "options": {
                "disable_gc": false,
                "timer": "perf_counter",
                "min_rounds": 5,
                "max_time": 1.0,
                "min_time": 5e-06,
                "warmup": false
            },
            "stats": {
                "min": 0.2360362489999943,
                "max": 0.26303672099999176,
                "mean": 0.24762732720000144,
                "stddev": 0.010140070162560903,
                "rounds": 5,
                "median": 0.2449684230000173,
                "iqr": 0.012725664249984447,
                "q1": 0.24130700525000748,
                "q3": 0.2540326694999919,
                "iqr_outliers": 0,
                "stddev_outliers": 2,
                "outliers": "2;0",
                "ld15iqr": 0.2360362489999943,
                "hd15iqr": 0.26303672099999176,
                "ops": 4.0383265098699255,
                "total": 1.2381366360000072,
                "iterations": 1
            }
        },
        {
            "group": null,
            "name": "test_07_homodyne",
            "fullname": "tests/benchmarks/test_benchmarks.py::test_07_homodyne",
            "params": null,
            "param": null,
            "extra_info": {},
            "options": {
                "disable_gc": false,
                "timer": "perf_counter",
                "min_rounds": 5,
                "max_time": 1.0,
                "min_time": 5e-06,
                "warmup": false
            },
            "stats": {
                "min": 0.08034323900000118,
                "max": 0.08425147500000207,
                "mean": 0.08202946090909274,
                "stddev": 0.001324212303311592,
                "rounds": 11,
                "median": 0.08198399700000891,
                "iqr": 0.0021627492499831646,
                "q1": 0.0807109502500083,
                "q3": 0.08287369949999146,
                "iqr_outliers": 0,
                "stddev_outliers": 5,
                "outliers": "5;0",
                "ld15iqr": 0.08034323900000118,
                "hd15iqr": 0.08425147500000207,
                "ops": 12.19074206897723,
                "total": 0.9023240700000201,
                "iterations": 1
            }
        },
        {
            "group": null,
            "name": "test_08_optical_spring",
            "fullname": "tests/benchmarks/test_benchmarks.py::test_08_optical_spring",
            "params": null,
            "param": null,
            "extra_info": {},
            "options": {
                "disable_gc": false,
                "timer": "perf_counter",
                "min_rounds": 5,
                "max_time": 1.0,
                "min_time": 5e-06,
                "warmup": false
            },
            "stats": {
                "min": 0.21770032000000583,
                "max": 0.22456465100000855,
                "mean": 0.22021862440000178,
                "stddev": 0.00280236153510993,
                "rounds": 5,
                "median": 0.21995565599999622,
                "iqr": 0.004061494000005439,
                "q1": 0.21782955999999842,
                "q3": 0.22189105400000386,
                "iqr_outliers": 0,
                "stddev_outliers": 1,
                "outliers": "1;0",
                "ld15iqr": 0.21770032000000583,
                "hd15iqr": 0.22456465100000855,
                "ops": 4.5409419967296465,
                "total": 1.1010931220000089,
                "iterations": 1
            }
        },
        {
            "group": null,
            "name": "test_09_aligo_sensitivity",
            "fullname": "tests/benchmarks/test_benchmarks.py::test_09_aligo_sensitivity",
            "params": null,
            "param": null,
            "extra_info": {},
            "options": {
                "disable_gc": false,
                "timer": "perf_counter",
                "min_rounds": 5,
                "max_time": 1.0,
                "min_time": 5e-06,
                "warmup": false
            },
            "stats": {
                "min": 0.24474820099999306,
                "max": 0.26025621399998045,
                "mean": 0.2517535731999942,
                "stddev": 0.005695044247638517,
                "rounds": 5,
                "median": 0.25093115999999327,
                "iqr": 0.006773964499998897,
                "q1": 0.24830067874999884,
                "q3": 0.25507464324999773,
                "iqr_outliers": 0,
                "stddev_outliers": 2,
                "outliers": "2;0",
                "ld15iqr": 0.24474820099999306,
                "hd15iqr": 0.26025621399998045,
                "ops": 3.9721382592079255,
                "total": 1.258767865999971,
                "iterations": 1
            }
        },
        {
            "group": null,
            "name": "test_10_shifted_beam",
            "fullname": "tests/benchmarks/test_benchmarks.py::test_10_shifted_beam",
            "params": null,
            "param": null,
            "extra_info": {},
            "options": {
                "disable_gc": false,
                "timer": "perf_counter",
                "min_rounds": 5,
                "max_time": 1.0,
                "min_time": 5e-06,
                "warmup": false
            },
            "stats": {
                "min": 0.7111810990000151,
                "max": 1.369067359000013,
                "mean": 0.8438913920000004,
                "stddev": 0.29358444827018404,
                "rounds": 5,
                "median": 0.7129640510000002,
                "iqr": 0.16610664974998457,
                "q1": 0.7118194015000014,
                "q3": 0.877926051249986,
                "iqr_outliers": 1,
                "stddev_outliers": 1,
                "outliers": "1;1",
                "ld15iqr": 0.7111810990000151,
                "hd15iqr": 1.369067359000013,
                "ops": 1.1849866102200974,
                "total": 4.219456960000002,
                "iterations": 1
            }
        },
        {
            "group": null,
            "name": "test_angular_radiation_pressure",
            "fullname": "tests/benchmarks/test_benchmarks.py::test_angular_radiation_pressure",
            "params": null,
            "param": null,
            "extra_info": {},
            "options": {
                "disable_gc": false,
                "timer": "perf_counter",
                "min_rounds": 5,
                "max_time": 1.0,
                "min_time": 5e-06,
                "warmup": false
            },
            "stats": {
                "min": 0.2897248579999996,
                "max": 0.2981630890000133,
                "mean": 0.29257347760000696,
                "stddev": 0.0032967897919347145,
                "rounds": 5,
                "median": 0.29194753100000526,
                "iqr": 0.003403556750008363,
                "q1": 0.2904211812500037,
                "q3": 0.2938247380000121,
                "iqr_outliers": 0,
                "stddev_outliers": 1,
                "outliers": "1;0",
                "ld15iqr": 0.2897248579999996,
                "hd15iqr": 0.2981630890000133,
                "ops": 3.4179448123700196,
                "total": 1.462867388000035,
                "iterations": 1
            }
        },
        {
            "group": null,
            "name": "test_cavity_eigenmodes",
            "fullname": "tests/benchmarks/test_benchmarks.py::test_cavity_eigenmodes",
            "params": null,
            "param": null,
            "extra_info": {},
            "options": {
                "disable_gc": false,
                "timer": "perf_counter",
                "min_rounds": 5,
                "max_time": 1.0,
                "min_time": 5e-06,
                "warmup": false
            },
            "stats": {
                "min": 0.25062008899999455,
                "max": 1.033884133999976,
                "mean": 0.41198701739998567,
                "stddev": 0.3476851121787594,
                "rounds": 5,
                "median": 0.26020537399998034,
                "iqr": 0.20284687424997827,
                "q1": 0.25234914949999876,
                "q3": 0.45519602374997703,
                "iqr_outliers": 1,
                "stddev_outliers": 1,
                "outliers": "1;1",
                "ld15iqr": 0.25062008899999455,
                "hd15iqr": 1.033884133999976,
                "ops": 2.4272609518399713,
                "total": 2.0599350869999284,
                "iterations": 1
            }
        },
        {
            "group": null,
            "name": "test_coupled_cavity_commands",
            "fullname": "tests/benchmarks/test_benchmarks.py::test_coupled_cavity_commands",
            "params": null,
            "param": null,
            "extra_info": {},
            "options": {
                "disable_gc": false,
                "timer": "perf_counter",
                "min_rounds": 5,
                "max_time": 1.0,
                "min_time": 5e-06,
                "warmup": false
            },
            "stats": {
                "min": 4.17640574699999,
                "max": 5.26793074699998,
                "mean": 4.589569388400003,
                "stddev": 0.5278171054479649,
                "rounds": 5,
                "median": 4.236746776000018,
                "iqr": 0.9049870190000036,
                "q1": 4.203084929250004,
                "q3": 5.108071948250007,
                "iqr_outliers": 0,
                "stddev_outliers": 1,
                "outliers": "1;0",
                "ld15iqr": 4.17640574699999,
                "hd15iqr": 5.26793074699998,
                "ops": 0.21788536469836794,
                "total": 22.947846942000012,
                "iterations": 1
            }
        },
        {
            "group": null,
            "name": "test_frequency_dependant_squeezing",
            "fullname": "tests/benchmarks/test_benchmarks.py::test_frequency_dependant_squeezing",
            "params": null,
            "param": null,
            "extra_info": {},
            "options": {
                "disable_gc": false,
                "timer": "perf_counter",
                "min_rounds": 5,
                "max_time": 1.0,
                "min_time": 5e-06,
                "warmup": false
            },
            "stats": {
                "min": 1.474367013999995,
                "max": 2.754711821000001,
                "mean": 1.749014607199996,
                "stddev": 0.5625123289122547,
                "rounds": 5,
                "median": 1.513094080000002,
                "iqr": 0.3457924930000189,
                "q1": 1.4818261532499832,
                "q3": 1.8276186462500021,
                "iqr_outliers": 1,
                "stddev_outliers": 1,
                "outliers": "1;1",
                "ld15iqr": 1.474367013999995,
                "hd15iqr": 2.754711821000001,
                "ops": 0.5717505136225842,
                "total": 8.74507303599998,
                "iterations": 1
            }
        },
        {
            "group": null,
            "name": "test_lock_actions",
            "fullname": "tests/benchmarks/test_benchmarks.py::test_lock_actions",
            "params": null,
            "param": null,
            "extra_info": {},
            "options": {
                "disable_gc": false,
                "timer": "perf_counter",
                "min_rounds": 5,
                "max_time": 1.0,
                "min_time": 5e-06,
                "warmup": false
            },
            "stats": {
                "min": 3.055994750999986,
                "max": 4.393562734,
                "mean": 3.3569995136000044,
                "stddev": 0.58019082942176,
                "rounds": 5,
                "median": 3.1210584850000203,
                "iqr": 0.3669364727499982,
                "q1": 3.0781195485000055,
                "q3": 3.4450560212500037,
                "iqr_outliers": 1,
                "stddev_outliers": 1,
                "outliers": "1;1",
                "ld15iqr": 3.055994750999986,
                "hd15iqr": 4.393562734,
                "ops": 0.2978850595446207,
                "total": 16.784997568000023,
                "iterations": 1
            }
        }
    ],
    "datetime": "2024-08-26T14:30:14.578360",
    "version": "4.0.0"
}