{
    "machine_info": {
        "node": "runner-jlguopmm-project-39604133-concurrent-0",
        "processor": "",
        "machine": "x86_64",
        "python_compiler": "GCC 12.2.0",
        "python_implementation": "CPython",
        "python_implementation_version": "3.12.4",
        "python_version": "3.12.4",
        "python_build": [
            "main",
            "Jul 23 2024 07:23:10"
        ],
        "release": "5.15.154+",
        "system": "Linux",
        "cpu": {
            "python_version": "3.12.4.final.0 (64 bit)",
            "cpuinfo_version": [
                9,
                0,
                0
            ],
            "cpuinfo_version_string": "9.0.0",
            "arch": "X86_64",
            "bits": 64,
            "count": 2,
            "arch_string_raw": "x86_64",
            "vendor_id_raw": "AuthenticAMD",
            "brand_raw": "AMD EPYC 7B13",
            "hz_advertised_friendly": "2.4500 GHz",
            "hz_actual_friendly": "2.4500 GHz",
            "hz_advertised": [
                2449998000,
                0
            ],
            "hz_actual": [
                2449998000,
                0
            ],
            "model": 1,
            "family": 25,
            "flags": [
                "3dnowext",
                "3dnowprefetch",
                "abm",
                "adx",
                "aes",
                "apic",
                "arat",
                "avx",
                "avx2",
                "bmi1",
                "bmi2",
                "clflush",
                "clflushopt",
                "clwb",
                "clzero",
                "cmov",
                "cmp_legacy",
                "constant_tsc",
                "cpuid",
                "cr8_legacy",
                "cx16",
                "cx8",
                "de",
                "erms",
                "extd_apicid",
                "f16c",
                "fma",
                "fpu",
                "fsgsbase",
                "fsrm",
                "fxsr",
                "fxsr_opt",
                "ht",
                "hypervisor",
                "ibpb",
                "ibrs",
                "invpcid",
                "invpcid_single",
                "lahf_lm",
                "lm",
                "mca",
                "mce",
                "misalignsse",
                "mmx",
                "mmxext",
                "movbe",
                "msr",
                "mtrr",
                "nonstop_tsc",
                "nopl",
                "npt",
                "nrip_save",
                "nx",
                "osvw",
                "osxsave",
                "pae",
                "pat",
                "pcid",
                "pclmulqdq",
                "pdpe1gb",
                "pge",
                "pni",
                "popcnt",
                "pse",
                "pse36",
                "rdpid",
                "rdrand",
                "rdrnd",
                "rdseed",
                "rdtscp",
                "rep_good",
                "sep",
                "sha",
                "sha_ni",
                "smap",
                "smep",
                "ssbd",
                "sse",
                "sse2",
                "sse4_1",
                "sse4_2",
                "sse4a",
                "ssse3",
                "stibp",
                "syscall",
                "topoext",
                "tsc",
                "tsc_adjust",
                "tsc_known_freq",
                "umip",
                "vaes",
                "vme",
                "vmmcall",
                "vpclmulqdq",
                "x2apic",
                "xgetbv1",
                "xsave",
                "xsavec",
                "xsaveerptr",
                "xsaveopt"
            ],
            "l3_cache_size": 524288,
            "l2_cache_size": 524288,
            "l1_data_cache_size": 32768,
            "l1_instruction_cache_size": 32768,
            "l2_cache_line_size": 512,
            "l2_cache_associativity": 6
        }
    },
    "commit_info": {
        "id": "7e8860bb4c02ec7cce523d65f6ad65beab9fbde5",
        "time": "2024-07-29T17:05:51+02:00",
        "author_time": "2024-07-29T17:05:51+02:00",
        "dirty": false,
        "project": "finesse3",
        "branch": "(detached head)"
    },
    "benchmarks": [
        {
            "group": null,
            "name": "test_01_simple_cav",
            "fullname": "tests/benchmarks/test_benchmarks.py::test_01_simple_cav",
            "params": null,
            "param": null,
            "extra_info": {},
            "options": {
                "disable_gc": false,
                "timer": "perf_counter",
                "min_rounds": 5,
                "max_time": 1.0,
                "min_time": 5e-06,
                "warmup": false
            },
            "stats": {
                "min": 0.26881507600000987,
                "max": 0.48954939000000763,
                "mean": 0.31523471319999885,
                "stddev": 0.09746009819202395,
                "rounds": 5,
                "median": 0.2728301060000149,
                "iqr": 0.05626314349999717,
                "q1": 0.2710311092499893,
                "q3": 0.32729425274998647,
                "iqr_outliers": 1,
                "stddev_outliers": 1,
                "outliers": "1;1",
                "ld15iqr": 0.26881507600000987,
                "hd15iqr": 0.48954939000000763,
                "ops": 3.1722394714999416,
                "total": 1.5761735659999943,
                "iterations": 1
            }
        },
        {
            "group": null,
            "name": "test_02_pdh_lock",
            "fullname": "tests/benchmarks/test_benchmarks.py::test_02_pdh_lock",
            "params": null,
            "param": null,
            "extra_info": {},
            "options": {
                "disable_gc": false,
                "timer": "perf_counter",
                "min_rounds": 5,
                "max_time": 1.0,
                "min_time": 5e-06,
                "warmup": false
            },
            "stats": {
                "min": 1.1752855679999925,
                "max": 1.4622495180000215,
                "mean": 1.2407206300000042,
                "stddev": 0.12409348486522992,
                "rounds": 5,
                "median": 1.192722941999989,
                "iqr": 0.08201411550002291,
                "q1": 1.178689248749997,
                "q3": 1.2607033642500198,
                "iqr_outliers": 1,
                "stddev_outliers": 1,
                "outliers": "1;1",
                "ld15iqr": 1.1752855679999925,
                "hd15iqr": 1.4622495180000215,
                "ops": 0.8059832131589499,
                "total": 6.203603150000021,
                "iterations": 1
            }
        },
        {
            "group": null,
            "name": "test_03_near_unstable",
            "fullname": "tests/benchmarks/test_benchmarks.py::test_03_near_unstable",
            "params": null,
            "param": null,
            "extra_info": {},
            "options": {
                "disable_gc": false,
                "timer": "perf_counter",
                "min_rounds": 5,
                "max_time": 1.0,
                "min_time": 5e-06,
                "warmup": false
            },
            "stats": {
                "min": 1.879999985021641e-06,
                "max": 4.078000000617976e-05,
                "mean": 1.9970933562725044e-06,
                "stddev": 5.710103308690486e-07,
                "rounds": 28418,
                "median": 1.9599999916408706e-06,
                "iqr": 2.999999537678377e-08,
                "q1": 1.940000004196918e-06,
                "q3": 1.9699999995737016e-06,
                "iqr_outliers": 1465,
                "stddev_outliers": 261,
                "outliers": "261;1465",
                "ld15iqr": 1.8999999724655936e-06,
                "hd15iqr": 2.019999982394438e-06,
                "ops": 500727.7185411404,
                "total": 0.05675339899855203,
                "iterations": 1
            }
        },
        {
            "group": null,
            "name": "test_04_geometrical_params",
            "fullname": "tests/benchmarks/test_benchmarks.py::test_04_geometrical_params",
            "params": null,
            "param": null,
            "extra_info": {},
            "options": {
                "disable_gc": false,
                "timer": "perf_counter",
                "min_rounds": 5,
                "max_time": 1.0,
                "min_time": 5e-06,
                "warmup": false
            },
            "stats": {
                "min": 0.45431571099999246,
                "max": 0.9102601579999998,
                "mean": 0.623814411799998,
                "stddev": 0.2224436360627567,
                "rounds": 5,
                "median": 0.4740297559999931,
                "iqr": 0.3826685477500078,
                "q1": 0.4594126224999968,
                "q3": 0.8420811702500046,
                "iqr_outliers": 0,
                "stddev_outliers": 1,
                "outliers": "1;0",
                "ld15iqr": 0.45431571099999246,
                "hd15iqr": 0.9102601579999998,
                "ops": 1.6030408741512234,
                "total": 3.11907205899999,
                "iterations": 1
            }
        },
        {
            "group": null,
            "name": "test_05_modulation",
            "fullname": "tests/benchmarks/test_benchmarks.py::test_05_modulation",
            "params": null,
            "param": null,
            "extra_info": {},
            "options": {
                "disable_gc": false,
                "timer": "perf_counter",
                "min_rounds": 5,
                "max_time": 1.0,
                "min_time": 5e-06,
                "warmup": false
            },
            "stats": {
                "min": 0.12298354300000369,
                "max": 0.13346945800000753,
                "mean": 0.12741732875000267,
                "stddev": 0.003879865056114114,
                "rounds": 8,
                "median": 0.12721125500000596,
                "iqr": 0.005936842500005923,
                "q1": 0.12414735849999659,
                "q3": 0.1300842010000025,
                "iqr_outliers": 0,
                "stddev_outliers": 4,
                "outliers": "4;0",
                "ld15iqr": 0.12298354300000369,
                "hd15iqr": 0.13346945800000753,
                "ops": 7.848226060067823,
                "total": 1.0193386300000213,
                "iterations": 1
            }
        },
        {
            "group": null,
            "name": "test_06_radiation_pressure",
            "fullname": "tests/benchmarks/test_benchmarks.py::test_06_radiation_pressure",
            "params": null,
            "param": null,
            "extra_info": {},
            "options": {
                "disable_gc": false,
                "timer": "perf_counter",
                "min_rounds": 5,
                "max_time": 1.0,
                "min_time": 5e-06,
                "warmup": false
            },
            "stats": {
                "min": 0.24756114699999898,
                "max": 0.820506024999986,
                "mean": 0.3654397541999913,
                "stddev": 0.25440094012543063,
                "rounds": 5,
                "median": 0.25290968999999563,
                "iqr": 0.14363683275000483,
                "q1": 0.2515231959999866,
                "q3": 0.39516002874999145,
                "iqr_outliers": 1,
                "stddev_outliers": 1,
                "outliers": "1;1",
                "ld15iqr": 0.24756114699999898,
                "hd15iqr": 0.820506024999986,
                "ops": 2.7364291610505465,
                "total": 1.8271987709999564,
                "iterations": 1
            }
        },
        {
            "group": null,
            "name": "test_07_homodyne",
            "fullname": "tests/benchmarks/test_benchmarks.py::test_07_homodyne",
            "params": null,
            "param": null,
            "extra_info": {},
            "options": {
                "disable_gc": false,
                "timer": "perf_counter",
                "min_rounds": 5,
                "max_time": 1.0,
                "min_time": 5e-06,
                "warmup": false
            },
            "stats": {
                "min": 0.08332349599999134,
                "max": 0.09088498999997796,
                "mean": 0.08695499754545401,
                "stddev": 0.002592333014433753,
                "rounds": 11,
                "median": 0.08790473799999177,
                "iqr": 0.004632062500014911,
                "q1": 0.08434424624999792,
                "q3": 0.08897630875001283,
                "iqr_outliers": 0,
                "stddev_outliers": 4,
                "outliers": "4;0",
                "ld15iqr": 0.08332349599999134,
                "hd15iqr": 0.09088498999997796,
                "ops": 11.500201578147013,
                "total": 0.9565049729999942,
                "iterations": 1
            }
        },
        {
            "group": null,
            "name": "test_08_optical_spring",
            "fullname": "tests/benchmarks/test_benchmarks.py::test_08_optical_spring",
            "params": null,
            "param": null,
            "extra_info": {},
            "options": {
                "disable_gc": false,
                "timer": "perf_counter",
                "min_rounds": 5,
                "max_time": 1.0,
                "min_time": 5e-06,
                "warmup": false
            },
            "stats": {
                "min": 0.23208327000000395,
                "max": 0.9116956940000023,
                "mean": 0.3703920539999956,
                "stddev": 0.30261088187066687,
                "rounds": 5,
                "median": 0.23529389199998718,
                "iqr": 0.17447751500000663,
                "q1": 0.23306639324999168,
                "q3": 0.4075439082499983,
                "iqr_outliers": 1,
                "stddev_outliers": 1,
                "outliers": "1;1",
                "ld15iqr": 0.23208327000000395,
                "hd15iqr": 0.9116956940000023,
                "ops": 2.6998419355940393,
                "total": 1.851960269999978,
                "iterations": 1
            }
        },
        {
            "group": null,
            "name": "test_09_aligo_sensitivity",
            "fullname": "tests/benchmarks/test_benchmarks.py::test_09_aligo_sensitivity",
            "params": null,
            "param": null,
            "extra_info": {},
            "options": {
                "disable_gc": false,
                "timer": "perf_counter",
                "min_rounds": 5,
                "max_time": 1.0,
                "min_time": 5e-06,
                "warmup": false
            },
            "stats": {
                "min": 0.2514895379999871,
                "max": 0.26058478299998455,
                "mean": 0.25826261359998737,
                "stddev": 0.0038312793341742602,
                "rounds": 5,
                "median": 0.2596916219999912,
                "iqr": 0.003245796999998163,
                "q1": 0.25721656349998767,
                "q3": 0.26046236049998583,
                "iqr_outliers": 1,
                "stddev_outliers": 1,
                "outliers": "1;1",
                "ld15iqr": 0.25912557199998787,
                "hd15iqr": 0.26058478299998455,
                "ops": 3.872027724263876,
                "total": 1.291313067999937,
                "iterations": 1
            }
        },
        {
            "group": null,
            "name": "test_10_shifted_beam",
            "fullname": "tests/benchmarks/test_benchmarks.py::test_10_shifted_beam",
            "params": null,
            "param": null,
            "extra_info": {},
            "options": {
                "disable_gc": false,
                "timer": "perf_counter",
                "min_rounds": 5,
                "max_time": 1.0,
                "min_time": 5e-06,
                "warmup": false
            },
            "stats": {
                "min": 0.7153488789999756,
                "max": 1.4903867439999772,
                "mean": 0.8823900551999941,
                "stddev": 0.34003719486545353,
                "rounds": 5,
                "median": 0.7367375880000111,
                "iqr": 0.20546820899999574,
                "q1": 0.7240367477499987,
                "q3": 0.9295049567499944,
                "iqr_outliers": 1,
                "stddev_outliers": 1,
                "outliers": "1;1",
                "ld15iqr": 0.7153488789999756,
                "hd15iqr": 1.4903867439999772,
                "ops": 1.1332856644370835,
                "total": 4.4119502759999705,
                "iterations": 1
            }
        },
        {
            "group": null,
            "name": "test_angular_radiation_pressure",
            "fullname": "tests/benchmarks/test_benchmarks.py::test_angular_radiation_pressure",
            "params": null,
            "param": null,
            "extra_info": {},
            "options": {
                "disable_gc": false,
                "timer": "perf_counter",
                "min_rounds": 5,
                "max_time": 1.0,
                "min_time": 5e-06,
                "warmup": false
            },
            "stats": {
                "min": 0.2835695729999941,
                "max": 0.30086912999999527,
                "mean": 0.2939161489999947,
                "stddev": 0.0066518472162362275,
                "rounds": 5,
                "median": 0.2965504580000129,
                "iqr": 0.00834489824998741,
                "q1": 0.28960423274999414,
                "q3": 0.29794913099998155,
                "iqr_outliers": 0,
                "stddev_outliers": 2,
                "outliers": "2;0",
                "ld15iqr": 0.2835695729999941,
                "hd15iqr": 0.30086912999999527,
                "ops": 3.4023309144541702,
                "total": 1.4695807449999734,
                "iterations": 1
            }
        },
        {
            "group": null,
            "name": "test_cavity_eigenmodes",
            "fullname": "tests/benchmarks/test_benchmarks.py::test_cavity_eigenmodes",
            "params": null,
            "param": null,
            "extra_info": {},
            "options": {
                "disable_gc": false,
                "timer": "perf_counter",
                "min_rounds": 5,
                "max_time": 1.0,
                "min_time": 5e-06,
                "warmup": false
            },
            "stats": {
                "min": 0.2604027819999999,
                "max": 0.29042498500001557,
                "mean": 0.27367631420000293,
                "stddev": 0.012971095627448024,
                "rounds": 5,
                "median": 0.27022662699999955,
                "iqr": 0.02266935600001574,
                "q1": 0.26276648424999394,
                "q3": 0.2854358402500097,
                "iqr_outliers": 0,
                "stddev_outliers": 2,
                "outliers": "2;0",
                "ld15iqr": 0.2604027819999999,
                "hd15iqr": 0.29042498500001557,
                "ops": 3.6539515775164926,
                "total": 1.3683815710000147,
                "iterations": 1
            }
        },
        {
            "group": null,
            "name": "test_coupled_cavity_commands",
            "fullname": "tests/benchmarks/test_benchmarks.py::test_coupled_cavity_commands",
            "params": null,
            "param": null,
            "extra_info": {},
            "options": {
                "disable_gc": false,
                "timer": "perf_counter",
                "min_rounds": 5,
                "max_time": 1.0,
                "min_time": 5e-06,
                "warmup": false
            },
            "stats": {
                "min": 4.339221076000001,
                "max": 5.497802516000007,
                "mean": 4.710954096,
                "stddev": 0.45892287850730473,
                "rounds": 5,
                "median": 4.609578932000005,
                "iqr": 0.4594555884999991,
                "q1": 4.415463138249997,
                "q3": 4.874918726749996,
                "iqr_outliers": 0,
                "stddev_outliers": 1,
                "outliers": "1;0",
                "ld15iqr": 4.339221076000001,
                "hd15iqr": 5.497802516000007,
                "ops": 0.21227122566298934,
                "total": 23.554770480000002,
                "iterations": 1
            }
        },
        {
            "group": null,
            "name": "test_frequency_dependant_squeezing",
            "fullname": "tests/benchmarks/test_benchmarks.py::test_frequency_dependant_squeezing",
            "params": null,
            "param": null,
            "extra_info": {},
            "options": {
                "disable_gc": false,
                "timer": "perf_counter",
                "min_rounds": 5,
                "max_time": 1.0,
                "min_time": 5e-06,
                "warmup": false
            },
            "stats": {
                "min": 1.4656443039999942,
                "max": 1.5360045350000178,
                "mean": 1.4991775443999984,
                "stddev": 0.02715667099289772,
                "rounds": 5,
                "median": 1.4924300549999998,
                "iqr": 0.03926858424998869,
                "q1": 1.4812501232499997,
                "q3": 1.5205187074999884,
                "iqr_outliers": 0,
                "stddev_outliers": 2,
                "outliers": "2;0",
                "ld15iqr": 1.4656443039999942,
                "hd15iqr": 1.5360045350000178,
                "ops": 0.6670324030234994,
                "total": 7.495887721999992,
                "iterations": 1
            }
        },
        {
            "group": null,
            "name": "test_lock_actions",
            "fullname": "tests/benchmarks/test_benchmarks.py::test_lock_actions",
            "params": null,
            "param": null,
            "extra_info": {},
            "options": {
                "disable_gc": false,
                "timer": "perf_counter",
                "min_rounds": 5,
                "max_time": 1.0,
                "min_time": 5e-06,
                "warmup": false
            },
            "stats": {
                "min": 3.106909588999997,
                "max": 3.168005636999993,
                "mean": 3.1326056902000063,
                "stddev": 0.02422902617517283,
                "rounds": 5,
                "median": 3.1334105460000217,
                "iqr": 0.03591939625002283,
                "q1": 3.1119182097499944,
                "q3": 3.1478376060000173,
                "iqr_outliers": 0,
                "stddev_outliers": 2,
                "outliers": "2;0",
                "ld15iqr": 3.106909588999997,
                "hd15iqr": 3.168005636999993,
                "ops": 0.3192230682362559,
                "total": 15.66302845100003,
                "iterations": 1
            }
        }
    ],
    "datetime": "2024-07-29T15:41:35.168271",
    "version": "4.0.0"
}