{
    "machine_info": {
        "node": "runner-xs6vzpvo-project-39604133-concurrent-0",
        "processor": "",
        "machine": "x86_64",
        "python_compiler": "GCC 12.2.0",
        "python_implementation": "CPython",
        "python_implementation_version": "3.12.5",
        "python_version": "3.12.5",
        "python_build": [
            "main",
            "Sep  5 2024 00:16:34"
        ],
        "release": "5.15.154+",
        "system": "Linux",
        "cpu": {
            "python_version": "3.12.5.final.0 (64 bit)",
            "cpuinfo_version": [
                9,
                0,
                0
            ],
            "cpuinfo_version_string": "9.0.0",
            "arch": "X86_64",
            "bits": 64,
            "count": 2,
            "arch_string_raw": "x86_64",
            "vendor_id_raw": "AuthenticAMD",
            "brand_raw": "AMD EPYC 7B13",
            "hz_advertised_friendly": "2.4500 GHz",
            "hz_actual_friendly": "2.4500 GHz",
            "hz_advertised": [
                2449996000,
                0
            ],
            "hz_actual": [
                2449996000,
                0
            ],
            "model": 1,
            "family": 25,
            "flags": [
                "3dnowext",
                "3dnowprefetch",
                "abm",
                "adx",
                "aes",
                "apic",
                "arat",
                "avx",
                "avx2",
                "bmi1",
                "bmi2",
                "clflush",
                "clflushopt",
                "clwb",
                "clzero",
                "cmov",
                "cmp_legacy",
                "constant_tsc",
                "cpuid",
                "cr8_legacy",
                "cx16",
                "cx8",
                "de",
                "erms",
                "extd_apicid",
                "f16c",
                "fma",
                "fpu",
                "fsgsbase",
                "fsrm",
                "fxsr",
                "fxsr_opt",
                "ht",
                "hypervisor",
                "ibpb",
                "ibrs",
                "invpcid",
                "invpcid_single",
                "lahf_lm",
                "lm",
                "mca",
                "mce",
                "misalignsse",
                "mmx",
                "mmxext",
                "movbe",
                "msr",
                "mtrr",
                "nonstop_tsc",
                "nopl",
                "npt",
                "nrip_save",
                "nx",
                "osvw",
                "osxsave",
                "pae",
                "pat",
                "pcid",
                "pclmulqdq",
                "pdpe1gb",
                "pge",
                "pni",
                "popcnt",
                "pse",
                "pse36",
                "rdpid",
                "rdrand",
                "rdrnd",
                "rdseed",
                "rdtscp",
                "rep_good",
                "sep",
                "sha",
                "sha_ni",
                "smap",
                "smep",
                "ssbd",
                "sse",
                "sse2",
                "sse4_1",
                "sse4_2",
                "sse4a",
                "ssse3",
                "stibp",
                "syscall",
                "topoext",
                "tsc",
                "tsc_adjust",
                "tsc_known_freq",
                "umip",
                "vaes",
                "vme",
                "vmmcall",
                "vpclmulqdq",
                "x2apic",
                "xgetbv1",
                "xsave",
                "xsavec",
                "xsaveerptr",
                "xsaveopt"
            ],
            "l3_cache_size": 524288,
            "l2_cache_size": 524288,
            "l1_data_cache_size": 32768,
            "l1_instruction_cache_size": 32768,
            "l2_cache_line_size": 512,
            "l2_cache_associativity": 6
        }
    },
    "commit_info": {
        "id": "74e5f013959a2ced9acd86f1354054d6ada98555",
        "time": "2024-09-09T11:56:31+02:00",
        "author_time": "2024-09-09T11:56:31+02:00",
        "dirty": false,
        "project": "finesse3",
        "branch": "(detached head)"
    },
    "benchmarks": [
        {
            "group": null,
            "name": "test_01_simple_cav",
            "fullname": "tests/benchmarks/test_benchmarks.py::test_01_simple_cav",
            "params": null,
            "param": null,
            "extra_info": {},
            "options": {
                "disable_gc": false,
                "timer": "perf_counter",
                "min_rounds": 5,
                "max_time": 1.0,
                "min_time": 5e-06,
                "warmup": false
            },
            "stats": {
                "min": 0.26968142999999145,
                "max": 0.4823459840000055,
                "mean": 0.3166607476000024,
                "stddev": 0.0927088503682248,
                "rounds": 5,
                "median": 0.2762953510000159,
                "iqr": 0.05826238174999787,
                "q1": 0.2729901007500004,
                "q3": 0.3312524824999983,
                "iqr_outliers": 1,
                "stddev_outliers": 1,
                "outliers": "1;1",
                "ld15iqr": 0.26968142999999145,
                "hd15iqr": 0.4823459840000055,
                "ops": 3.1579537646490174,
                "total": 1.5833037380000121,
                "iterations": 1
            }
        },
        {
            "group": null,
            "name": "test_02_pdh_lock",
            "fullname": "tests/benchmarks/test_benchmarks.py::test_02_pdh_lock",
            "params": null,
            "param": null,
            "extra_info": {},
            "options": {
                "disable_gc": false,
                "timer": "perf_counter",
                "min_rounds": 5,
                "max_time": 1.0,
                "min_time": 5e-06,
                "warmup": false
            },
            "stats": {
                "min": 1.2096601100000157,
                "max": 1.5985025610000037,
                "mean": 1.345469202400011,
                "stddev": 0.1738929892806498,
                "rounds": 5,
                "median": 1.235708236000022,
                "iqr": 0.269579399499996,
                "q1": 1.2225337985000095,
                "q3": 1.4921131980000055,
                "iqr_outliers": 0,
                "stddev_outliers": 1,
                "outliers": "1;0",
                "ld15iqr": 1.2096601100000157,
                "hd15iqr": 1.5985025610000037,
                "ops": 0.7432351466805984,
                "total": 6.727346012000055,
                "iterations": 1
            }
        },
        {
            "group": null,
            "name": "test_03_near_unstable",
            "fullname": "tests/benchmarks/test_benchmarks.py::test_03_near_unstable",
            "params": null,
            "param": null,
            "extra_info": {},
            "options": {
                "disable_gc": false,
                "timer": "perf_counter",
                "min_rounds": 5,
                "max_time": 1.0,
                "min_time": 5e-06,
                "warmup": false
            },
            "stats": {
                "min": 1.900000000887303e-06,
                "max": 2.3259999977653933e-05,
                "mean": 2.0066731957800988e-06,
                "stddev": 4.822620676248916e-07,
                "rounds": 27671,
                "median": 1.9699999995737016e-06,
                "iqr": 3.999997488790541e-08,
                "q1": 1.950000012129749e-06,
                "q3": 1.9899999870176543e-06,
                "iqr_outliers": 914,
                "stddev_outliers": 237,
                "outliers": "237;914",
                "ld15iqr": 1.900000000887303e-06,
                "hd15iqr": 2.049999977771222e-06,
                "ops": 498337.2489864987,
                "total": 0.05552665400043111,
                "iterations": 1
            }
        },
        {
            "group": null,
            "name": "test_04_geometrical_params",
            "fullname": "tests/benchmarks/test_benchmarks.py::test_04_geometrical_params",
            "params": null,
            "param": null,
            "extra_info": {},
            "options": {
                "disable_gc": false,
                "timer": "perf_counter",
                "min_rounds": 5,
                "max_time": 1.0,
                "min_time": 5e-06,
                "warmup": false
            },
            "stats": {
                "min": 0.47427712000001065,
                "max": 0.8692034210000088,
                "mean": 0.5644236100000001,
                "stddev": 0.17114349753353195,
                "rounds": 5,
                "median": 0.4840331679999963,
                "iqr": 0.1261874289999909,
                "q1": 0.47781798100000117,
                "q3": 0.6040054099999921,
                "iqr_outliers": 1,
                "stddev_outliers": 1,
                "outliers": "1;1",
                "ld15iqr": 0.47427712000001065,
                "hd15iqr": 0.8692034210000088,
                "ops": 1.7717189399642583,
                "total": 2.8221180500000003,
                "iterations": 1
            }
        },
        {
            "group": null,
            "name": "test_05_modulation",
            "fullname": "tests/benchmarks/test_benchmarks.py::test_05_modulation",
            "params": null,
            "param": null,
            "extra_info": {},
            "options": {
                "disable_gc": false,
                "timer": "perf_counter",
                "min_rounds": 5,
                "max_time": 1.0,
                "min_time": 5e-06,
                "warmup": false
            },
            "stats": {
                "min": 0.12030103200001463,
                "max": 0.12487591100000373,
                "mean": 0.12219636800000444,
                "stddev": 0.0015347818673939046,
                "rounds": 8,
                "median": 0.12178381700000784,
                "iqr": 0.0022581294999781676,
                "q1": 0.12107752700001129,
                "q3": 0.12333565649998945,
                "iqr_outliers": 0,
                "stddev_outliers": 2,
                "outliers": "2;0",
                "ld15iqr": 0.12030103200001463,
                "hd15iqr": 0.12487591100000373,
                "ops": 8.183549285196133,
                "total": 0.9775709440000355,
                "iterations": 1
            }
        },
        {
            "group": null,
            "name": "test_06_radiation_pressure",
            "fullname": "tests/benchmarks/test_benchmarks.py::test_06_radiation_pressure",
            "params": null,
            "param": null,
            "extra_info": {},
            "options": {
                "disable_gc": false,
                "timer": "perf_counter",
                "min_rounds": 5,
                "max_time": 1.0,
                "min_time": 5e-06,
                "warmup": false
            },
            "stats": {
                "min": 0.24080688399999417,
                "max": 0.7495913570000141,
                "mean": 0.3487081896000063,
                "stddev": 0.22415116666367543,
                "rounds": 5,
                "median": 0.25244705200000794,
                "iqr": 0.1304216650000214,
                "q1": 0.24634981824999613,
                "q3": 0.3767714832500175,
                "iqr_outliers": 1,
                "stddev_outliers": 1,
                "outliers": "1;1",
                "ld15iqr": 0.24080688399999417,
                "hd15iqr": 0.7495913570000141,
                "ops": 2.8677273141966433,
                "total": 1.7435409480000317,
                "iterations": 1
            }
        },
        {
            "group": null,
            "name": "test_07_homodyne",
            "fullname": "tests/benchmarks/test_benchmarks.py::test_07_homodyne",
            "params": null,
            "param": null,
            "extra_info": {},
            "options": {
                "disable_gc": false,
                "timer": "perf_counter",
                "min_rounds": 5,
                "max_time": 1.0,
                "min_time": 5e-06,
                "warmup": false
            },
            "stats": {
                "min": 0.08303731800000946,
                "max": 0.10617913400000134,
                "mean": 0.08899240963636275,
                "stddev": 0.006466583593556443,
                "rounds": 11,
                "median": 0.08755923699999357,
                "iqr": 0.005371105749986782,
                "q1": 0.08459258300000982,
                "q3": 0.0899636887499966,
                "iqr_outliers": 1,
                "stddev_outliers": 1,
                "outliers": "1;1",
                "ld15iqr": 0.08303731800000946,
                "hd15iqr": 0.10617913400000134,
                "ops": 11.23691339616671,
                "total": 0.9789165059999902,
                "iterations": 1
            }
        },
        {
            "group": null,
            "name": "test_08_optical_spring",
            "fullname": "tests/benchmarks/test_benchmarks.py::test_08_optical_spring",
            "params": null,
            "param": null,
            "extra_info": {},
            "options": {
                "disable_gc": false,
                "timer": "perf_counter",
                "min_rounds": 5,
                "max_time": 1.0,
                "min_time": 5e-06,
                "warmup": false
            },
            "stats": {
                "min": 0.23858522500000845,
                "max": 0.8785945390000052,
                "mean": 0.36795546920000105,
                "stddev": 0.2854579872346131,
                "rounds": 5,
                "median": 0.24102945399999953,
                "iqr": 0.16094164350000995,
                "q1": 0.2397646967499938,
                "q3": 0.40070634025000373,
                "iqr_outliers": 1,
                "stddev_outliers": 1,
                "outliers": "1;1",
                "ld15iqr": 0.23858522500000845,
                "hd15iqr": 0.8785945390000052,
                "ops": 2.717720169166593,
                "total": 1.8397773460000053,
                "iterations": 1
            }
        },
        {
            "group": null,
            "name": "test_09_aligo_sensitivity",
            "fullname": "tests/benchmarks/test_benchmarks.py::test_09_aligo_sensitivity",
            "params": null,
            "param": null,
            "extra_info": {},
            "options": {
                "disable_gc": false,
                "timer": "perf_counter",
                "min_rounds": 5,
                "max_time": 1.0,
                "min_time": 5e-06,
                "warmup": false
            },
            "stats": {
                "min": 0.2550824620000185,
                "max": 0.262810251000019,
                "mean": 0.2586672774000135,
                "stddev": 0.0031669445579965757,
                "rounds": 5,
                "median": 0.2584236510000153,
                "iqr": 0.005285076499994545,
                "q1": 0.25597655950001297,
                "q3": 0.2612616360000075,
                "iqr_outliers": 0,
                "stddev_outliers": 2,
                "outliers": "2;0",
                "ld15iqr": 0.2550824620000185,
                "hd15iqr": 0.262810251000019,
                "ops": 3.8659702535684852,
                "total": 1.2933363870000676,
                "iterations": 1
            }
        },
        {
            "group": null,
            "name": "test_10_shifted_beam",
            "fullname": "tests/benchmarks/test_benchmarks.py::test_10_shifted_beam",
            "params": null,
            "param": null,
            "extra_info": {},
            "options": {
                "disable_gc": false,
                "timer": "perf_counter",
                "min_rounds": 5,
                "max_time": 1.0,
                "min_time": 5e-06,
                "warmup": false
            },
            "stats": {
                "min": 0.7265670019999959,
                "max": 1.4481396340000003,
                "mean": 0.8760465893999936,
                "stddev": 0.31983498295415164,
                "rounds": 5,
                "median": 0.7357649609999726,
                "iqr": 0.18348558050000463,
                "q1": 0.7312560454999968,
                "q3": 0.9147416260000014,
                "iqr_outliers": 1,
                "stddev_outliers": 1,
                "outliers": "1;1",
                "ld15iqr": 0.7265670019999959,
                "hd15iqr": 1.4481396340000003,
                "ops": 1.1414918020340705,
                "total": 4.380232946999968,
                "iterations": 1
            }
        },
        {
            "group": null,
            "name": "test_angular_radiation_pressure",
            "fullname": "tests/benchmarks/test_benchmarks.py::test_angular_radiation_pressure",
            "params": null,
            "param": null,
            "extra_info": {},
            "options": {
                "disable_gc": false,
                "timer": "perf_counter",
                "min_rounds": 5,
                "max_time": 1.0,
                "min_time": 5e-06,
                "warmup": false
            },
            "stats": {
                "min": 0.3022182050000026,
                "max": 0.3056717649999996,
                "mean": 0.3034762087999979,
                "stddev": 0.0014466072761762936,
                "rounds": 5,
                "median": 0.30316855499998496,
                "iqr": 0.002235956750006096,
                "q1": 0.3022392124999982,
                "q3": 0.3044751692500043,
                "iqr_outliers": 0,
                "stddev_outliers": 1,
                "outliers": "1;0",
                "ld15iqr": 0.3022182050000026,
                "hd15iqr": 0.3056717649999996,
                "ops": 3.2951512210930414,
                "total": 1.5173810439999897,
                "iterations": 1
            }
        },
        {
            "group": null,
            "name": "test_cavity_eigenmodes",
            "fullname": "tests/benchmarks/test_benchmarks.py::test_cavity_eigenmodes",
            "params": null,
            "param": null,
            "extra_info": {},
            "options": {
                "disable_gc": false,
                "timer": "perf_counter",
                "min_rounds": 5,
                "max_time": 1.0,
                "min_time": 5e-06,
                "warmup": false
            },
            "stats": {
                "min": 0.2707084299999849,
                "max": 1.1797238750000076,
                "mean": 0.45380720859999996,
                "stddev": 0.4058020556997214,
                "rounds": 5,
                "median": 0.2734803099999965,
                "iqr": 0.22921403875000124,
                "q1": 0.2711183042500025,
                "q3": 0.5003323430000037,
                "iqr_outliers": 1,
                "stddev_outliers": 1,
                "outliers": "1;1",
                "ld15iqr": 0.2707084299999849,
                "hd15iqr": 1.1797238750000076,
                "ops": 2.203578923051951,
                "total": 2.269036043,
                "iterations": 1
            }
        },
        {
            "group": null,
            "name": "test_coupled_cavity_commands",
            "fullname": "tests/benchmarks/test_benchmarks.py::test_coupled_cavity_commands",
            "params": null,
            "param": null,
            "extra_info": {},
            "options": {
                "disable_gc": false,
                "timer": "perf_counter",
                "min_rounds": 5,
                "max_time": 1.0,
                "min_time": 5e-06,
                "warmup": false
            },
            "stats": {
                "min": 5.86503629500001,
                "max": 7.05326701300001,
                "mean": 6.3266337436000075,
                "stddev": 0.5668946842793038,
                "rounds": 5,
                "median": 6.0092320310000105,
                "iqr": 1.0024527382499997,
                "q1": 5.878174061500005,
                "q3": 6.880626799750004,
                "iqr_outliers": 0,
                "stddev_outliers": 1,
                "outliers": "1;0",
                "ld15iqr": 5.86503629500001,
                "hd15iqr": 7.05326701300001,
                "ops": 0.15806193949690786,
                "total": 31.633168718000036,
                "iterations": 1
            }
        },
        {
            "group": null,
            "name": "test_frequency_dependant_squeezing",
            "fullname": "tests/benchmarks/test_benchmarks.py::test_frequency_dependant_squeezing",
            "params": null,
            "param": null,
            "extra_info": {},
            "options": {
                "disable_gc": false,
                "timer": "perf_counter",
                "min_rounds": 5,
                "max_time": 1.0,
                "min_time": 5e-06,
                "warmup": false
            },
            "stats": {
                "min": 1.5192722820000029,
                "max": 2.9025097319999986,
                "mean": 1.8108092205999924,
                "stddev": 0.6104951603668076,
                "rounds": 5,
                "median": 1.5412146009999788,
                "iqr": 0.37136674350001897,
                "q1": 1.5261829379999838,
                "q3": 1.8975496815000028,
                "iqr_outliers": 1,
                "stddev_outliers": 1,
                "outliers": "1;1",
                "ld15iqr": 1.5192722820000029,
                "hd15iqr": 2.9025097319999986,
                "ops": 0.5522392909335091,
                "total": 9.054046102999962,
                "iterations": 1
            }
        },
        {
            "group": null,
            "name": "test_lock_actions",
            "fullname": "tests/benchmarks/test_benchmarks.py::test_lock_actions",
            "params": null,
            "param": null,
            "extra_info": {},
            "options": {
                "disable_gc": false,
                "timer": "perf_counter",
                "min_rounds": 5,
                "max_time": 1.0,
                "min_time": 5e-06,
                "warmup": false
            },
            "stats": {
                "min": 3.0822029800000337,
                "max": 4.574618853000004,
                "mean": 3.393832892000006,
                "stddev": 0.6601944545640179,
                "rounds": 5,
                "median": 3.103394028999986,
                "iqr": 0.38976206674999503,
                "q1": 3.0905774200000096,
                "q3": 3.4803394867500046,
                "iqr_outliers": 1,
                "stddev_outliers": 1,
                "outliers": "1;1",
                "ld15iqr": 3.0822029800000337,
                "hd15iqr": 4.574618853000004,
                "ops": 0.2946521033363826,
                "total": 16.96916446000003,
                "iterations": 1
            }
        }
    ],
    "datetime": "2024-09-09T10:03:13.808724",
    "version": "4.0.0"
}