{
    "machine_info": {
        "node": "runner-jhcjxvh-project-39604133-concurrent-0",
        "processor": "",
        "machine": "x86_64",
        "python_compiler": "GCC 12.2.0",
        "python_implementation": "CPython",
        "python_implementation_version": "3.12.3",
        "python_version": "3.12.3",
        "python_build": [
            "main",
            "May 14 2024 07:23:41"
        ],
        "release": "5.15.154+",
        "system": "Linux",
        "cpu": {
            "python_version": "3.12.3.final.0 (64 bit)",
            "cpuinfo_version": [
                9,
                0,
                0
            ],
            "cpuinfo_version_string": "9.0.0",
            "arch": "X86_64",
            "bits": 64,
            "count": 2,
            "arch_string_raw": "x86_64",
            "vendor_id_raw": "AuthenticAMD",
            "brand_raw": "AMD EPYC 7B13",
            "hz_advertised_friendly": "2.4500 GHz",
            "hz_actual_friendly": "2.4500 GHz",
            "hz_advertised": [
                2449998000,
                0
            ],
            "hz_actual": [
                2449998000,
                0
            ],
            "model": 1,
            "family": 25,
            "flags": [
                "3dnowext",
                "3dnowprefetch",
                "abm",
                "adx",
                "aes",
                "apic",
                "arat",
                "avx",
                "avx2",
                "bmi1",
                "bmi2",
                "clflush",
                "clflushopt",
                "clwb",
                "clzero",
                "cmov",
                "cmp_legacy",
                "constant_tsc",
                "cpuid",
                "cr8_legacy",
                "cx16",
                "cx8",
                "de",
                "erms",
                "extd_apicid",
                "f16c",
                "fma",
                "fpu",
                "fsgsbase",
                "fsrm",
                "fxsr",
                "fxsr_opt",
                "ht",
                "hypervisor",
                "ibpb",
                "ibrs",
                "invpcid",
                "invpcid_single",
                "lahf_lm",
                "lm",
                "mca",
                "mce",
                "misalignsse",
                "mmx",
                "mmxext",
                "movbe",
                "msr",
                "mtrr",
                "nonstop_tsc",
                "nopl",
                "npt",
                "nrip_save",
                "nx",
                "osvw",
                "osxsave",
                "pae",
                "pat",
                "pcid",
                "pclmulqdq",
                "pdpe1gb",
                "pge",
                "pni",
                "popcnt",
                "pse",
                "pse36",
                "rdpid",
                "rdrand",
                "rdrnd",
                "rdseed",
                "rdtscp",
                "rep_good",
                "sep",
                "sha",
                "sha_ni",
                "smap",
                "smep",
                "ssbd",
                "sse",
                "sse2",
                "sse4_1",
                "sse4_2",
                "sse4a",
                "ssse3",
                "stibp",
                "syscall",
                "topoext",
                "tsc",
                "tsc_adjust",
                "tsc_known_freq",
                "umip",
                "vaes",
                "vme",
                "vmmcall",
                "vpclmulqdq",
                "x2apic",
                "xgetbv1",
                "xsave",
                "xsavec",
                "xsaveerptr",
                "xsaveopt"
            ],
            "l3_cache_size": 524288,
            "l2_cache_size": 524288,
            "l1_data_cache_size": 32768,
            "l1_instruction_cache_size": 32768,
            "l2_cache_line_size": 512,
            "l2_cache_associativity": 6
        }
    },
    "commit_info": {
        "id": "4e2d6c08e6723b39065af9b60193287eda8f82b1",
        "time": "2024-05-30T15:34:48+02:00",
        "author_time": "2024-05-30T15:34:48+02:00",
        "dirty": false,
        "project": "finesse3",
        "branch": "(detached head)"
    },
    "benchmarks": [
        {
            "group": null,
            "name": "test_01_simple_cav",
            "fullname": "tests/benchmarks/test_benchmarks.py::test_01_simple_cav",
            "params": null,
            "param": null,
            "extra_info": {},
            "options": {
                "disable_gc": false,
                "timer": "perf_counter",
                "min_rounds": 5,
                "max_time": 1.0,
                "min_time": 5e-06,
                "warmup": false
            },
            "stats": {
                "min": 0.36697208299995054,
                "max": 0.5714103859999682,
                "mean": 0.4408072167999876,
                "stddev": 0.09873341997276279,
                "rounds": 5,
                "median": 0.3718748210000058,
                "iqr": 0.1656347332500303,
                "q1": 0.36964748974997974,
                "q3": 0.53528222300001,
                "iqr_outliers": 0,
                "stddev_outliers": 1,
                "outliers": "1;0",
                "ld15iqr": 0.36697208299995054,
                "hd15iqr": 0.5714103859999682,
                "ops": 2.2685653997669037,
                "total": 2.204036083999938,
                "iterations": 1
            }
        },
        {
            "group": null,
            "name": "test_02_pdh_lock",
            "fullname": "tests/benchmarks/test_benchmarks.py::test_02_pdh_lock",
            "params": null,
            "param": null,
            "extra_info": {},
            "options": {
                "disable_gc": false,
                "timer": "perf_counter",
                "min_rounds": 5,
                "max_time": 1.0,
                "min_time": 5e-06,
                "warmup": false
            },
            "stats": {
                "min": 1.30825152999995,
                "max": 1.6669024939999986,
                "mean": 1.4549257009999905,
                "stddev": 0.1601769883674001,
                "rounds": 5,
                "median": 1.3649416920000021,
                "iqr": 0.2664385202500483,
                "q1": 1.3391247887499702,
                "q3": 1.6055633090000185,
                "iqr_outliers": 0,
                "stddev_outliers": 1,
                "outliers": "1;0",
                "ld15iqr": 1.30825152999995,
                "hd15iqr": 1.6669024939999986,
                "ops": 0.687320321108278,
                "total": 7.274628504999953,
                "iterations": 1
            }
        },
        {
            "group": null,
            "name": "test_03_near_unstable",
            "fullname": "tests/benchmarks/test_benchmarks.py::test_03_near_unstable",
            "params": null,
            "param": null,
            "extra_info": {},
            "options": {
                "disable_gc": false,
                "timer": "perf_counter",
                "min_rounds": 5,
                "max_time": 1.0,
                "min_time": 5e-06,
                "warmup": false
            },
            "stats": {
                "min": 1.730000008137722e-06,
                "max": 3.36500000344131e-05,
                "mean": 2.662008752880408e-06,
                "stddev": 9.061983693293866e-07,
                "rounds": 41929,
                "median": 3.1399999897985253e-06,
                "iqr": 1.3990000411467918e-06,
                "q1": 1.790999988315889e-06,
                "q3": 3.1900000294626807e-06,
                "iqr_outliers": 224,
                "stddev_outliers": 864,
                "outliers": "864;224",
                "ld15iqr": 1.730000008137722e-06,
                "hd15iqr": 5.320000013853132e-06,
                "ops": 375656.16526164947,
                "total": 0.11161536499952263,
                "iterations": 1
            }
        },
        {
            "group": null,
            "name": "test_04_geometrical_params",
            "fullname": "tests/benchmarks/test_benchmarks.py::test_04_geometrical_params",
            "params": null,
            "param": null,
            "extra_info": {},
            "options": {
                "disable_gc": false,
                "timer": "perf_counter",
                "min_rounds": 5,
                "max_time": 1.0,
                "min_time": 5e-06,
                "warmup": false
            },
            "stats": {
                "min": 0.5336543110000207,
                "max": 0.9121804410000323,
                "mean": 0.6167060920000267,
                "stddev": 0.16535923646981426,
                "rounds": 5,
                "median": 0.5416232990000367,
                "iqr": 0.1054214442499557,
                "q1": 0.5390457752500453,
                "q3": 0.644467219500001,
                "iqr_outliers": 1,
                "stddev_outliers": 1,
                "outliers": "1;1",
                "ld15iqr": 0.5336543110000207,
                "hd15iqr": 0.9121804410000323,
                "ops": 1.6215179531580768,
                "total": 3.0835304600001336,
                "iterations": 1
            }
        },
        {
            "group": null,
            "name": "test_05_modulation",
            "fullname": "tests/benchmarks/test_benchmarks.py::test_05_modulation",
            "params": null,
            "param": null,
            "extra_info": {},
            "options": {
                "disable_gc": false,
                "timer": "perf_counter",
                "min_rounds": 5,
                "max_time": 1.0,
                "min_time": 5e-06,
                "warmup": false
            },
            "stats": {
                "min": 0.1700709579999966,
                "max": 0.613172459999987,
                "mean": 0.23942658742857606,
                "stddev": 0.1648730691639466,
                "rounds": 7,
                "median": 0.17888535700001285,
                "iqr": 0.009399996749976935,
                "q1": 0.1736337720000165,
                "q3": 0.18303376874999344,
                "iqr_outliers": 1,
                "stddev_outliers": 1,
                "outliers": "1;1",
                "ld15iqr": 0.1700709579999966,
                "hd15iqr": 0.613172459999987,
                "ops": 4.176645587860256,
                "total": 1.6759861120000323,
                "iterations": 1
            }
        },
        {
            "group": null,
            "name": "test_06_radiation_pressure",
            "fullname": "tests/benchmarks/test_benchmarks.py::test_06_radiation_pressure",
            "params": null,
            "param": null,
            "extra_info": {},
            "options": {
                "disable_gc": false,
                "timer": "perf_counter",
                "min_rounds": 5,
                "max_time": 1.0,
                "min_time": 5e-06,
                "warmup": false
            },
            "stats": {
                "min": 0.30716816000000335,
                "max": 0.32425508800002945,
                "mean": 0.31548101900000347,
                "stddev": 0.006519881421929726,
                "rounds": 5,
                "median": 0.31364607000000433,
                "iqr": 0.008971891250013186,
                "q1": 0.3115678767499901,
                "q3": 0.3205397680000033,
                "iqr_outliers": 0,
                "stddev_outliers": 2,
                "outliers": "2;0",
                "ld15iqr": 0.30716816000000335,
                "hd15iqr": 0.32425508800002945,
                "ops": 3.169762805920153,
                "total": 1.5774050950000174,
                "iterations": 1
            }
        },
        {
            "group": null,
            "name": "test_07_homodyne",
            "fullname": "tests/benchmarks/test_benchmarks.py::test_07_homodyne",
            "params": null,
            "param": null,
            "extra_info": {},
            "options": {
                "disable_gc": false,
                "timer": "perf_counter",
                "min_rounds": 5,
                "max_time": 1.0,
                "min_time": 5e-06,
                "warmup": false
            },
            "stats": {
                "min": 0.11440329499998825,
                "max": 0.1226726840000083,
                "mean": 0.1164558520909147,
                "stddev": 0.002467921741542977,
                "rounds": 11,
                "median": 0.11561722499999405,
                "iqr": 0.00226114000000166,
                "q1": 0.11478472500000692,
                "q3": 0.11704586500000858,
                "iqr_outliers": 1,
                "stddev_outliers": 2,
                "outliers": "2;1",
                "ld15iqr": 0.11440329499998825,
                "hd15iqr": 0.1226726840000083,
                "ops": 8.586945027196403,
                "total": 1.2810143730000618,
                "iterations": 1
            }
        },
        {
            "group": null,
            "name": "test_08_optical_spring",
            "fullname": "tests/benchmarks/test_benchmarks.py::test_08_optical_spring",
            "params": null,
            "param": null,
            "extra_info": {},
            "options": {
                "disable_gc": false,
                "timer": "perf_counter",
                "min_rounds": 5,
                "max_time": 1.0,
                "min_time": 5e-06,
                "warmup": false
            },
            "stats": {
                "min": 0.2932773719999773,
                "max": 0.30857663000000457,
                "mean": 0.3017484407999973,
                "stddev": 0.005869883331331697,
                "rounds": 5,
                "median": 0.3023618110000257,
                "iqr": 0.008390926250044117,
                "q1": 0.2977336837499678,
                "q3": 0.3061246100000119,
                "iqr_outliers": 0,
                "stddev_outliers": 2,
                "outliers": "2;0",
                "ld15iqr": 0.2932773719999773,
                "hd15iqr": 0.30857663000000457,
                "ops": 3.3140187811701494,
                "total": 1.5087422039999865,
                "iterations": 1
            }
        },
        {
            "group": null,
            "name": "test_09_aligo_sensitivity",
            "fullname": "tests/benchmarks/test_benchmarks.py::test_09_aligo_sensitivity",
            "params": null,
            "param": null,
            "extra_info": {},
            "options": {
                "disable_gc": false,
                "timer": "perf_counter",
                "min_rounds": 5,
                "max_time": 1.0,
                "min_time": 5e-06,
                "warmup": false
            },
            "stats": {
                "min": 0.3208580980000306,
                "max": 0.329866667000033,
                "mean": 0.32522247360000167,
                "stddev": 0.004229056767182065,
                "rounds": 5,
                "median": 0.32416103799999973,
                "iqr": 0.008012149000009572,
                "q1": 0.3215444829999825,
                "q3": 0.3295566319999921,
                "iqr_outliers": 0,
                "stddev_outliers": 3,
                "outliers": "3;0",
                "ld15iqr": 0.3208580980000306,
                "hd15iqr": 0.329866667000033,
                "ops": 3.0748182588080373,
                "total": 1.6261123680000082,
                "iterations": 1
            }
        },
        {
            "group": null,
            "name": "test_10_shifted_beam",
            "fullname": "tests/benchmarks/test_benchmarks.py::test_10_shifted_beam",
            "params": null,
            "param": null,
            "extra_info": {},
            "options": {
                "disable_gc": false,
                "timer": "perf_counter",
                "min_rounds": 5,
                "max_time": 1.0,
                "min_time": 5e-06,
                "warmup": false
            },
            "stats": {
                "min": 0.7267434860000321,
                "max": 1.4722199380000234,
                "mean": 0.8821669792000193,
                "stddev": 0.329885515411166,
                "rounds": 5,
                "median": 0.7385659139999916,
                "iqr": 0.18952015549999146,
                "q1": 0.7325999345000298,
                "q3": 0.9221200900000213,
                "iqr_outliers": 1,
                "stddev_outliers": 1,
                "outliers": "1;1",
                "ld15iqr": 0.7267434860000321,
                "hd15iqr": 1.4722199380000234,
                "ops": 1.1335722415124128,
                "total": 4.410834896000097,
                "iterations": 1
            }
        },
        {
            "group": null,
            "name": "test_angular_radiation_pressure",
            "fullname": "tests/benchmarks/test_benchmarks.py::test_angular_radiation_pressure",
            "params": null,
            "param": null,
            "extra_info": {},
            "options": {
                "disable_gc": false,
                "timer": "perf_counter",
                "min_rounds": 5,
                "max_time": 1.0,
                "min_time": 5e-06,
                "warmup": false
            },
            "stats": {
                "min": 0.33933447599997635,
                "max": 0.3556651439999996,
                "mean": 0.3486069050000083,
                "stddev": 0.007173144820760656,
                "rounds": 5,
                "median": 0.3518258850000393,
                "iqr": 0.012240289499985124,
                "q1": 0.34183319025001424,
                "q3": 0.35407347974999936,
                "iqr_outliers": 0,
                "stddev_outliers": 1,
                "outliers": "1;0",
                "ld15iqr": 0.33933447599997635,
                "hd15iqr": 0.3556651439999996,
                "ops": 2.868560506568211,
                "total": 1.7430345250000414,
                "iterations": 1
            }
        },
        {
            "group": null,
            "name": "test_cavity_eigenmodes",
            "fullname": "tests/benchmarks/test_benchmarks.py::test_cavity_eigenmodes",
            "params": null,
            "param": null,
            "extra_info": {},
            "options": {
                "disable_gc": false,
                "timer": "perf_counter",
                "min_rounds": 5,
                "max_time": 1.0,
                "min_time": 5e-06,
                "warmup": false
            },
            "stats": {
                "min": 0.2695605649999493,
                "max": 1.0596411619999913,
                "mean": 0.43207097779996956,
                "stddev": 0.350867974553217,
                "rounds": 5,
                "median": 0.2786808939999901,
                "iqr": 0.2071164577500184,
                "q1": 0.2697690874999523,
                "q3": 0.47688554524997073,
                "iqr_outliers": 1,
                "stddev_outliers": 1,
                "outliers": "1;1",
                "ld15iqr": 0.2695605649999493,
                "hd15iqr": 1.0596411619999913,
                "ops": 2.3144345521465626,
                "total": 2.160354888999848,
                "iterations": 1
            }
        },
        {
            "group": null,
            "name": "test_coupled_cavity_commands",
            "fullname": "tests/benchmarks/test_benchmarks.py::test_coupled_cavity_commands",
            "params": null,
            "param": null,
            "extra_info": {},
            "options": {
                "disable_gc": false,
                "timer": "perf_counter",
                "min_rounds": 5,
                "max_time": 1.0,
                "min_time": 5e-06,
                "warmup": false
            },
            "stats": {
                "min": 4.348811366000007,
                "max": 5.474510588999976,
                "mean": 4.8119678269999895,
                "stddev": 0.5896289829236231,
                "rounds": 5,
                "median": 4.441826057999947,
                "iqr": 1.0930820597499746,
                "q1": 4.354383385250017,
                "q3": 5.447465444999992,
                "iqr_outliers": 0,
                "stddev_outliers": 2,
                "outliers": "2;0",
                "ld15iqr": 4.348811366000007,
                "hd15iqr": 5.474510588999976,
                "ops": 0.2078151882872101,
                "total": 24.059839134999947,
                "iterations": 1
            }
        },
        {
            "group": null,
            "name": "test_frequency_dependant_squeezing",
            "fullname": "tests/benchmarks/test_benchmarks.py::test_frequency_dependant_squeezing",
            "params": null,
            "param": null,
            "extra_info": {},
            "options": {
                "disable_gc": false,
                "timer": "perf_counter",
                "min_rounds": 5,
                "max_time": 1.0,
                "min_time": 5e-06,
                "warmup": false
            },
            "stats": {
                "min": 1.5345637899999929,
                "max": 2.7940625279999836,
                "mean": 1.7909310134000065,
                "stddev": 0.560795736552392,
                "rounds": 5,
                "median": 1.5438284589999967,
                "iqr": 0.32435236549999047,
                "q1": 1.5347272157500242,
                "q3": 1.8590795812500147,
                "iqr_outliers": 1,
                "stddev_outliers": 1,
                "outliers": "1;1",
                "ld15iqr": 1.5345637899999929,
                "hd15iqr": 2.7940625279999836,
                "ops": 0.5583687995337925,
                "total": 8.954655067000033,
                "iterations": 1
            }
        },
        {
            "group": null,
            "name": "test_lock_actions",
            "fullname": "tests/benchmarks/test_benchmarks.py::test_lock_actions",
            "params": null,
            "param": null,
            "extra_info": {},
            "options": {
                "disable_gc": false,
                "timer": "perf_counter",
                "min_rounds": 5,
                "max_time": 1.0,
                "min_time": 5e-06,
                "warmup": false
            },
            "stats": {
                "min": 4.745414732000029,
                "max": 5.16949351400001,
                "mean": 4.896227935399997,
                "stddev": 0.16639621980170927,
                "rounds": 5,
                "median": 4.823776051999971,
                "iqr": 0.19369472175000624,
                "q1": 4.795936936999993,
                "q3": 4.98963165875,
                "iqr_outliers": 0,
                "stddev_outliers": 1,
                "outliers": "1;0",
                "ld15iqr": 4.745414732000029,
                "hd15iqr": 5.16949351400001,
                "ops": 0.20423885758462038,
                "total": 24.481139676999987,
                "iterations": 1
            }
        }
    ],
    "datetime": "2024-05-30T13:41:36.859946",
    "version": "4.0.0"
}