{
    "machine_info": {
        "node": "runner-ykxhnyexq-project-39604133-concurrent-0",
        "processor": "",
        "machine": "x86_64",
        "python_compiler": "GCC 12.2.0",
        "python_implementation": "CPython",
        "python_implementation_version": "3.12.3",
        "python_version": "3.12.3",
        "python_build": [
            "main",
            "May 14 2024 07:23:41"
        ],
        "release": "5.15.154+",
        "system": "Linux",
        "cpu": {
            "python_version": "3.12.3.final.0 (64 bit)",
            "cpuinfo_version": [
                9,
                0,
                0
            ],
            "cpuinfo_version_string": "9.0.0",
            "arch": "X86_64",
            "bits": 64,
            "count": 2,
            "arch_string_raw": "x86_64",
            "vendor_id_raw": "AuthenticAMD",
            "brand_raw": "AMD EPYC 7B13",
            "hz_advertised_friendly": "2.4500 GHz",
            "hz_actual_friendly": "2.4500 GHz",
            "hz_advertised": [
                2449998000,
                0
            ],
            "hz_actual": [
                2449998000,
                0
            ],
            "model": 1,
            "family": 25,
            "flags": [
                "3dnowext",
                "3dnowprefetch",
                "abm",
                "adx",
                "aes",
                "apic",
                "arat",
                "avx",
                "avx2",
                "bmi1",
                "bmi2",
                "clflush",
                "clflushopt",
                "clwb",
                "clzero",
                "cmov",
                "cmp_legacy",
                "constant_tsc",
                "cpuid",
                "cr8_legacy",
                "cx16",
                "cx8",
                "de",
                "erms",
                "extd_apicid",
                "f16c",
                "fma",
                "fpu",
                "fsgsbase",
                "fsrm",
                "fxsr",
                "fxsr_opt",
                "ht",
                "hypervisor",
                "ibpb",
                "ibrs",
                "invpcid",
                "invpcid_single",
                "lahf_lm",
                "lm",
                "mca",
                "mce",
                "misalignsse",
                "mmx",
                "mmxext",
                "movbe",
                "msr",
                "mtrr",
                "nonstop_tsc",
                "nopl",
                "npt",
                "nrip_save",
                "nx",
                "osvw",
                "osxsave",
                "pae",
                "pat",
                "pcid",
                "pclmulqdq",
                "pdpe1gb",
                "pge",
                "pni",
                "popcnt",
                "pse",
                "pse36",
                "rdpid",
                "rdrand",
                "rdrnd",
                "rdseed",
                "rdtscp",
                "rep_good",
                "sep",
                "sha",
                "sha_ni",
                "smap",
                "smep",
                "ssbd",
                "sse",
                "sse2",
                "sse4_1",
                "sse4_2",
                "sse4a",
                "ssse3",
                "stibp",
                "syscall",
                "topoext",
                "tsc",
                "tsc_adjust",
                "tsc_known_freq",
                "umip",
                "vaes",
                "vme",
                "vmmcall",
                "vpclmulqdq",
                "x2apic",
                "xgetbv1",
                "xsave",
                "xsavec",
                "xsaveerptr",
                "xsaveopt"
            ],
            "l3_cache_size": 524288,
            "l2_cache_size": 524288,
            "l1_data_cache_size": 32768,
            "l1_instruction_cache_size": 32768,
            "l2_cache_line_size": 512,
            "l2_cache_associativity": 6
        }
    },
    "commit_info": {
        "id": "96f99f394202456561e349d7a771f539e4a81e3c",
        "time": "2024-05-22T13:03:59+02:00",
        "author_time": "2024-05-22T13:03:59+02:00",
        "dirty": false,
        "project": "finesse3",
        "branch": "(detached head)"
    },
    "benchmarks": [
        {
            "group": null,
            "name": "test_01_simple_cav",
            "fullname": "tests/benchmarks/test_benchmarks.py::test_01_simple_cav",
            "params": null,
            "param": null,
            "extra_info": {},
            "options": {
                "disable_gc": false,
                "timer": "perf_counter",
                "min_rounds": 5,
                "max_time": 1.0,
                "min_time": 5e-06,
                "warmup": false
            },
            "stats": {
                "min": 0.37215867300000127,
                "max": 0.6025699639999971,
                "mean": 0.45230354720000604,
                "stddev": 0.11092869928256123,
                "rounds": 5,
                "median": 0.3743767240000011,
                "iqr": 0.18361379299999214,
                "q1": 0.3721888237500153,
                "q3": 0.5558026167500074,
                "iqr_outliers": 0,
                "stddev_outliers": 1,
                "outliers": "1;0",
                "ld15iqr": 0.37215867300000127,
                "hd15iqr": 0.6025699639999971,
                "ops": 2.2109046152534497,
                "total": 2.2615177360000303,
                "iterations": 1
            }
        },
        {
            "group": null,
            "name": "test_02_pdh_lock",
            "fullname": "tests/benchmarks/test_benchmarks.py::test_02_pdh_lock",
            "params": null,
            "param": null,
            "extra_info": {},
            "options": {
                "disable_gc": false,
                "timer": "perf_counter",
                "min_rounds": 5,
                "max_time": 1.0,
                "min_time": 5e-06,
                "warmup": false
            },
            "stats": {
                "min": 1.3096480119999967,
                "max": 1.7287678389999996,
                "mean": 1.4892582128000016,
                "stddev": 0.18271398968658398,
                "rounds": 5,
                "median": 1.4657764419999921,
                "iqr": 0.323950454999995,
                "q1": 1.3211137930000092,
                "q3": 1.6450642480000042,
                "iqr_outliers": 0,
                "stddev_outliers": 1,
                "outliers": "1;0",
                "ld15iqr": 1.3096480119999967,
                "hd15iqr": 1.7287678389999996,
                "ops": 0.6714752293491593,
                "total": 7.4462910640000075,
                "iterations": 1
            }
        },
        {
            "group": null,
            "name": "test_03_near_unstable",
            "fullname": "tests/benchmarks/test_benchmarks.py::test_03_near_unstable",
            "params": null,
            "param": null,
            "extra_info": {},
            "options": {
                "disable_gc": false,
                "timer": "perf_counter",
                "min_rounds": 5,
                "max_time": 1.0,
                "min_time": 5e-06,
                "warmup": false
            },
            "stats": {
                "min": 1.6199999777199992e-06,
                "max": 0.00020274999999969623,
                "mean": 2.5395622593997354e-06,
                "stddev": 1.5032929225429852e-06,
                "rounds": 47037,
                "median": 3.0699999911121267e-06,
                "iqr": 1.5099999757239857e-06,
                "q1": 1.6900000048281072e-06,
                "q3": 3.199999980552093e-06,
                "iqr_outliers": 257,
                "stddev_outliers": 430,
                "outliers": "430;257",
                "ld15iqr": 1.6199999777199992e-06,
                "hd15iqr": 5.509999994046666e-06,
                "ops": 393768.6490255078,
                "total": 0.11945338999538535,
                "iterations": 1
            }
        },
        {
            "group": null,
            "name": "test_04_geometrical_params",
            "fullname": "tests/benchmarks/test_benchmarks.py::test_04_geometrical_params",
            "params": null,
            "param": null,
            "extra_info": {},
            "options": {
                "disable_gc": false,
                "timer": "perf_counter",
                "min_rounds": 5,
                "max_time": 1.0,
                "min_time": 5e-06,
                "warmup": false
            },
            "stats": {
                "min": 0.5264417440000102,
                "max": 0.8910016239999834,
                "mean": 0.6148775319999971,
                "stddev": 0.15583561085614386,
                "rounds": 5,
                "median": 0.5425078720000158,
                "iqr": 0.1276825244999884,
                "q1": 0.5312528162499959,
                "q3": 0.6589353407499843,
                "iqr_outliers": 1,
                "stddev_outliers": 1,
                "outliers": "1;1",
                "ld15iqr": 0.5264417440000102,
                "hd15iqr": 0.8910016239999834,
                "ops": 1.6263401213365605,
                "total": 3.074387659999985,
                "iterations": 1
            }
        },
        {
            "group": null,
            "name": "test_05_modulation",
            "fullname": "tests/benchmarks/test_benchmarks.py::test_05_modulation",
            "params": null,
            "param": null,
            "extra_info": {},
            "options": {
                "disable_gc": false,
                "timer": "perf_counter",
                "min_rounds": 5,
                "max_time": 1.0,
                "min_time": 5e-06,
                "warmup": false
            },
            "stats": {
                "min": 0.17406221100000607,
                "max": 0.18411340599999448,
                "mean": 0.17866568500000427,
                "stddev": 0.003653429577931961,
                "rounds": 5,
                "median": 0.1782019430000048,
                "iqr": 0.004097804500005964,
                "q1": 0.17657962425000306,
                "q3": 0.18067742875000903,
                "iqr_outliers": 0,
                "stddev_outliers": 2,
                "outliers": "2;0",
                "ld15iqr": 0.17406221100000607,
                "hd15iqr": 0.18411340599999448,
                "ops": 5.597045677797481,
                "total": 0.8933284250000213,
                "iterations": 1
            }
        },
        {
            "group": null,
            "name": "test_06_radiation_pressure",
            "fullname": "tests/benchmarks/test_benchmarks.py::test_06_radiation_pressure",
            "params": null,
            "param": null,
            "extra_info": {},
            "options": {
                "disable_gc": false,
                "timer": "perf_counter",
                "min_rounds": 5,
                "max_time": 1.0,
                "min_time": 5e-06,
                "warmup": false
            },
            "stats": {
                "min": 0.23814351400000078,
                "max": 0.24351955699998484,
                "mean": 0.24149430379999898,
                "stddev": 0.002023394046588846,
                "rounds": 5,
                "median": 0.24174029599998903,
                "iqr": 0.002018035749991043,
                "q1": 0.2407244230000103,
                "q3": 0.24274245875000133,
                "iqr_outliers": 0,
                "stddev_outliers": 2,
                "outliers": "2;0",
                "ld15iqr": 0.23814351400000078,
                "hd15iqr": 0.24351955699998484,
                "ops": 4.140884419485857,
                "total": 1.207471518999995,
                "iterations": 1
            }
        },
        {
            "group": null,
            "name": "test_07_homodyne",
            "fullname": "tests/benchmarks/test_benchmarks.py::test_07_homodyne",
            "params": null,
            "param": null,
            "extra_info": {},
            "options": {
                "disable_gc": false,
                "timer": "perf_counter",
                "min_rounds": 5,
                "max_time": 1.0,
                "min_time": 5e-06,
                "warmup": false
            },
            "stats": {
                "min": 0.11490186000000335,
                "max": 0.6535524299999906,
                "mean": 0.16995089049999876,
                "stddev": 0.16992435259868927,
                "rounds": 10,
                "median": 0.11595202050000353,
                "iqr": 0.0026391910000427288,
                "q1": 0.11527816999998208,
                "q3": 0.11791736100002481,
                "iqr_outliers": 1,
                "stddev_outliers": 1,
                "outliers": "1;1",
                "ld15iqr": 0.11490186000000335,
                "hd15iqr": 0.6535524299999906,
                "ops": 5.884052722865888,
                "total": 1.6995089049999876,
                "iterations": 1
            }
        },
        {
            "group": null,
            "name": "test_08_optical_spring",
            "fullname": "tests/benchmarks/test_benchmarks.py::test_08_optical_spring",
            "params": null,
            "param": null,
            "extra_info": {},
            "options": {
                "disable_gc": false,
                "timer": "perf_counter",
                "min_rounds": 5,
                "max_time": 1.0,
                "min_time": 5e-06,
                "warmup": false
            },
            "stats": {
                "min": 0.2972078049999993,
                "max": 0.31317521300002227,
                "mean": 0.3019275891999996,
                "stddev": 0.0064852582549107095,
                "rounds": 5,
                "median": 0.29920506499999533,
                "iqr": 0.0063148052500068275,
                "q1": 0.2981591732499922,
                "q3": 0.304473978499999,
                "iqr_outliers": 0,
                "stddev_outliers": 1,
                "outliers": "1;0",
                "ld15iqr": 0.2972078049999993,
                "hd15iqr": 0.31317521300002227,
                "ops": 3.3120524118039136,
                "total": 1.509637945999998,
                "iterations": 1
            }
        },
        {
            "group": null,
            "name": "test_09_aligo_sensitivity",
            "fullname": "tests/benchmarks/test_benchmarks.py::test_09_aligo_sensitivity",
            "params": null,
            "param": null,
            "extra_info": {},
            "options": {
                "disable_gc": false,
                "timer": "perf_counter",
                "min_rounds": 5,
                "max_time": 1.0,
                "min_time": 5e-06,
                "warmup": false
            },
            "stats": {
                "min": 0.3259066389999816,
                "max": 0.9581665380000004,
                "mean": 0.4551300327999968,
                "stddev": 0.28121702314022556,
                "rounds": 5,
                "median": 0.3302091619999885,
                "iqr": 0.1612020320000056,
                "q1": 0.3279210655,
                "q3": 0.4891230975000056,
                "iqr_outliers": 1,
                "stddev_outliers": 1,
                "outliers": "1;1",
                "ld15iqr": 0.3259066389999816,
                "hd15iqr": 0.9581665380000004,
                "ops": 2.1971742753338406,
                "total": 2.275650163999984,
                "iterations": 1
            }
        },
        {
            "group": null,
            "name": "test_10_shifted_beam",
            "fullname": "tests/benchmarks/test_benchmarks.py::test_10_shifted_beam",
            "params": null,
            "param": null,
            "extra_info": {},
            "options": {
                "disable_gc": false,
                "timer": "perf_counter",
                "min_rounds": 5,
                "max_time": 1.0,
                "min_time": 5e-06,
                "warmup": false
            },
            "stats": {
                "min": 0.719480424000011,
                "max": 0.7404495359999999,
                "mean": 0.7317902188000005,
                "stddev": 0.007795818438258536,
                "rounds": 5,
                "median": 0.7319080709999923,
                "iqr": 0.008651390250008717,
                "q1": 0.7283329484999967,
                "q3": 0.7369843387500055,
                "iqr_outliers": 0,
                "stddev_outliers": 2,
                "outliers": "2;0",
                "ld15iqr": 0.719480424000011,
                "hd15iqr": 0.7404495359999999,
                "ops": 1.3665118422050155,
                "total": 3.6589510940000025,
                "iterations": 1
            }
        },
        {
            "group": null,
            "name": "test_angular_radiation_pressure",
            "fullname": "tests/benchmarks/test_benchmarks.py::test_angular_radiation_pressure",
            "params": null,
            "param": null,
            "extra_info": {},
            "options": {
                "disable_gc": false,
                "timer": "perf_counter",
                "min_rounds": 5,
                "max_time": 1.0,
                "min_time": 5e-06,
                "warmup": false
            },
            "stats": {
                "min": 0.344855420000016,
                "max": 0.3519195229999923,
                "mean": 0.347476003200012,
                "stddev": 0.0027350567505026744,
                "rounds": 5,
                "median": 0.3470651210000142,
                "iqr": 0.0033191032499857442,
                "q1": 0.3455147982500222,
                "q3": 0.3488339015000079,
                "iqr_outliers": 0,
                "stddev_outliers": 1,
                "outliers": "1;0",
                "ld15iqr": 0.344855420000016,
                "hd15iqr": 0.3519195229999923,
                "ops": 2.8778965764274265,
                "total": 1.7373800160000599,
                "iterations": 1
            }
        },
        {
            "group": null,
            "name": "test_cavity_eigenmodes",
            "fullname": "tests/benchmarks/test_benchmarks.py::test_cavity_eigenmodes",
            "params": null,
            "param": null,
            "extra_info": {},
            "options": {
                "disable_gc": false,
                "timer": "perf_counter",
                "min_rounds": 5,
                "max_time": 1.0,
                "min_time": 5e-06,
                "warmup": false
            },
            "stats": {
                "min": 0.27463934300001824,
                "max": 1.1710366699999781,
                "mean": 0.45835150040000483,
                "stddev": 0.39841819926921623,
                "rounds": 5,
                "median": 0.28156004600000983,
                "iqr": 0.22686420149999265,
                "q1": 0.27897294200001,
                "q3": 0.5058371435000026,
                "iqr_outliers": 1,
                "stddev_outliers": 1,
                "outliers": "1;1",
                "ld15iqr": 0.27463934300001824,
                "hd15iqr": 1.1710366699999781,
                "ops": 2.181731704002925,
                "total": 2.2917575020000243,
                "iterations": 1
            }
        },
        {
            "group": null,
            "name": "test_coupled_cavity_commands",
            "fullname": "tests/benchmarks/test_benchmarks.py::test_coupled_cavity_commands",
            "params": null,
            "param": null,
            "extra_info": {},
            "options": {
                "disable_gc": false,
                "timer": "perf_counter",
                "min_rounds": 5,
                "max_time": 1.0,
                "min_time": 5e-06,
                "warmup": false
            },
            "stats": {
                "min": 4.435406419000003,
                "max": 5.689139013000016,
                "mean": 4.885464589600008,
                "stddev": 0.6149945356158726,
                "rounds": 5,
                "median": 4.4477988450000225,
                "iqr": 1.0400780457500076,
                "q1": 4.441146157749998,
                "q3": 5.481224203500005,
                "iqr_outliers": 0,
                "stddev_outliers": 1,
                "outliers": "1;0",
                "ld15iqr": 4.435406419000003,
                "hd15iqr": 5.689139013000016,
                "ops": 0.20468882368501087,
                "total": 24.42732294800004,
                "iterations": 1
            }
        },
        {
            "group": null,
            "name": "test_frequency_dependant_squeezing",
            "fullname": "tests/benchmarks/test_benchmarks.py::test_frequency_dependant_squeezing",
            "params": null,
            "param": null,
            "extra_info": {},
            "options": {
                "disable_gc": false,
                "timer": "perf_counter",
                "min_rounds": 5,
                "max_time": 1.0,
                "min_time": 5e-06,
                "warmup": false
            },
            "stats": {
                "min": 1.5766394010000226,
                "max": 2.8695578139999895,
                "mean": 1.8378685202000042,
                "stddev": 0.576741961722561,
                "rounds": 5,
                "median": 1.5808498320000126,
                "iqr": 0.32923184574998743,
                "q1": 1.5770195617500065,
                "q3": 1.9062514074999939,
                "iqr_outliers": 1,
                "stddev_outliers": 1,
                "outliers": "1;1",
                "ld15iqr": 1.5766394010000226,
                "hd15iqr": 2.8695578139999895,
                "ops": 0.5441085632671786,
                "total": 9.189342601000021,
                "iterations": 1
            }
        },
        {
            "group": null,
            "name": "test_lock_actions",
            "fullname": "tests/benchmarks/test_benchmarks.py::test_lock_actions",
            "params": null,
            "param": null,
            "extra_info": {},
            "options": {
                "disable_gc": false,
                "timer": "perf_counter",
                "min_rounds": 5,
                "max_time": 1.0,
                "min_time": 5e-06,
                "warmup": false
            },
            "stats": {
                "min": 4.951887859999971,
                "max": 5.284389641000018,
                "mean": 5.0916095078000065,
                "stddev": 0.12288843712441049,
                "rounds": 5,
                "median": 5.0807218190000185,
                "iqr": 0.13836357899999285,
                "q1": 5.013245980250012,
                "q3": 5.151609559250005,
                "iqr_outliers": 0,
                "stddev_outliers": 2,
                "outliers": "2;0",
                "ld15iqr": 4.951887859999971,
                "hd15iqr": 5.284389641000018,
                "ops": 0.19640155013224533,
                "total": 25.458047539000034,
                "iterations": 1
            }
        }
    ],
    "datetime": "2024-05-22T11:11:18.463365",
    "version": "4.0.0"
}