{
    "machine_info": {
        "node": "runner-nthfetyx-project-39604133-concurrent-0",
        "processor": "",
        "machine": "x86_64",
        "python_compiler": "GCC 12.2.0",
        "python_implementation": "CPython",
        "python_implementation_version": "3.12.4",
        "python_version": "3.12.4",
        "python_build": [
            "main",
            "Jul  3 2024 00:13:31"
        ],
        "release": "5.15.154+",
        "system": "Linux",
        "cpu": {
            "python_version": "3.12.4.final.0 (64 bit)",
            "cpuinfo_version": [
                9,
                0,
                0
            ],
            "cpuinfo_version_string": "9.0.0",
            "arch": "X86_64",
            "bits": 64,
            "count": 2,
            "arch_string_raw": "x86_64",
            "vendor_id_raw": "AuthenticAMD",
            "brand_raw": "AMD EPYC 7B13",
            "hz_advertised_friendly": "2.4500 GHz",
            "hz_actual_friendly": "2.4500 GHz",
            "hz_advertised": [
                2449996000,
                0
            ],
            "hz_actual": [
                2449996000,
                0
            ],
            "model": 1,
            "family": 25,
            "flags": [
                "3dnowext",
                "3dnowprefetch",
                "abm",
                "adx",
                "aes",
                "apic",
                "arat",
                "avx",
                "avx2",
                "bmi1",
                "bmi2",
                "clflush",
                "clflushopt",
                "clwb",
                "clzero",
                "cmov",
                "cmp_legacy",
                "constant_tsc",
                "cpuid",
                "cr8_legacy",
                "cx16",
                "cx8",
                "de",
                "erms",
                "extd_apicid",
                "f16c",
                "fma",
                "fpu",
                "fsgsbase",
                "fsrm",
                "fxsr",
                "fxsr_opt",
                "ht",
                "hypervisor",
                "ibpb",
                "ibrs",
                "invpcid",
                "invpcid_single",
                "lahf_lm",
                "lm",
                "mca",
                "mce",
                "misalignsse",
                "mmx",
                "mmxext",
                "movbe",
                "msr",
                "mtrr",
                "nonstop_tsc",
                "nopl",
                "npt",
                "nrip_save",
                "nx",
                "osvw",
                "osxsave",
                "pae",
                "pat",
                "pcid",
                "pclmulqdq",
                "pdpe1gb",
                "pge",
                "pni",
                "popcnt",
                "pse",
                "pse36",
                "rdpid",
                "rdrand",
                "rdrnd",
                "rdseed",
                "rdtscp",
                "rep_good",
                "sep",
                "sha",
                "sha_ni",
                "smap",
                "smep",
                "ssbd",
                "sse",
                "sse2",
                "sse4_1",
                "sse4_2",
                "sse4a",
                "ssse3",
                "stibp",
                "syscall",
                "topoext",
                "tsc",
                "tsc_adjust",
                "tsc_known_freq",
                "umip",
                "vaes",
                "vme",
                "vmmcall",
                "vpclmulqdq",
                "x2apic",
                "xgetbv1",
                "xsave",
                "xsavec",
                "xsaveerptr",
                "xsaveopt"
            ],
            "l3_cache_size": 524288,
            "l2_cache_size": 524288,
            "l1_data_cache_size": 32768,
            "l1_instruction_cache_size": 32768,
            "l2_cache_line_size": 512,
            "l2_cache_associativity": 6
        }
    },
    "commit_info": {
        "id": "89336083c74ff87c5399b63f346022eb3ed40411",
        "time": "2024-07-09T11:19:37+02:00",
        "author_time": "2024-07-09T11:19:37+02:00",
        "dirty": false,
        "project": "finesse3",
        "branch": "(detached head)"
    },
    "benchmarks": [
        {
            "group": null,
            "name": "test_01_simple_cav",
            "fullname": "tests/benchmarks/test_benchmarks.py::test_01_simple_cav",
            "params": null,
            "param": null,
            "extra_info": {},
            "options": {
                "disable_gc": false,
                "timer": "perf_counter",
                "min_rounds": 5,
                "max_time": 1.0,
                "min_time": 5e-06,
                "warmup": false
            },
            "stats": {
                "min": 0.3690646279999896,
                "max": 0.5449854660000142,
                "mean": 0.4061722380000049,
                "stddev": 0.07763193103498471,
                "rounds": 5,
                "median": 0.3720413419999886,
                "iqr": 0.047758644999994715,
                "q1": 0.3696655970000151,
                "q3": 0.4174242420000098,
                "iqr_outliers": 1,
                "stddev_outliers": 1,
                "outliers": "1;1",
                "ld15iqr": 0.3690646279999896,
                "hd15iqr": 0.5449854660000142,
                "ops": 2.4620097250467126,
                "total": 2.0308611900000244,
                "iterations": 1
            }
        },
        {
            "group": null,
            "name": "test_02_pdh_lock",
            "fullname": "tests/benchmarks/test_benchmarks.py::test_02_pdh_lock",
            "params": null,
            "param": null,
            "extra_info": {},
            "options": {
                "disable_gc": false,
                "timer": "perf_counter",
                "min_rounds": 5,
                "max_time": 1.0,
                "min_time": 5e-06,
                "warmup": false
            },
            "stats": {
                "min": 1.2997749980000037,
                "max": 1.5846172420000073,
                "mean": 1.3679368909999994,
                "stddev": 0.12146286720837582,
                "rounds": 5,
                "median": 1.3185443950000035,
                "iqr": 0.07968904099999463,
                "q1": 1.3094849419999974,
                "q3": 1.389173982999992,
                "iqr_outliers": 1,
                "stddev_outliers": 1,
                "outliers": "1;1",
                "ld15iqr": 1.2997749980000037,
                "hd15iqr": 1.5846172420000073,
                "ops": 0.7310278760513379,
                "total": 6.839684454999997,
                "iterations": 1
            }
        },
        {
            "group": null,
            "name": "test_03_near_unstable",
            "fullname": "tests/benchmarks/test_benchmarks.py::test_03_near_unstable",
            "params": null,
            "param": null,
            "extra_info": {},
            "options": {
                "disable_gc": false,
                "timer": "perf_counter",
                "min_rounds": 5,
                "max_time": 1.0,
                "min_time": 5e-06,
                "warmup": false
            },
            "stats": {
                "min": 1.7899999988912896e-06,
                "max": 3.879999999867323e-05,
                "mean": 2.6129434819486367e-06,
                "stddev": 9.89382049001502e-07,
                "rounds": 54142,
                "median": 1.929999996264087e-06,
                "iqr": 1.5900000107649248e-06,
                "q1": 1.879999985021641e-06,
                "q3": 3.4699999957865657e-06,
                "iqr_outliers": 258,
                "stddev_outliers": 1332,
                "outliers": "1332;258",
                "ld15iqr": 1.7899999988912896e-06,
                "hd15iqr": 5.86999999541149e-06,
                "ops": 382710.1530930309,
                "total": 0.1414699859996631,
                "iterations": 1
            }
        },
        {
            "group": null,
            "name": "test_04_geometrical_params",
            "fullname": "tests/benchmarks/test_benchmarks.py::test_04_geometrical_params",
            "params": null,
            "param": null,
            "extra_info": {},
            "options": {
                "disable_gc": false,
                "timer": "perf_counter",
                "min_rounds": 5,
                "max_time": 1.0,
                "min_time": 5e-06,
                "warmup": false
            },
            "stats": {
                "min": 0.5026943279999898,
                "max": 0.855969507999987,
                "mean": 0.5775242499999933,
                "stddev": 0.15571248649378858,
                "rounds": 5,
                "median": 0.5089510640000015,
                "iqr": 0.09448175950001314,
                "q1": 0.5050944809999862,
                "q3": 0.5995762404999994,
                "iqr_outliers": 1,
                "stddev_outliers": 1,
                "outliers": "1;1",
                "ld15iqr": 0.5026943279999898,
                "hd15iqr": 0.855969507999987,
                "ops": 1.731529022374405,
                "total": 2.8876212499999667,
                "iterations": 1
            }
        },
        {
            "group": null,
            "name": "test_05_modulation",
            "fullname": "tests/benchmarks/test_benchmarks.py::test_05_modulation",
            "params": null,
            "param": null,
            "extra_info": {},
            "options": {
                "disable_gc": false,
                "timer": "perf_counter",
                "min_rounds": 5,
                "max_time": 1.0,
                "min_time": 5e-06,
                "warmup": false
            },
            "stats": {
                "min": 0.1730214979999971,
                "max": 0.6040819629999987,
                "mean": 0.23004155050000463,
                "stddev": 0.15117301767886643,
                "rounds": 8,
                "median": 0.1760805535000145,
                "iqr": 0.007396425999999678,
                "q1": 0.17406874600000322,
                "q3": 0.1814651720000029,
                "iqr_outliers": 1,
                "stddev_outliers": 1,
                "outliers": "1;1",
                "ld15iqr": 0.1730214979999971,
                "hd15iqr": 0.6040819629999987,
                "ops": 4.347040775140228,
                "total": 1.840332404000037,
                "iterations": 1
            }
        },
        {
            "group": null,
            "name": "test_06_radiation_pressure",
            "fullname": "tests/benchmarks/test_benchmarks.py::test_06_radiation_pressure",
            "params": null,
            "param": null,
            "extra_info": {},
            "options": {
                "disable_gc": false,
                "timer": "perf_counter",
                "min_rounds": 5,
                "max_time": 1.0,
                "min_time": 5e-06,
                "warmup": false
            },
            "stats": {
                "min": 0.306759650999993,
                "max": 0.3129885730000126,
                "mean": 0.30920872160000384,
                "stddev": 0.00232955843826817,
                "rounds": 5,
                "median": 0.3085842780000121,
                "iqr": 0.0024956364999937364,
                "q1": 0.3078623745000044,
                "q3": 0.31035801099999816,
                "iqr_outliers": 0,
                "stddev_outliers": 2,
                "outliers": "2;0",
                "ld15iqr": 0.306759650999993,
                "hd15iqr": 0.3129885730000126,
                "ops": 3.2340614288804312,
                "total": 1.5460436080000193,
                "iterations": 1
            }
        },
        {
            "group": null,
            "name": "test_07_homodyne",
            "fullname": "tests/benchmarks/test_benchmarks.py::test_07_homodyne",
            "params": null,
            "param": null,
            "extra_info": {},
            "options": {
                "disable_gc": false,
                "timer": "perf_counter",
                "min_rounds": 5,
                "max_time": 1.0,
                "min_time": 5e-06,
                "warmup": false
            },
            "stats": {
                "min": 0.0986200849999932,
                "max": 0.633995538000022,
                "mean": 0.17744619333333528,
                "stddev": 0.17141814367602667,
                "rounds": 9,
                "median": 0.12321730599998659,
                "iqr": 0.004858699250007703,
                "q1": 0.12098975074999885,
                "q3": 0.12584845000000655,
                "iqr_outliers": 2,
                "stddev_outliers": 1,
                "outliers": "1;2",
                "ld15iqr": 0.12034088900000484,
                "hd15iqr": 0.633995538000022,
                "ops": 5.63551114405416,
                "total": 1.5970157400000176,
                "iterations": 1
            }
        },
        {
            "group": null,
            "name": "test_08_optical_spring",
            "fullname": "tests/benchmarks/test_benchmarks.py::test_08_optical_spring",
            "params": null,
            "param": null,
            "extra_info": {},
            "options": {
                "disable_gc": false,
                "timer": "perf_counter",
                "min_rounds": 5,
                "max_time": 1.0,
                "min_time": 5e-06,
                "warmup": false
            },
            "stats": {
                "min": 0.2903393200000153,
                "max": 0.29613532300001566,
                "mean": 0.29374590400000783,
                "stddev": 0.002162906405333594,
                "rounds": 5,
                "median": 0.29396912600000746,
                "iqr": 0.002527289999974869,
                "q1": 0.29265284200001673,
                "q3": 0.2951801319999916,
                "iqr_outliers": 0,
                "stddev_outliers": 2,
                "outliers": "2;0",
                "ld15iqr": 0.2903393200000153,
                "hd15iqr": 0.29613532300001566,
                "ops": 3.4043027881674677,
                "total": 1.4687295200000392,
                "iterations": 1
            }
        },
        {
            "group": null,
            "name": "test_09_aligo_sensitivity",
            "fullname": "tests/benchmarks/test_benchmarks.py::test_09_aligo_sensitivity",
            "params": null,
            "param": null,
            "extra_info": {},
            "options": {
                "disable_gc": false,
                "timer": "perf_counter",
                "min_rounds": 5,
                "max_time": 1.0,
                "min_time": 5e-06,
                "warmup": false
            },
            "stats": {
                "min": 0.3157025900000008,
                "max": 0.9099622040000099,
                "mean": 0.43851118819999896,
                "stddev": 0.26360209189429357,
                "rounds": 5,
                "median": 0.3229113110000128,
                "iqr": 0.15796207050000532,
                "q1": 0.3157195024999879,
                "q3": 0.47368157299999325,
                "iqr_outliers": 1,
                "stddev_outliers": 1,
                "outliers": "1;1",
                "ld15iqr": 0.3157025900000008,
                "hd15iqr": 0.9099622040000099,
                "ops": 2.2804435255228053,
                "total": 2.192555940999995,
                "iterations": 1
            }
        },
        {
            "group": null,
            "name": "test_10_shifted_beam",
            "fullname": "tests/benchmarks/test_benchmarks.py::test_10_shifted_beam",
            "params": null,
            "param": null,
            "extra_info": {},
            "options": {
                "disable_gc": false,
                "timer": "perf_counter",
                "min_rounds": 5,
                "max_time": 1.0,
                "min_time": 5e-06,
                "warmup": false
            },
            "stats": {
                "min": 0.7032802470000092,
                "max": 1.390022431999995,
                "mean": 0.844297245000007,
                "stddev": 0.3050862361099242,
                "rounds": 5,
                "median": 0.7102126780000049,
                "iqr": 0.1752712842500017,
                "q1": 0.7057662682500094,
                "q3": 0.8810375525000111,
                "iqr_outliers": 1,
                "stddev_outliers": 1,
                "outliers": "1;1",
                "ld15iqr": 0.7032802470000092,
                "hd15iqr": 1.390022431999995,
                "ops": 1.184416988118908,
                "total": 4.221486225000035,
                "iterations": 1
            }
        },
        {
            "group": null,
            "name": "test_angular_radiation_pressure",
            "fullname": "tests/benchmarks/test_benchmarks.py::test_angular_radiation_pressure",
            "params": null,
            "param": null,
            "extra_info": {},
            "options": {
                "disable_gc": false,
                "timer": "perf_counter",
                "min_rounds": 5,
                "max_time": 1.0,
                "min_time": 5e-06,
                "warmup": false
            },
            "stats": {
                "min": 0.33069561199999953,
                "max": 0.335128697000016,
                "mean": 0.33316211760001124,
                "stddev": 0.0019523063351996569,
                "rounds": 5,
                "median": 0.33411992900002474,
                "iqr": 0.003300705750000077,
                "q1": 0.3312775670000079,
                "q3": 0.33457827275000795,
                "iqr_outliers": 0,
                "stddev_outliers": 2,
                "outliers": "2;0",
                "ld15iqr": 0.33069561199999953,
                "hd15iqr": 0.335128697000016,
                "ops": 3.001541733506998,
                "total": 1.6658105880000562,
                "iterations": 1
            }
        },
        {
            "group": null,
            "name": "test_cavity_eigenmodes",
            "fullname": "tests/benchmarks/test_benchmarks.py::test_cavity_eigenmodes",
            "params": null,
            "param": null,
            "extra_info": {},
            "options": {
                "disable_gc": false,
                "timer": "perf_counter",
                "min_rounds": 5,
                "max_time": 1.0,
                "min_time": 5e-06,
                "warmup": false
            },
            "stats": {
                "min": 0.26151921400000333,
                "max": 1.063195515000018,
                "mean": 0.42378826360000516,
                "stddev": 0.35744905806648336,
                "rounds": 5,
                "median": 0.26427516999999057,
                "iqr": 0.205061465,
                "q1": 0.2617903907500079,
                "q3": 0.46685185575000787,
                "iqr_outliers": 1,
                "stddev_outliers": 1,
                "outliers": "1;1",
                "ld15iqr": 0.26151921400000333,
                "hd15iqr": 1.063195515000018,
                "ops": 2.3596689335027348,
                "total": 2.118941318000026,
                "iterations": 1
            }
        },
        {
            "group": null,
            "name": "test_coupled_cavity_commands",
            "fullname": "tests/benchmarks/test_benchmarks.py::test_coupled_cavity_commands",
            "params": null,
            "param": null,
            "extra_info": {},
            "options": {
                "disable_gc": false,
                "timer": "perf_counter",
                "min_rounds": 5,
                "max_time": 1.0,
                "min_time": 5e-06,
                "warmup": false
            },
            "stats": {
                "min": 4.26705369199999,
                "max": 5.320484817999983,
                "mean": 4.672450895200001,
                "stddev": 0.5368099759312023,
                "rounds": 5,
                "median": 4.289679505999999,
                "iqr": 0.9441926825000024,
                "q1": 4.283234645000007,
                "q3": 5.22742732750001,
                "iqr_outliers": 0,
                "stddev_outliers": 1,
                "outliers": "1;0",
                "ld15iqr": 4.26705369199999,
                "hd15iqr": 5.320484817999983,
                "ops": 0.2140204407556852,
                "total": 23.362254476000004,
                "iterations": 1
            }
        },
        {
            "group": null,
            "name": "test_frequency_dependant_squeezing",
            "fullname": "tests/benchmarks/test_benchmarks.py::test_frequency_dependant_squeezing",
            "params": null,
            "param": null,
            "extra_info": {},
            "options": {
                "disable_gc": false,
                "timer": "perf_counter",
                "min_rounds": 5,
                "max_time": 1.0,
                "min_time": 5e-06,
                "warmup": false
            },
            "stats": {
                "min": 1.535816694999994,
                "max": 2.8346648239999865,
                "mean": 1.8056647198000064,
                "stddev": 0.5753119395366585,
                "rounds": 5,
                "median": 1.547791573000012,
                "iqr": 0.3371401539999894,
                "q1": 1.5440090530000177,
                "q3": 1.881149207000007,
                "iqr_outliers": 1,
                "stddev_outliers": 1,
                "outliers": "1;1",
                "ld15iqr": 1.535816694999994,
                "hd15iqr": 2.8346648239999865,
                "ops": 0.5538126702230517,
                "total": 9.028323599000032,
                "iterations": 1
            }
        },
        {
            "group": null,
            "name": "test_lock_actions",
            "fullname": "tests/benchmarks/test_benchmarks.py::test_lock_actions",
            "params": null,
            "param": null,
            "extra_info": {},
            "options": {
                "disable_gc": false,
                "timer": "perf_counter",
                "min_rounds": 5,
                "max_time": 1.0,
                "min_time": 5e-06,
                "warmup": false
            },
            "stats": {
                "min": 4.80227769199999,
                "max": 6.543801925000025,
                "mean": 5.234988396200009,
                "stddev": 0.7365976188529535,
                "rounds": 5,
                "median": 4.929539151,
                "iqr": 0.5606593775000164,
                "q1": 4.850176468250005,
                "q3": 5.410835845750022,
                "iqr_outliers": 1,
                "stddev_outliers": 1,
                "outliers": "1;1",
                "ld15iqr": 4.80227769199999,
                "hd15iqr": 6.543801925000025,
                "ops": 0.1910223909428115,
                "total": 26.174941981000046,
                "iterations": 1
            }
        }
    ],
    "datetime": "2024-07-09T09:26:52.208123",
    "version": "4.0.0"
}