{
    "machine_info": {
        "node": "runner--azerasq-project-39604133-concurrent-0",
        "processor": "",
        "machine": "x86_64",
        "python_compiler": "GCC 12.2.0",
        "python_implementation": "CPython",
        "python_implementation_version": "3.12.6",
        "python_version": "3.12.6",
        "python_build": [
            "main",
            "Sep 12 2024 21:12:04"
        ],
        "release": "5.15.154+",
        "system": "Linux",
        "cpu": {
            "python_version": "3.12.6.final.0 (64 bit)",
            "cpuinfo_version": [
                9,
                0,
                0
            ],
            "cpuinfo_version_string": "9.0.0",
            "arch": "X86_64",
            "bits": 64,
            "count": 2,
            "arch_string_raw": "x86_64",
            "vendor_id_raw": "AuthenticAMD",
            "brand_raw": "AMD EPYC 7B13",
            "hz_advertised_friendly": "2.4500 GHz",
            "hz_actual_friendly": "2.4500 GHz",
            "hz_advertised": [
                2449998000,
                0
            ],
            "hz_actual": [
                2449998000,
                0
            ],
            "model": 1,
            "family": 25,
            "flags": [
                "3dnowext",
                "3dnowprefetch",
                "abm",
                "adx",
                "aes",
                "apic",
                "arat",
                "avx",
                "avx2",
                "bmi1",
                "bmi2",
                "clflush",
                "clflushopt",
                "clwb",
                "clzero",
                "cmov",
                "cmp_legacy",
                "constant_tsc",
                "cpuid",
                "cr8_legacy",
                "cx16",
                "cx8",
                "de",
                "erms",
                "extd_apicid",
                "f16c",
                "fma",
                "fpu",
                "fsgsbase",
                "fsrm",
                "fxsr",
                "fxsr_opt",
                "ht",
                "hypervisor",
                "ibpb",
                "ibrs",
                "invpcid",
                "invpcid_single",
                "lahf_lm",
                "lm",
                "mca",
                "mce",
                "misalignsse",
                "mmx",
                "mmxext",
                "movbe",
                "msr",
                "mtrr",
                "nonstop_tsc",
                "nopl",
                "npt",
                "nrip_save",
                "nx",
                "osvw",
                "osxsave",
                "pae",
                "pat",
                "pcid",
                "pclmulqdq",
                "pdpe1gb",
                "pge",
                "pni",
                "popcnt",
                "pse",
                "pse36",
                "rdpid",
                "rdrand",
                "rdrnd",
                "rdseed",
                "rdtscp",
                "rep_good",
                "sep",
                "sha",
                "sha_ni",
                "smap",
                "smep",
                "ssbd",
                "sse",
                "sse2",
                "sse4_1",
                "sse4_2",
                "sse4a",
                "ssse3",
                "stibp",
                "syscall",
                "topoext",
                "tsc",
                "tsc_adjust",
                "tsc_known_freq",
                "umip",
                "vaes",
                "vme",
                "vmmcall",
                "vpclmulqdq",
                "x2apic",
                "xgetbv1",
                "xsave",
                "xsavec",
                "xsaveerptr",
                "xsaveopt"
            ],
            "l3_cache_size": 524288,
            "l2_cache_size": 524288,
            "l1_data_cache_size": 32768,
            "l1_instruction_cache_size": 32768,
            "l2_cache_line_size": 512,
            "l2_cache_associativity": 6
        }
    },
    "commit_info": {
        "id": "80e4a0148c38296bb4a9fac6339cc1039316a3d6",
        "time": "2024-09-13T16:06:57+02:00",
        "author_time": "2024-09-13T16:06:57+02:00",
        "dirty": false,
        "project": "finesse3",
        "branch": "(detached head)"
    },
    "benchmarks": [
        {
            "group": null,
            "name": "test_01_simple_cav",
            "fullname": "tests/benchmarks/test_benchmarks.py::test_01_simple_cav",
            "params": null,
            "param": null,
            "extra_info": {},
            "options": {
                "disable_gc": false,
                "timer": "perf_counter",
                "min_rounds": 5,
                "max_time": 1.0,
                "min_time": 5e-06,
                "warmup": false
            },
            "stats": {
                "min": 0.2674532979999924,
                "max": 0.44883773899999824,
                "mean": 0.3066094085999964,
                "stddev": 0.07955352936587151,
                "rounds": 5,
                "median": 0.2733860789999909,
                "iqr": 0.04865526999998693,
                "q1": 0.26897246725000556,
                "q3": 0.3176277372499925,
                "iqr_outliers": 1,
                "stddev_outliers": 1,
                "outliers": "1;1",
                "ld15iqr": 0.2674532979999924,
                "hd15iqr": 0.44883773899999824,
                "ops": 3.261478519416875,
                "total": 1.533047042999982,
                "iterations": 1
            }
        },
        {
            "group": null,
            "name": "test_02_pdh_lock",
            "fullname": "tests/benchmarks/test_benchmarks.py::test_02_pdh_lock",
            "params": null,
            "param": null,
            "extra_info": {},
            "options": {
                "disable_gc": false,
                "timer": "perf_counter",
                "min_rounds": 5,
                "max_time": 1.0,
                "min_time": 5e-06,
                "warmup": false
            },
            "stats": {
                "min": 1.2065930589999994,
                "max": 1.4926306020000055,
                "mean": 1.2834015874000015,
                "stddev": 0.11784792628158744,
                "rounds": 5,
                "median": 1.238847788000001,
                "iqr": 0.07740401974999855,
                "q1": 1.2283021307500022,
                "q3": 1.3057061505000007,
                "iqr_outliers": 1,
                "stddev_outliers": 1,
                "outliers": "1;1",
                "ld15iqr": 1.2065930589999994,
                "hd15iqr": 1.4926306020000055,
                "ops": 0.7791793385777752,
                "total": 6.417007937000008,
                "iterations": 1
            }
        },
        {
            "group": null,
            "name": "test_03_near_unstable",
            "fullname": "tests/benchmarks/test_benchmarks.py::test_03_near_unstable",
            "params": null,
            "param": null,
            "extra_info": {},
            "options": {
                "disable_gc": false,
                "timer": "perf_counter",
                "min_rounds": 5,
                "max_time": 1.0,
                "min_time": 5e-06,
                "warmup": false
            },
            "stats": {
                "min": 1.8199999942680734e-06,
                "max": 0.00010664000001270324,
                "mean": 2.0182641471937133e-06,
                "stddev": 6.803431296074656e-07,
                "rounds": 70968,
                "median": 1.9800000075065327e-06,
                "iqr": 8.000000661922968e-08,
                "q1": 1.929999996264087e-06,
                "q3": 2.0100000028833165e-06,
                "iqr_outliers": 1926,
                "stddev_outliers": 624,
                "outliers": "624;1926",
                "ld15iqr": 1.8199999942680734e-06,
                "hd15iqr": 2.130999973815051e-06,
                "ops": 495475.28324795625,
                "total": 0.14323216999804345,
                "iterations": 1
            }
        },
        {
            "group": null,
            "name": "test_04_geometrical_params",
            "fullname": "tests/benchmarks/test_benchmarks.py::test_04_geometrical_params",
            "params": null,
            "param": null,
            "extra_info": {},
            "options": {
                "disable_gc": false,
                "timer": "perf_counter",
                "min_rounds": 5,
                "max_time": 1.0,
                "min_time": 5e-06,
                "warmup": false
            },
            "stats": {
                "min": 0.4547472520000042,
                "max": 0.7800321260000089,
                "mean": 0.5278676212000051,
                "stddev": 0.14120645140373808,
                "rounds": 5,
                "median": 0.46656467500000076,
                "iqr": 0.09359818224999827,
                "q1": 0.45929610100000673,
                "q3": 0.552894283250005,
                "iqr_outliers": 1,
                "stddev_outliers": 1,
                "outliers": "1;1",
                "ld15iqr": 0.4547472520000042,
                "hd15iqr": 0.7800321260000089,
                "ops": 1.8944143566273173,
                "total": 2.639338106000025,
                "iterations": 1
            }
        },
        {
            "group": null,
            "name": "test_05_modulation",
            "fullname": "tests/benchmarks/test_benchmarks.py::test_05_modulation",
            "params": null,
            "param": null,
            "extra_info": {},
            "options": {
                "disable_gc": false,
                "timer": "perf_counter",
                "min_rounds": 5,
                "max_time": 1.0,
                "min_time": 5e-06,
                "warmup": false
            },
            "stats": {
                "min": 0.12205330499998013,
                "max": 0.12900608699999339,
                "mean": 0.12577469744444317,
                "stddev": 0.0022466053387282716,
                "rounds": 9,
                "median": 0.12552423599998974,
                "iqr": 0.0028106637500258103,
                "q1": 0.12437710849999917,
                "q3": 0.12718777225002498,
                "iqr_outliers": 0,
                "stddev_outliers": 3,
                "outliers": "3;0",
                "ld15iqr": 0.12205330499998013,
                "hd15iqr": 0.12900608699999339,
                "ops": 7.950724750832473,
                "total": 1.1319722769999885,
                "iterations": 1
            }
        },
        {
            "group": null,
            "name": "test_06_radiation_pressure",
            "fullname": "tests/benchmarks/test_benchmarks.py::test_06_radiation_pressure",
            "params": null,
            "param": null,
            "extra_info": {},
            "options": {
                "disable_gc": false,
                "timer": "perf_counter",
                "min_rounds": 5,
                "max_time": 1.0,
                "min_time": 5e-06,
                "warmup": false
            },
            "stats": {
                "min": 0.2362927790000242,
                "max": 0.7223978890000069,
                "mean": 0.33874774020000586,
                "stddev": 0.21455596914764488,
                "rounds": 5,
                "median": 0.24446537099998977,
                "iqr": 0.13187703049996458,
                "q1": 0.23786631650002477,
                "q3": 0.36974334699998934,
                "iqr_outliers": 1,
                "stddev_outliers": 1,
                "outliers": "1;1",
                "ld15iqr": 0.2362927790000242,
                "hd15iqr": 0.7223978890000069,
                "ops": 2.9520492134045613,
                "total": 1.6937387010000293,
                "iterations": 1
            }
        },
        {
            "group": null,
            "name": "test_07_homodyne",
            "fullname": "tests/benchmarks/test_benchmarks.py::test_07_homodyne",
            "params": null,
            "param": null,
            "extra_info": {},
            "options": {
                "disable_gc": false,
                "timer": "perf_counter",
                "min_rounds": 5,
                "max_time": 1.0,
                "min_time": 5e-06,
                "warmup": false
            },
            "stats": {
                "min": 0.08165858399999593,
                "max": 0.08509100400002012,
                "mean": 0.08256861483333466,
                "stddev": 0.0009532200847981493,
                "rounds": 12,
                "median": 0.08245386400000143,
                "iqr": 0.001110911000026249,
                "q1": 0.08181276849998653,
                "q3": 0.08292367950001278,
                "iqr_outliers": 1,
                "stddev_outliers": 1,
                "outliers": "1;1",
                "ld15iqr": 0.08165858399999593,
                "hd15iqr": 0.08509100400002012,
                "ops": 12.111139347783745,
                "total": 0.990823378000016,
                "iterations": 1
            }
        },
        {
            "group": null,
            "name": "test_08_optical_spring",
            "fullname": "tests/benchmarks/test_benchmarks.py::test_08_optical_spring",
            "params": null,
            "param": null,
            "extra_info": {},
            "options": {
                "disable_gc": false,
                "timer": "perf_counter",
                "min_rounds": 5,
                "max_time": 1.0,
                "min_time": 5e-06,
                "warmup": false
            },
            "stats": {
                "min": 0.22309858499997404,
                "max": 0.8125445050000053,
                "mean": 0.34548701879999727,
                "stddev": 0.26112253634371463,
                "rounds": 5,
                "median": 0.23011231699999257,
                "iqr": 0.15198726925002148,
                "q1": 0.22659163424999207,
                "q3": 0.37857890350001355,
                "iqr_outliers": 1,
                "stddev_outliers": 1,
                "outliers": "1;1",
                "ld15iqr": 0.22309858499997404,
                "hd15iqr": 0.8125445050000053,
                "ops": 2.8944647572385374,
                "total": 1.7274350939999863,
                "iterations": 1
            }
        },
        {
            "group": null,
            "name": "test_09_aligo_sensitivity",
            "fullname": "tests/benchmarks/test_benchmarks.py::test_09_aligo_sensitivity",
            "params": null,
            "param": null,
            "extra_info": {},
            "options": {
                "disable_gc": false,
                "timer": "perf_counter",
                "min_rounds": 5,
                "max_time": 1.0,
                "min_time": 5e-06,
                "warmup": false
            },
            "stats": {
                "min": 0.24531754899999214,
                "max": 0.25355805099999884,
                "mean": 0.24936981679999803,
                "stddev": 0.003179172874688758,
                "rounds": 5,
                "median": 0.24957002499999703,
                "iqr": 0.004737066749981977,
                "q1": 0.2468922137500087,
                "q3": 0.25162928049999067,
                "iqr_outliers": 0,
                "stddev_outliers": 2,
                "outliers": "2;0",
                "ld15iqr": 0.24531754899999214,
                "hd15iqr": 0.25355805099999884,
                "ops": 4.010108411805225,
                "total": 1.2468490839999902,
                "iterations": 1
            }
        },
        {
            "group": null,
            "name": "test_10_shifted_beam",
            "fullname": "tests/benchmarks/test_benchmarks.py::test_10_shifted_beam",
            "params": null,
            "param": null,
            "extra_info": {},
            "options": {
                "disable_gc": false,
                "timer": "perf_counter",
                "min_rounds": 5,
                "max_time": 1.0,
                "min_time": 5e-06,
                "warmup": false
            },
            "stats": {
                "min": 0.7219084270000167,
                "max": 0.7366002779999974,
                "mean": 0.7271618944000011,
                "stddev": 0.005553728679305514,
                "rounds": 5,
                "median": 0.7256562019999819,
                "iqr": 0.004643553499974473,
                "q1": 0.724358523250018,
                "q3": 0.7290020767499925,
                "iqr_outliers": 1,
                "stddev_outliers": 1,
                "outliers": "1;1",
                "ld15iqr": 0.7219084270000167,
                "hd15iqr": 0.7366002779999974,
                "ops": 1.3752095753382736,
                "total": 3.6358094720000054,
                "iterations": 1
            }
        },
        {
            "group": null,
            "name": "test_angular_radiation_pressure",
            "fullname": "tests/benchmarks/test_benchmarks.py::test_angular_radiation_pressure",
            "params": null,
            "param": null,
            "extra_info": {},
            "options": {
                "disable_gc": false,
                "timer": "perf_counter",
                "min_rounds": 5,
                "max_time": 1.0,
                "min_time": 5e-06,
                "warmup": false
            },
            "stats": {
                "min": 0.2992411860000175,
                "max": 0.3069166859999939,
                "mean": 0.3035248859999967,
                "stddev": 0.0028887950977969233,
                "rounds": 5,
                "median": 0.3045213929999875,
                "iqr": 0.003605177249980329,
                "q1": 0.3015715822500056,
                "q3": 0.3051767594999859,
                "iqr_outliers": 0,
                "stddev_outliers": 2,
                "outliers": "2;0",
                "ld15iqr": 0.2992411860000175,
                "hd15iqr": 0.3069166859999939,
                "ops": 3.2946227677687383,
                "total": 1.5176244299999837,
                "iterations": 1
            }
        },
        {
            "group": null,
            "name": "test_cavity_eigenmodes",
            "fullname": "tests/benchmarks/test_benchmarks.py::test_cavity_eigenmodes",
            "params": null,
            "param": null,
            "extra_info": {},
            "options": {
                "disable_gc": false,
                "timer": "perf_counter",
                "min_rounds": 5,
                "max_time": 1.0,
                "min_time": 5e-06,
                "warmup": false
            },
            "stats": {
                "min": 0.25723587600000997,
                "max": 0.26493977699999505,
                "mean": 0.26131629559999964,
                "stddev": 0.003498636562699507,
                "rounds": 5,
                "median": 0.2609705609999935,
                "iqr": 0.006517631250012812,
                "q1": 0.2583013649999941,
                "q3": 0.26481899625000693,
                "iqr_outliers": 0,
                "stddev_outliers": 2,
                "outliers": "2;0",
                "ld15iqr": 0.25723587600000997,
                "hd15iqr": 0.26493977699999505,
                "ops": 3.8267801007355216,
                "total": 1.3065814779999982,
                "iterations": 1
            }
        },
        {
            "group": null,
            "name": "test_coupled_cavity_commands",
            "fullname": "tests/benchmarks/test_benchmarks.py::test_coupled_cavity_commands",
            "params": null,
            "param": null,
            "extra_info": {},
            "options": {
                "disable_gc": false,
                "timer": "perf_counter",
                "min_rounds": 5,
                "max_time": 1.0,
                "min_time": 5e-06,
                "warmup": false
            },
            "stats": {
                "min": 5.69628134300001,
                "max": 6.773067455000017,
                "mean": 5.9801043088000085,
                "stddev": 0.4483897729061219,
                "rounds": 5,
                "median": 5.813339170000006,
                "iqr": 0.3666767985000021,
                "q1": 5.732017791500006,
                "q3": 6.098694590000008,
                "iqr_outliers": 1,
                "stddev_outliers": 1,
                "outliers": "1;1",
                "ld15iqr": 5.69628134300001,
                "hd15iqr": 6.773067455000017,
                "ops": 0.167221163438312,
                "total": 29.900521544000043,
                "iterations": 1
            }
        },
        {
            "group": null,
            "name": "test_frequency_dependant_squeezing",
            "fullname": "tests/benchmarks/test_benchmarks.py::test_frequency_dependant_squeezing",
            "params": null,
            "param": null,
            "extra_info": {},
            "options": {
                "disable_gc": false,
                "timer": "perf_counter",
                "min_rounds": 5,
                "max_time": 1.0,
                "min_time": 5e-06,
                "warmup": false
            },
            "stats": {
                "min": 1.5087691269999937,
                "max": 1.581761720000003,
                "mean": 1.553628143599991,
                "stddev": 0.028109271465272062,
                "rounds": 5,
                "median": 1.5592047109999783,
                "iqr": 0.03546381924998343,
                "q1": 1.5379863812500005,
                "q3": 1.573450200499984,
                "iqr_outliers": 0,
                "stddev_outliers": 2,
                "outliers": "2;0",
                "ld15iqr": 1.5087691269999937,
                "hd15iqr": 1.581761720000003,
                "ops": 0.6436546635173903,
                "total": 7.768140717999955,
                "iterations": 1
            }
        },
        {
            "group": null,
            "name": "test_lock_actions",
            "fullname": "tests/benchmarks/test_benchmarks.py::test_lock_actions",
            "params": null,
            "param": null,
            "extra_info": {},
            "options": {
                "disable_gc": false,
                "timer": "perf_counter",
                "min_rounds": 5,
                "max_time": 1.0,
                "min_time": 5e-06,
                "warmup": false
            },
            "stats": {
                "min": 3.0421049159999995,
                "max": 3.064811894999991,
                "mean": 3.0543072559999986,
                "stddev": 0.008510165151632672,
                "rounds": 5,
                "median": 3.0567476289999718,
                "iqr": 0.010896216749991083,
                "q1": 3.0483684330000145,
                "q3": 3.0592646497500056,
                "iqr_outliers": 0,
                "stddev_outliers": 2,
                "outliers": "2;0",
                "ld15iqr": 3.0421049159999995,
                "hd15iqr": 3.064811894999991,
                "ops": 0.32740648408425893,
                "total": 15.271536279999992,
                "iterations": 1
            }
        }
    ],
    "datetime": "2024-09-13T14:14:22.645606",
    "version": "4.0.0"
}