{
    "machine_info": {
        "node": "runner-nn8vmrs9z-project-39604133-concurrent-0",
        "processor": "",
        "machine": "x86_64",
        "python_compiler": "GCC 12.2.0",
        "python_implementation": "CPython",
        "python_implementation_version": "3.13.0",
        "python_version": "3.13.0",
        "python_build": [
            "main",
            "Nov 12 2024 06:05:34"
        ],
        "release": "5.15.154+",
        "system": "Linux",
        "cpu": {
            "python_version": "3.13.0.final.0 (64 bit)",
            "cpuinfo_version": [
                9,
                0,
                0
            ],
            "cpuinfo_version_string": "9.0.0",
            "arch": "X86_64",
            "bits": 64,
            "count": 2,
            "arch_string_raw": "x86_64",
            "vendor_id_raw": "AuthenticAMD",
            "brand_raw": "AMD EPYC 7B13",
            "hz_advertised_friendly": "2.4500 GHz",
            "hz_actual_friendly": "2.4500 GHz",
            "hz_advertised": [
                2449996000,
                0
            ],
            "hz_actual": [
                2449996000,
                0
            ],
            "model": 1,
            "family": 25,
            "flags": [
                "3dnowext",
                "3dnowprefetch",
                "abm",
                "adx",
                "aes",
                "apic",
                "arat",
                "avx",
                "avx2",
                "bmi1",
                "bmi2",
                "clflush",
                "clflushopt",
                "clwb",
                "clzero",
                "cmov",
                "cmp_legacy",
                "constant_tsc",
                "cpuid",
                "cr8_legacy",
                "cx16",
                "cx8",
                "de",
                "erms",
                "extd_apicid",
                "f16c",
                "fma",
                "fpu",
                "fsgsbase",
                "fsrm",
                "fxsr",
                "fxsr_opt",
                "ht",
                "hypervisor",
                "ibpb",
                "ibrs",
                "invpcid",
                "invpcid_single",
                "lahf_lm",
                "lm",
                "mca",
                "mce",
                "misalignsse",
                "mmx",
                "mmxext",
                "movbe",
                "msr",
                "mtrr",
                "nonstop_tsc",
                "nopl",
                "npt",
                "nrip_save",
                "nx",
                "osvw",
                "osxsave",
                "pae",
                "pat",
                "pcid",
                "pclmulqdq",
                "pdpe1gb",
                "pge",
                "pni",
                "popcnt",
                "pse",
                "pse36",
                "rdpid",
                "rdrand",
                "rdrnd",
                "rdseed",
                "rdtscp",
                "rep_good",
                "sep",
                "sha",
                "sha_ni",
                "smap",
                "smep",
                "ssbd",
                "sse",
                "sse2",
                "sse4_1",
                "sse4_2",
                "sse4a",
                "ssse3",
                "stibp",
                "syscall",
                "topoext",
                "tsc",
                "tsc_adjust",
                "tsc_known_freq",
                "umip",
                "vaes",
                "vme",
                "vmmcall",
                "vpclmulqdq",
                "x2apic",
                "xgetbv1",
                "xsave",
                "xsavec",
                "xsaveerptr",
                "xsaveopt"
            ],
            "l3_cache_size": 524288,
            "l2_cache_size": 524288,
            "l1_data_cache_size": 32768,
            "l1_instruction_cache_size": 32768,
            "l2_cache_line_size": 512,
            "l2_cache_associativity": 6
        }
    },
    "commit_info": {
        "id": "b14f96040160c68ced3ab1cf1c0f2607b9d802d3",
        "time": "2024-11-16T18:57:39+10:30",
        "author_time": "2024-11-16T18:57:13+10:30",
        "dirty": false,
        "project": "finesse3",
        "branch": "(detached head)"
    },
    "benchmarks": [
        {
            "group": null,
            "name": "test_01_simple_cav",
            "fullname": "tests/benchmarks/test_benchmarks.py::test_01_simple_cav",
            "params": null,
            "param": null,
            "extra_info": {},
            "options": {
                "disable_gc": false,
                "timer": "perf_counter",
                "min_rounds": 5,
                "max_time": 1.0,
                "min_time": 5e-06,
                "warmup": false
            },
            "stats": {
                "min": 0.28784477700000366,
                "max": 0.5071627940000099,
                "mean": 0.33363583540000263,
                "stddev": 0.09701871615251344,
                "rounds": 5,
                "median": 0.2914579790000005,
                "iqr": 0.05667814249999026,
                "q1": 0.28917948525000625,
                "q3": 0.3458576277499965,
                "iqr_outliers": 1,
                "stddev_outliers": 1,
                "outliers": "1;1",
                "ld15iqr": 0.28784477700000366,
                "hd15iqr": 0.5071627940000099,
                "ops": 2.9972799498623406,
                "total": 1.6681791770000132,
                "iterations": 1
            }
        },
        {
            "group": null,
            "name": "test_02_pdh_lock",
            "fullname": "tests/benchmarks/test_benchmarks.py::test_02_pdh_lock",
            "params": null,
            "param": null,
            "extra_info": {},
            "options": {
                "disable_gc": false,
                "timer": "perf_counter",
                "min_rounds": 5,
                "max_time": 1.0,
                "min_time": 5e-06,
                "warmup": false
            },
            "stats": {
                "min": 1.3070371860000023,
                "max": 1.6678973949999971,
                "mean": 1.4410053992000003,
                "stddev": 0.1708612255923219,
                "rounds": 5,
                "median": 1.3256153140000038,
                "iqr": 0.28515600850000666,
                "q1": 1.3184677312499957,
                "q3": 1.6036237397500024,
                "iqr_outliers": 0,
                "stddev_outliers": 1,
                "outliers": "1;0",
                "ld15iqr": 1.3070371860000023,
                "hd15iqr": 1.6678973949999971,
                "ops": 0.6939599258650716,
                "total": 7.205026996000001,
                "iterations": 1
            }
        },
        {
            "group": null,
            "name": "test_03_near_unstable",
            "fullname": "tests/benchmarks/test_benchmarks.py::test_03_near_unstable",
            "params": null,
            "param": null,
            "extra_info": {},
            "options": {
                "disable_gc": false,
                "timer": "perf_counter",
                "min_rounds": 5,
                "max_time": 1.0,
                "min_time": 5e-06,
                "warmup": false
            },
            "stats": {
                "min": 1.9099999803984247e-06,
                "max": 3.130000001760891e-05,
                "mean": 2.062856902038702e-06,
                "stddev": 7.147504592323813e-07,
                "rounds": 69980,
                "median": 2.000000023372195e-06,
                "iqr": 6.00000475969864e-08,
                "q1": 1.9799999790848233e-06,
                "q3": 2.0400000266818097e-06,
                "iqr_outliers": 1386,
                "stddev_outliers": 559,
                "outliers": "559;1386",
                "ld15iqr": 1.9099999803984247e-06,
                "hd15iqr": 2.130999973815051e-06,
                "ops": 484764.59952782444,
                "total": 0.14435872600466837,
                "iterations": 1
            }
        },
        {
            "group": null,
            "name": "test_04_geometrical_params",
            "fullname": "tests/benchmarks/test_benchmarks.py::test_04_geometrical_params",
            "params": null,
            "param": null,
            "extra_info": {},
            "options": {
                "disable_gc": false,
                "timer": "perf_counter",
                "min_rounds": 5,
                "max_time": 1.0,
                "min_time": 5e-06,
                "warmup": false
            },
            "stats": {
                "min": 0.4879990750000047,
                "max": 0.499951660999983,
                "mean": 0.49650338680000916,
                "stddev": 0.0048903064906325264,
                "rounds": 5,
                "median": 0.4983556590000262,
                "iqr": 0.004789242249998438,
                "q1": 0.49467817300001116,
                "q3": 0.4994674152500096,
                "iqr_outliers": 0,
                "stddev_outliers": 1,
                "outliers": "1;0",
                "ld15iqr": 0.4879990750000047,
                "hd15iqr": 0.499951660999983,
                "ops": 2.0140849520585418,
                "total": 2.4825169340000457,
                "iterations": 1
            }
        },
        {
            "group": null,
            "name": "test_05_modulation",
            "fullname": "tests/benchmarks/test_benchmarks.py::test_05_modulation",
            "params": null,
            "param": null,
            "extra_info": {},
            "options": {
                "disable_gc": false,
                "timer": "perf_counter",
                "min_rounds": 5,
                "max_time": 1.0,
                "min_time": 5e-06,
                "warmup": false
            },
            "stats": {
                "min": 0.13207091799998238,
                "max": 0.15036279599999602,
                "mean": 0.1372447807142854,
                "stddev": 0.0070919404779877125,
                "rounds": 7,
                "median": 0.13402436900000225,
                "iqr": 0.009031083500005366,
                "q1": 0.1325428792500034,
                "q3": 0.14157396275000877,
                "iqr_outliers": 0,
                "stddev_outliers": 1,
                "outliers": "1;0",
                "ld15iqr": 0.13207091799998238,
                "hd15iqr": 0.15036279599999602,
                "ops": 7.286251577623112,
                "total": 0.9607134649999978,
                "iterations": 1
            }
        },
        {
            "group": null,
            "name": "test_06_radiation_pressure",
            "fullname": "tests/benchmarks/test_benchmarks.py::test_06_radiation_pressure",
            "params": null,
            "param": null,
            "extra_info": {},
            "options": {
                "disable_gc": false,
                "timer": "perf_counter",
                "min_rounds": 5,
                "max_time": 1.0,
                "min_time": 5e-06,
                "warmup": false
            },
            "stats": {
                "min": 0.26122912499999984,
                "max": 0.2735593809999841,
                "mean": 0.2672073277999914,
                "stddev": 0.004576263014010937,
                "rounds": 5,
                "median": 0.2679764979999959,
                "iqr": 0.0057734597499958795,
                "q1": 0.26393869649999147,
                "q3": 0.26971215624998734,
                "iqr_outliers": 0,
                "stddev_outliers": 2,
                "outliers": "2;0",
                "ld15iqr": 0.26122912499999984,
                "hd15iqr": 0.2735593809999841,
                "ops": 3.742412336642634,
                "total": 1.336036638999957,
                "iterations": 1
            }
        },
        {
            "group": null,
            "name": "test_07_homodyne",
            "fullname": "tests/benchmarks/test_benchmarks.py::test_07_homodyne",
            "params": null,
            "param": null,
            "extra_info": {},
            "options": {
                "disable_gc": false,
                "timer": "perf_counter",
                "min_rounds": 5,
                "max_time": 1.0,
                "min_time": 5e-06,
                "warmup": false
            },
            "stats": {
                "min": 0.09162853000000837,
                "max": 0.7319349530000068,
                "mean": 0.15800575769999625,
                "stddev": 0.20167101542605834,
                "rounds": 10,
                "median": 0.09391937149999308,
                "iqr": 0.004808913000005077,
                "q1": 0.09221310999998877,
                "q3": 0.09702202299999385,
                "iqr_outliers": 1,
                "stddev_outliers": 1,
                "outliers": "1;1",
                "ld15iqr": 0.09162853000000837,
                "hd15iqr": 0.7319349530000068,
                "ops": 6.32888329233349,
                "total": 1.5800575769999625,
                "iterations": 1
            }
        },
        {
            "group": null,
            "name": "test_08_optical_spring",
            "fullname": "tests/benchmarks/test_benchmarks.py::test_08_optical_spring",
            "params": null,
            "param": null,
            "extra_info": {},
            "options": {
                "disable_gc": false,
                "timer": "perf_counter",
                "min_rounds": 5,
                "max_time": 1.0,
                "min_time": 5e-06,
                "warmup": false
            },
            "stats": {
                "min": 0.24747448900001245,
                "max": 0.2621662459999925,
                "mean": 0.2547363904000065,
                "stddev": 0.00586091927483513,
                "rounds": 5,
                "median": 0.25511474300000714,
                "iqr": 0.009401599749992329,
                "q1": 0.24985171975001208,
                "q3": 0.2592533195000044,
                "iqr_outliers": 0,
                "stddev_outliers": 2,
                "outliers": "2;0",
                "ld15iqr": 0.24747448900001245,
                "hd15iqr": 0.2621662459999925,
                "ops": 3.925626795722919,
                "total": 1.2736819520000324,
                "iterations": 1
            }
        },
        {
            "group": null,
            "name": "test_09_aligo_sensitivity",
            "fullname": "tests/benchmarks/test_benchmarks.py::test_09_aligo_sensitivity",
            "params": null,
            "param": null,
            "extra_info": {},
            "options": {
                "disable_gc": false,
                "timer": "perf_counter",
                "min_rounds": 5,
                "max_time": 1.0,
                "min_time": 5e-06,
                "warmup": false
            },
            "stats": {
                "min": 0.2763708909999991,
                "max": 0.28464997400001835,
                "mean": 0.2796489804000032,
                "stddev": 0.003366252429563067,
                "rounds": 5,
                "median": 0.27932903900000383,
                "iqr": 0.005159242750004012,
                "q1": 0.2767586109999982,
                "q3": 0.2819178537500022,
                "iqr_outliers": 0,
                "stddev_outliers": 1,
                "outliers": "1;0",
                "ld15iqr": 0.2763708909999991,
                "hd15iqr": 0.28464997400001835,
                "ops": 3.57591148220753,
                "total": 1.398244902000016,
                "iterations": 1
            }
        },
        {
            "group": null,
            "name": "test_10_shifted_beam",
            "fullname": "tests/benchmarks/test_benchmarks.py::test_10_shifted_beam",
            "params": null,
            "param": null,
            "extra_info": {},
            "options": {
                "disable_gc": false,
                "timer": "perf_counter",
                "min_rounds": 5,
                "max_time": 1.0,
                "min_time": 5e-06,
                "warmup": false
            },
            "stats": {
                "min": 0.7645893219999778,
                "max": 0.7815737770000055,
                "mean": 0.773396354199997,
                "stddev": 0.0075676959252922,
                "rounds": 5,
                "median": 0.7701203379999981,
                "iqr": 0.012881658750025338,
                "q1": 0.7683414332499865,
                "q3": 0.7812230920000118,
                "iqr_outliers": 0,
                "stddev_outliers": 3,
                "outliers": "3;0",
                "ld15iqr": 0.7645893219999778,
                "hd15iqr": 0.7815737770000055,
                "ops": 1.2929980786299444,
                "total": 3.8669817709999847,
                "iterations": 1
            }
        },
        {
            "group": null,
            "name": "test_angular_radiation_pressure",
            "fullname": "tests/benchmarks/test_benchmarks.py::test_angular_radiation_pressure",
            "params": null,
            "param": null,
            "extra_info": {},
            "options": {
                "disable_gc": false,
                "timer": "perf_counter",
                "min_rounds": 5,
                "max_time": 1.0,
                "min_time": 5e-06,
                "warmup": false
            },
            "stats": {
                "min": 0.3253613069999801,
                "max": 0.33272236999999905,
                "mean": 0.32999877919999676,
                "stddev": 0.0029797842835741755,
                "rounds": 5,
                "median": 0.33111467200001243,
                "iqr": 0.004218783500014922,
                "q1": 0.327949397999987,
                "q3": 0.33216818150000194,
                "iqr_outliers": 0,
                "stddev_outliers": 1,
                "outliers": "1;0",
                "ld15iqr": 0.3253613069999801,
                "hd15iqr": 0.33272236999999905,
                "ops": 3.0303142406291963,
                "total": 1.6499938959999838,
                "iterations": 1
            }
        },
        {
            "group": null,
            "name": "test_cavity_eigenmodes",
            "fullname": "tests/benchmarks/test_benchmarks.py::test_cavity_eigenmodes",
            "params": null,
            "param": null,
            "extra_info": {},
            "options": {
                "disable_gc": false,
                "timer": "perf_counter",
                "min_rounds": 5,
                "max_time": 1.0,
                "min_time": 5e-06,
                "warmup": false
            },
            "stats": {
                "min": 0.2909969579999938,
                "max": 1.2540812809999977,
                "mean": 0.4861792825999999,
                "stddev": 0.42928175443446087,
                "rounds": 5,
                "median": 0.2936758860000168,
                "iqr": 0.24573621125002632,
                "q1": 0.2923200322499824,
                "q3": 0.5380562435000087,
                "iqr_outliers": 1,
                "stddev_outliers": 1,
                "outliers": "1;1",
                "ld15iqr": 0.2909969579999938,
                "hd15iqr": 1.2540812809999977,
                "ops": 2.0568544069837342,
                "total": 2.4308964129999993,
                "iterations": 1
            }
        },
        {
            "group": null,
            "name": "test_coupled_cavity_commands",
            "fullname": "tests/benchmarks/test_benchmarks.py::test_coupled_cavity_commands",
            "params": null,
            "param": null,
            "extra_info": {},
            "options": {
                "disable_gc": false,
                "timer": "perf_counter",
                "min_rounds": 5,
                "max_time": 1.0,
                "min_time": 5e-06,
                "warmup": false
            },
            "stats": {
                "min": 5.955790670999988,
                "max": 7.058258800000004,
                "mean": 6.187040521399996,
                "stddev": 0.4871530168922557,
                "rounds": 5,
                "median": 5.978147440999976,
                "iqr": 0.2915328880000132,
                "q1": 5.9596168754999965,
                "q3": 6.25114976350001,
                "iqr_outliers": 1,
                "stddev_outliers": 1,
                "outliers": "1;1",
                "ld15iqr": 5.955790670999988,
                "hd15iqr": 7.058258800000004,
                "ops": 0.1616281639890927,
                "total": 30.93520260699998,
                "iterations": 1
            }
        },
        {
            "group": null,
            "name": "test_frequency_dependant_squeezing",
            "fullname": "tests/benchmarks/test_benchmarks.py::test_frequency_dependant_squeezing",
            "params": null,
            "param": null,
            "extra_info": {},
            "options": {
                "disable_gc": false,
                "timer": "perf_counter",
                "min_rounds": 5,
                "max_time": 1.0,
                "min_time": 5e-06,
                "warmup": false
            },
            "stats": {
                "min": 1.6588688349999927,
                "max": 1.7148233389999916,
                "mean": 1.6831249451999952,
                "stddev": 0.020446854450063702,
                "rounds": 5,
                "median": 1.6789783680000028,
                "iqr": 0.021962888499984956,
                "q1": 1.6718378965000014,
                "q3": 1.6938007849999863,
                "iqr_outliers": 0,
                "stddev_outliers": 2,
                "outliers": "2;0",
                "ld15iqr": 1.6588688349999927,
                "hd15iqr": 1.7148233389999916,
                "ops": 0.5941329565887792,
                "total": 8.415624725999976,
                "iterations": 1
            }
        },
        {
            "group": null,
            "name": "test_lock_actions",
            "fullname": "tests/benchmarks/test_benchmarks.py::test_lock_actions",
            "params": null,
            "param": null,
            "extra_info": {},
            "options": {
                "disable_gc": false,
                "timer": "perf_counter",
                "min_rounds": 5,
                "max_time": 1.0,
                "min_time": 5e-06,
                "warmup": false
            },
            "stats": {
                "min": 3.1382376960000045,
                "max": 3.1713571619999925,
                "mean": 3.153614257200002,
                "stddev": 0.013517565397207174,
                "rounds": 5,
                "median": 3.148341801000015,
                "iqr": 0.021167103750016736,
                "q1": 3.14441629049999,
                "q3": 3.1655833942500067,
                "iqr_outliers": 0,
                "stddev_outliers": 2,
                "outliers": "2;0",
                "ld15iqr": 3.1382376960000045,
                "hd15iqr": 3.1713571619999925,
                "ops": 0.3170964862671155,
                "total": 15.768071286000009,
                "iterations": 1
            }
        }
    ],
    "datetime": "2024-11-18T08:08:35.277135+00:00",
    "version": "5.1.0"
}