{
    "machine_info": {
        "node": "runner-ns46nmmj-project-39604133-concurrent-0",
        "processor": "",
        "machine": "x86_64",
        "python_compiler": "GCC 12.2.0",
        "python_implementation": "CPython",
        "python_implementation_version": "3.12.5",
        "python_version": "3.12.5",
        "python_build": [
            "main",
            "Sep  5 2024 00:16:34"
        ],
        "release": "5.15.154+",
        "system": "Linux",
        "cpu": {
            "python_version": "3.12.5.final.0 (64 bit)",
            "cpuinfo_version": [
                9,
                0,
                0
            ],
            "cpuinfo_version_string": "9.0.0",
            "arch": "X86_64",
            "bits": 64,
            "count": 2,
            "arch_string_raw": "x86_64",
            "vendor_id_raw": "AuthenticAMD",
            "brand_raw": "AMD EPYC 7B13",
            "hz_advertised_friendly": "2.4500 GHz",
            "hz_actual_friendly": "2.4500 GHz",
            "hz_advertised": [
                2449998000,
                0
            ],
            "hz_actual": [
                2449998000,
                0
            ],
            "model": 1,
            "family": 25,
            "flags": [
                "3dnowext",
                "3dnowprefetch",
                "abm",
                "adx",
                "aes",
                "apic",
                "arat",
                "avx",
                "avx2",
                "bmi1",
                "bmi2",
                "clflush",
                "clflushopt",
                "clwb",
                "clzero",
                "cmov",
                "cmp_legacy",
                "constant_tsc",
                "cpuid",
                "cr8_legacy",
                "cx16",
                "cx8",
                "de",
                "erms",
                "extd_apicid",
                "f16c",
                "fma",
                "fpu",
                "fsgsbase",
                "fsrm",
                "fxsr",
                "fxsr_opt",
                "ht",
                "hypervisor",
                "ibpb",
                "ibrs",
                "invpcid",
                "invpcid_single",
                "lahf_lm",
                "lm",
                "mca",
                "mce",
                "misalignsse",
                "mmx",
                "mmxext",
                "movbe",
                "msr",
                "mtrr",
                "nonstop_tsc",
                "nopl",
                "npt",
                "nrip_save",
                "nx",
                "osvw",
                "osxsave",
                "pae",
                "pat",
                "pcid",
                "pclmulqdq",
                "pdpe1gb",
                "pge",
                "pni",
                "popcnt",
                "pse",
                "pse36",
                "rdpid",
                "rdrand",
                "rdrnd",
                "rdseed",
                "rdtscp",
                "rep_good",
                "sep",
                "sha",
                "sha_ni",
                "smap",
                "smep",
                "ssbd",
                "sse",
                "sse2",
                "sse4_1",
                "sse4_2",
                "sse4a",
                "ssse3",
                "stibp",
                "syscall",
                "topoext",
                "tsc",
                "tsc_adjust",
                "tsc_known_freq",
                "umip",
                "vaes",
                "vme",
                "vmmcall",
                "vpclmulqdq",
                "x2apic",
                "xgetbv1",
                "xsave",
                "xsavec",
                "xsaveerptr",
                "xsaveopt"
            ],
            "l3_cache_size": 524288,
            "l2_cache_size": 524288,
            "l1_data_cache_size": 32768,
            "l1_instruction_cache_size": 32768,
            "l2_cache_line_size": 512,
            "l2_cache_associativity": 6
        }
    },
    "commit_info": {
        "id": "d4abfda0c45e119a939a03568cd8f7d628e78c23",
        "time": "2024-09-05T17:22:11+02:00",
        "author_time": "2024-09-05T17:22:11+02:00",
        "dirty": false,
        "project": "finesse3",
        "branch": "(detached head)"
    },
    "benchmarks": [
        {
            "group": null,
            "name": "test_01_simple_cav",
            "fullname": "tests/benchmarks/test_benchmarks.py::test_01_simple_cav",
            "params": null,
            "param": null,
            "extra_info": {},
            "options": {
                "disable_gc": false,
                "timer": "perf_counter",
                "min_rounds": 5,
                "max_time": 1.0,
                "min_time": 5e-06,
                "warmup": false
            },
            "stats": {
                "min": 0.28556654999999864,
                "max": 0.5097667039999862,
                "mean": 0.3365934436000032,
                "stddev": 0.0969312523437274,
                "rounds": 5,
                "median": 0.29752599100001476,
                "iqr": 0.05981947174998936,
                "q1": 0.29079741075000953,
                "q3": 0.3506168824999989,
                "iqr_outliers": 1,
                "stddev_outliers": 1,
                "outliers": "1;1",
                "ld15iqr": 0.28556654999999864,
                "hd15iqr": 0.5097667039999862,
                "ops": 2.9709431927865113,
                "total": 1.682967218000016,
                "iterations": 1
            }
        },
        {
            "group": null,
            "name": "test_02_pdh_lock",
            "fullname": "tests/benchmarks/test_benchmarks.py::test_02_pdh_lock",
            "params": null,
            "param": null,
            "extra_info": {},
            "options": {
                "disable_gc": false,
                "timer": "perf_counter",
                "min_rounds": 5,
                "max_time": 1.0,
                "min_time": 5e-06,
                "warmup": false
            },
            "stats": {
                "min": 1.288721814000013,
                "max": 1.6547354719999987,
                "mean": 1.381601720000009,
                "stddev": 0.15348558457623734,
                "rounds": 5,
                "median": 1.3185640179999893,
                "iqr": 0.1048783009999994,
                "q1": 1.3077382462500182,
                "q3": 1.4126165472500176,
                "iqr_outliers": 1,
                "stddev_outliers": 1,
                "outliers": "1;1",
                "ld15iqr": 1.288721814000013,
                "hd15iqr": 1.6547354719999987,
                "ops": 0.7237975934193203,
                "total": 6.908008600000045,
                "iterations": 1
            }
        },
        {
            "group": null,
            "name": "test_03_near_unstable",
            "fullname": "tests/benchmarks/test_benchmarks.py::test_03_near_unstable",
            "params": null,
            "param": null,
            "extra_info": {},
            "options": {
                "disable_gc": false,
                "timer": "perf_counter",
                "min_rounds": 5,
                "max_time": 1.0,
                "min_time": 5e-06,
                "warmup": false
            },
            "stats": {
                "min": 1.8100000147569517e-06,
                "max": 8.954000000471751e-05,
                "mean": 1.9929804056653048e-06,
                "stddev": 8.097972897297518e-07,
                "rounds": 55067,
                "median": 1.929999996264087e-06,
                "iqr": 7.999997819752025e-08,
                "q1": 1.8900000213761814e-06,
                "q3": 1.9699999995737016e-06,
                "iqr_outliers": 2077,
                "stddev_outliers": 883,
                "outliers": "883;2077",
                "ld15iqr": 1.8100000147569517e-06,
                "hd15iqr": 2.0899999810808367e-06,
                "ops": 501761.07961592125,
                "total": 0.10974745199877134,
                "iterations": 1
            }
        },
        {
            "group": null,
            "name": "test_04_geometrical_params",
            "fullname": "tests/benchmarks/test_benchmarks.py::test_04_geometrical_params",
            "params": null,
            "param": null,
            "extra_info": {},
            "options": {
                "disable_gc": false,
                "timer": "perf_counter",
                "min_rounds": 5,
                "max_time": 1.0,
                "min_time": 5e-06,
                "warmup": false
            },
            "stats": {
                "min": 0.47964308999999616,
                "max": 0.8599175189999926,
                "mean": 0.5713378053999975,
                "stddev": 0.16174757177590768,
                "rounds": 5,
                "median": 0.5060476619999861,
                "iqr": 0.10190392125001324,
                "q1": 0.4956483989999967,
                "q3": 0.5975523202500099,
                "iqr_outliers": 1,
                "stddev_outliers": 1,
                "outliers": "1;1",
                "ld15iqr": 0.47964308999999616,
                "hd15iqr": 0.8599175189999926,
                "ops": 1.7502780151225827,
                "total": 2.8566890269999874,
                "iterations": 1
            }
        },
        {
            "group": null,
            "name": "test_05_modulation",
            "fullname": "tests/benchmarks/test_benchmarks.py::test_05_modulation",
            "params": null,
            "param": null,
            "extra_info": {},
            "options": {
                "disable_gc": false,
                "timer": "perf_counter",
                "min_rounds": 5,
                "max_time": 1.0,
                "min_time": 5e-06,
                "warmup": false
            },
            "stats": {
                "min": 0.12581928299999845,
                "max": 0.13541980400000853,
                "mean": 0.13184619125000197,
                "stddev": 0.0035255527847255544,
                "rounds": 8,
                "median": 0.13261613850001197,
                "iqr": 0.005545795000003295,
                "q1": 0.12930164399999455,
                "q3": 0.13484743899999785,
                "iqr_outliers": 0,
                "stddev_outliers": 3,
                "outliers": "3;0",
                "ld15iqr": 0.12581928299999845,
                "hd15iqr": 0.13541980400000853,
                "ops": 7.584595281207906,
                "total": 1.0547695300000157,
                "iterations": 1
            }
        },
        {
            "group": null,
            "name": "test_06_radiation_pressure",
            "fullname": "tests/benchmarks/test_benchmarks.py::test_06_radiation_pressure",
            "params": null,
            "param": null,
            "extra_info": {},
            "options": {
                "disable_gc": false,
                "timer": "perf_counter",
                "min_rounds": 5,
                "max_time": 1.0,
                "min_time": 5e-06,
                "warmup": false
            },
            "stats": {
                "min": 0.24899703500000214,
                "max": 0.8591525690000026,
                "mean": 0.37611779480000107,
                "stddev": 0.2700772480946235,
                "rounds": 5,
                "median": 0.2604538669999954,
                "iqr": 0.15976406174999624,
                "q1": 0.25063123325000447,
                "q3": 0.4103952950000007,
                "iqr_outliers": 1,
                "stddev_outliers": 1,
                "outliers": "1;1",
                "ld15iqr": 0.24899703500000214,
                "hd15iqr": 0.8591525690000026,
                "ops": 2.6587415267914816,
                "total": 1.8805889740000055,
                "iterations": 1
            }
        },
        {
            "group": null,
            "name": "test_07_homodyne",
            "fullname": "tests/benchmarks/test_benchmarks.py::test_07_homodyne",
            "params": null,
            "param": null,
            "extra_info": {},
            "options": {
                "disable_gc": false,
                "timer": "perf_counter",
                "min_rounds": 5,
                "max_time": 1.0,
                "min_time": 5e-06,
                "warmup": false
            },
            "stats": {
                "min": 0.08957992000000559,
                "max": 0.0957513390000031,
                "mean": 0.09243804699999911,
                "stddev": 0.0019078088190358157,
                "rounds": 11,
                "median": 0.09204655899998215,
                "iqr": 0.002941065250013253,
                "q1": 0.0910015997499869,
                "q3": 0.09394266500000015,
                "iqr_outliers": 0,
                "stddev_outliers": 4,
                "outliers": "4;0",
                "ld15iqr": 0.08957992000000559,
                "hd15iqr": 0.0957513390000031,
                "ops": 10.818056335612647,
                "total": 1.0168185169999902,
                "iterations": 1
            }
        },
        {
            "group": null,
            "name": "test_08_optical_spring",
            "fullname": "tests/benchmarks/test_benchmarks.py::test_08_optical_spring",
            "params": null,
            "param": null,
            "extra_info": {},
            "options": {
                "disable_gc": false,
                "timer": "perf_counter",
                "min_rounds": 5,
                "max_time": 1.0,
                "min_time": 5e-06,
                "warmup": false
            },
            "stats": {
                "min": 0.2357663440000124,
                "max": 0.9251507660000016,
                "mean": 0.3791736012000058,
                "stddev": 0.30524816322686865,
                "rounds": 5,
                "median": 0.24517929600000343,
                "iqr": 0.1779743830000129,
                "q1": 0.23979179724999966,
                "q3": 0.41776618025001255,
                "iqr_outliers": 1,
                "stddev_outliers": 1,
                "outliers": "1;1",
                "ld15iqr": 0.2357663440000124,
                "hd15iqr": 0.9251507660000016,
                "ops": 2.6373144038382614,
                "total": 1.895868006000029,
                "iterations": 1
            }
        },
        {
            "group": null,
            "name": "test_09_aligo_sensitivity",
            "fullname": "tests/benchmarks/test_benchmarks.py::test_09_aligo_sensitivity",
            "params": null,
            "param": null,
            "extra_info": {},
            "options": {
                "disable_gc": false,
                "timer": "perf_counter",
                "min_rounds": 5,
                "max_time": 1.0,
                "min_time": 5e-06,
                "warmup": false
            },
            "stats": {
                "min": 0.25733697699999425,
                "max": 0.2777646589999847,
                "mean": 0.26738465980000115,
                "stddev": 0.007646296686704914,
                "rounds": 5,
                "median": 0.26920595799998637,
                "iqr": 0.00979390375000122,
                "q1": 0.2617216420000119,
                "q3": 0.27151554575001313,
                "iqr_outliers": 0,
                "stddev_outliers": 2,
                "outliers": "2;0",
                "ld15iqr": 0.25733697699999425,
                "hd15iqr": 0.2777646589999847,
                "ops": 3.73993033387922,
                "total": 1.3369232990000057,
                "iterations": 1
            }
        },
        {
            "group": null,
            "name": "test_10_shifted_beam",
            "fullname": "tests/benchmarks/test_benchmarks.py::test_10_shifted_beam",
            "params": null,
            "param": null,
            "extra_info": {},
            "options": {
                "disable_gc": false,
                "timer": "perf_counter",
                "min_rounds": 5,
                "max_time": 1.0,
                "min_time": 5e-06,
                "warmup": false
            },
            "stats": {
                "min": 0.7503255880000097,
                "max": 1.5925829059999899,
                "mean": 0.9277944006000041,
                "stddev": 0.37169030244167456,
                "rounds": 5,
                "median": 0.7660420800000054,
                "iqr": 0.21466089774999375,
                "q1": 0.7592911487500089,
                "q3": 0.9739520465000027,
                "iqr_outliers": 1,
                "stddev_outliers": 1,
                "outliers": "1;1",
                "ld15iqr": 0.7503255880000097,
                "hd15iqr": 1.5925829059999899,
                "ops": 1.0778250001867877,
                "total": 4.6389720030000205,
                "iterations": 1
            }
        },
        {
            "group": null,
            "name": "test_angular_radiation_pressure",
            "fullname": "tests/benchmarks/test_benchmarks.py::test_angular_radiation_pressure",
            "params": null,
            "param": null,
            "extra_info": {},
            "options": {
                "disable_gc": false,
                "timer": "perf_counter",
                "min_rounds": 5,
                "max_time": 1.0,
                "min_time": 5e-06,
                "warmup": false
            },
            "stats": {
                "min": 0.30407470099999045,
                "max": 0.3163526929999989,
                "mean": 0.30963942180000004,
                "stddev": 0.005391905169046713,
                "rounds": 5,
                "median": 0.3071858410000061,
                "iqr": 0.009197950500016816,
                "q1": 0.305673401749992,
                "q3": 0.31487135225000884,
                "iqr_outliers": 0,
                "stddev_outliers": 2,
                "outliers": "2;0",
                "ld15iqr": 0.30407470099999045,
                "hd15iqr": 0.3163526929999989,
                "ops": 3.22956293545178,
                "total": 1.5481971090000002,
                "iterations": 1
            }
        },
        {
            "group": null,
            "name": "test_cavity_eigenmodes",
            "fullname": "tests/benchmarks/test_benchmarks.py::test_cavity_eigenmodes",
            "params": null,
            "param": null,
            "extra_info": {},
            "options": {
                "disable_gc": false,
                "timer": "perf_counter",
                "min_rounds": 5,
                "max_time": 1.0,
                "min_time": 5e-06,
                "warmup": false
            },
            "stats": {
                "min": 0.2796991090000063,
                "max": 0.29314690100000007,
                "mean": 0.2875656040000024,
                "stddev": 0.005299132888149684,
                "rounds": 5,
                "median": 0.2898446700000079,
                "iqr": 0.007344222999975614,
                "q1": 0.28361014225001213,
                "q3": 0.29095436524998775,
                "iqr_outliers": 0,
                "stddev_outliers": 2,
                "outliers": "2;0",
                "ld15iqr": 0.2796991090000063,
                "hd15iqr": 0.29314690100000007,
                "ops": 3.477467353849425,
                "total": 1.437828020000012,
                "iterations": 1
            }
        },
        {
            "group": null,
            "name": "test_coupled_cavity_commands",
            "fullname": "tests/benchmarks/test_benchmarks.py::test_coupled_cavity_commands",
            "params": null,
            "param": null,
            "extra_info": {},
            "options": {
                "disable_gc": false,
                "timer": "perf_counter",
                "min_rounds": 5,
                "max_time": 1.0,
                "min_time": 5e-06,
                "warmup": false
            },
            "stats": {
                "min": 6.2526187310000125,
                "max": 7.4883794259999945,
                "mean": 6.5552273079999965,
                "stddev": 0.5248717252667291,
                "rounds": 5,
                "median": 6.355928036999984,
                "iqr": 0.39711208324998637,
                "q1": 6.273772607750004,
                "q3": 6.670884690999991,
                "iqr_outliers": 1,
                "stddev_outliers": 1,
                "outliers": "1;1",
                "ld15iqr": 6.2526187310000125,
                "hd15iqr": 7.4883794259999945,
                "ops": 0.15255001131381066,
                "total": 32.77613653999998,
                "iterations": 1
            }
        },
        {
            "group": null,
            "name": "test_frequency_dependant_squeezing",
            "fullname": "tests/benchmarks/test_benchmarks.py::test_frequency_dependant_squeezing",
            "params": null,
            "param": null,
            "extra_info": {},
            "options": {
                "disable_gc": false,
                "timer": "perf_counter",
                "min_rounds": 5,
                "max_time": 1.0,
                "min_time": 5e-06,
                "warmup": false
            },
            "stats": {
                "min": 1.5789921599999843,
                "max": 1.609372546000003,
                "mean": 1.595575069599994,
                "stddev": 0.013516883010696012,
                "rounds": 5,
                "median": 1.6021145370000056,
                "iqr": 0.023170927750001624,
                "q1": 1.5822336637499888,
                "q3": 1.6054045914999904,
                "iqr_outliers": 0,
                "stddev_outliers": 2,
                "outliers": "2;0",
                "ld15iqr": 1.5789921599999843,
                "hd15iqr": 1.609372546000003,
                "ops": 0.6267332819700531,
                "total": 7.977875347999969,
                "iterations": 1
            }
        },
        {
            "group": null,
            "name": "test_lock_actions",
            "fullname": "tests/benchmarks/test_benchmarks.py::test_lock_actions",
            "params": null,
            "param": null,
            "extra_info": {},
            "options": {
                "disable_gc": false,
                "timer": "perf_counter",
                "min_rounds": 5,
                "max_time": 1.0,
                "min_time": 5e-06,
                "warmup": false
            },
            "stats": {
                "min": 3.1385535069999833,
                "max": 3.200983291,
                "mean": 3.170038854199987,
                "stddev": 0.028595718230228585,
                "rounds": 5,
                "median": 3.175789920999989,
                "iqr": 0.05348545350002354,
                "q1": 3.1412747049999723,
                "q3": 3.194760158499996,
                "iqr_outliers": 0,
                "stddev_outliers": 2,
                "outliers": "2;0",
                "ld15iqr": 3.1385535069999833,
                "hd15iqr": 3.200983291,
                "ops": 0.3154535467838507,
                "total": 15.850194270999935,
                "iterations": 1
            }
        }
    ],
    "datetime": "2024-09-05T15:29:20.708046",
    "version": "4.0.0"
}