{
    "machine_info": {
        "node": "runner-jhcjxvh-project-39604133-concurrent-0",
        "processor": "",
        "machine": "x86_64",
        "python_compiler": "GCC 12.2.0",
        "python_implementation": "CPython",
        "python_implementation_version": "3.12.5",
        "python_version": "3.12.5",
        "python_build": [
            "main",
            "Sep  5 2024 00:16:34"
        ],
        "release": "5.15.154+",
        "system": "Linux",
        "cpu": {
            "python_version": "3.12.5.final.0 (64 bit)",
            "cpuinfo_version": [
                9,
                0,
                0
            ],
            "cpuinfo_version_string": "9.0.0",
            "arch": "X86_64",
            "bits": 64,
            "count": 2,
            "arch_string_raw": "x86_64",
            "vendor_id_raw": "AuthenticAMD",
            "brand_raw": "AMD EPYC 7B13",
            "hz_advertised_friendly": "2.4500 GHz",
            "hz_actual_friendly": "2.4500 GHz",
            "hz_advertised": [
                2449998000,
                0
            ],
            "hz_actual": [
                2449998000,
                0
            ],
            "model": 1,
            "family": 25,
            "flags": [
                "3dnowext",
                "3dnowprefetch",
                "abm",
                "adx",
                "aes",
                "apic",
                "arat",
                "avx",
                "avx2",
                "bmi1",
                "bmi2",
                "clflush",
                "clflushopt",
                "clwb",
                "clzero",
                "cmov",
                "cmp_legacy",
                "constant_tsc",
                "cpuid",
                "cr8_legacy",
                "cx16",
                "cx8",
                "de",
                "erms",
                "extd_apicid",
                "f16c",
                "fma",
                "fpu",
                "fsgsbase",
                "fsrm",
                "fxsr",
                "fxsr_opt",
                "ht",
                "hypervisor",
                "ibpb",
                "ibrs",
                "invpcid",
                "invpcid_single",
                "lahf_lm",
                "lm",
                "mca",
                "mce",
                "misalignsse",
                "mmx",
                "mmxext",
                "movbe",
                "msr",
                "mtrr",
                "nonstop_tsc",
                "nopl",
                "npt",
                "nrip_save",
                "nx",
                "osvw",
                "osxsave",
                "pae",
                "pat",
                "pcid",
                "pclmulqdq",
                "pdpe1gb",
                "pge",
                "pni",
                "popcnt",
                "pse",
                "pse36",
                "rdpid",
                "rdrand",
                "rdrnd",
                "rdseed",
                "rdtscp",
                "rep_good",
                "sep",
                "sha",
                "sha_ni",
                "smap",
                "smep",
                "ssbd",
                "sse",
                "sse2",
                "sse4_1",
                "sse4_2",
                "sse4a",
                "ssse3",
                "stibp",
                "syscall",
                "topoext",
                "tsc",
                "tsc_adjust",
                "tsc_known_freq",
                "umip",
                "vaes",
                "vme",
                "vmmcall",
                "vpclmulqdq",
                "x2apic",
                "xgetbv1",
                "xsave",
                "xsavec",
                "xsaveerptr",
                "xsaveopt"
            ],
            "l3_cache_size": 524288,
            "l2_cache_size": 524288,
            "l1_data_cache_size": 32768,
            "l1_instruction_cache_size": 32768,
            "l2_cache_line_size": 512,
            "l2_cache_associativity": 6
        }
    },
    "commit_info": {
        "id": "47df83c96ae590d46018aa0ecd23a0daf9802810",
        "time": "2024-09-06T09:07:30+00:00",
        "author_time": "2024-09-06T09:07:30+00:00",
        "dirty": false,
        "project": "finesse3",
        "branch": "(detached head)"
    },
    "benchmarks": [
        {
            "group": null,
            "name": "test_01_simple_cav",
            "fullname": "tests/benchmarks/test_benchmarks.py::test_01_simple_cav",
            "params": null,
            "param": null,
            "extra_info": {},
            "options": {
                "disable_gc": false,
                "timer": "perf_counter",
                "min_rounds": 5,
                "max_time": 1.0,
                "min_time": 5e-06,
                "warmup": false
            },
            "stats": {
                "min": 0.2603368890000013,
                "max": 0.4547221549999847,
                "mean": 0.3015646401999959,
                "stddev": 0.08564403633796855,
                "rounds": 5,
                "median": 0.2644904990000043,
                "iqr": 0.0512958965000081,
                "q1": 0.26183705399999013,
                "q3": 0.31313295049999823,
                "iqr_outliers": 1,
                "stddev_outliers": 1,
                "outliers": "1;1",
                "ld15iqr": 0.2603368890000013,
                "hd15iqr": 0.4547221549999847,
                "ops": 3.3160386421193344,
                "total": 1.5078232009999795,
                "iterations": 1
            }
        },
        {
            "group": null,
            "name": "test_02_pdh_lock",
            "fullname": "tests/benchmarks/test_benchmarks.py::test_02_pdh_lock",
            "params": null,
            "param": null,
            "extra_info": {},
            "options": {
                "disable_gc": false,
                "timer": "perf_counter",
                "min_rounds": 5,
                "max_time": 1.0,
                "min_time": 5e-06,
                "warmup": false
            },
            "stats": {
                "min": 1.1741968569999983,
                "max": 1.4595728050000218,
                "mean": 1.2826509568000006,
                "stddev": 0.1358895243914925,
                "rounds": 5,
                "median": 1.1974576650000017,
                "iqr": 0.23360228925000115,
                "q1": 1.1806803594999948,
                "q3": 1.414282648749996,
                "iqr_outliers": 0,
                "stddev_outliers": 1,
                "outliers": "1;0",
                "ld15iqr": 1.1741968569999983,
                "hd15iqr": 1.4595728050000218,
                "ops": 0.7796353284566462,
                "total": 6.413254784000003,
                "iterations": 1
            }
        },
        {
            "group": null,
            "name": "test_03_near_unstable",
            "fullname": "tests/benchmarks/test_benchmarks.py::test_03_near_unstable",
            "params": null,
            "param": null,
            "extra_info": {},
            "options": {
                "disable_gc": false,
                "timer": "perf_counter",
                "min_rounds": 5,
                "max_time": 1.0,
                "min_time": 5e-06,
                "warmup": false
            },
            "stats": {
                "min": 1.8300000022009044e-06,
                "max": 7.391999997707899e-05,
                "mean": 2.021767250208103e-06,
                "stddev": 5.854604170681638e-07,
                "rounds": 63695,
                "median": 1.9799999790848233e-06,
                "iqr": 9.000004297377018e-08,
                "q1": 1.9399999757752084e-06,
                "q3": 2.0300000187489786e-06,
                "iqr_outliers": 1272,
                "stddev_outliers": 616,
                "outliers": "616;1272",
                "ld15iqr": 1.8300000022009044e-06,
                "hd15iqr": 2.168999998275467e-06,
                "ops": 494616.7764351058,
                "total": 0.12877646500200512,
                "iterations": 1
            }
        },
        {
            "group": null,
            "name": "test_04_geometrical_params",
            "fullname": "tests/benchmarks/test_benchmarks.py::test_04_geometrical_params",
            "params": null,
            "param": null,
            "extra_info": {},
            "options": {
                "disable_gc": false,
                "timer": "perf_counter",
                "min_rounds": 5,
                "max_time": 1.0,
                "min_time": 5e-06,
                "warmup": false
            },
            "stats": {
                "min": 0.4494776639999998,
                "max": 0.8201939649999872,
                "mean": 0.5281045283999901,
                "stddev": 0.1633832124944863,
                "rounds": 5,
                "median": 0.45313876399998776,
                "iqr": 0.10138198450000147,
                "q1": 0.45216005474998866,
                "q3": 0.5535420392499901,
                "iqr_outliers": 1,
                "stddev_outliers": 1,
                "outliers": "1;1",
                "ld15iqr": 0.4494776639999998,
                "hd15iqr": 0.8201939649999872,
                "ops": 1.89356452410988,
                "total": 2.640522641999951,
                "iterations": 1
            }
        },
        {
            "group": null,
            "name": "test_05_modulation",
            "fullname": "tests/benchmarks/test_benchmarks.py::test_05_modulation",
            "params": null,
            "param": null,
            "extra_info": {},
            "options": {
                "disable_gc": false,
                "timer": "perf_counter",
                "min_rounds": 5,
                "max_time": 1.0,
                "min_time": 5e-06,
                "warmup": false
            },
            "stats": {
                "min": 0.11808866999999168,
                "max": 0.12268246000002136,
                "mean": 0.11957772944444717,
                "stddev": 0.001550254399066716,
                "rounds": 9,
                "median": 0.11891001099999698,
                "iqr": 0.002268348999997727,
                "q1": 0.11833109100000172,
                "q3": 0.12059943999999945,
                "iqr_outliers": 0,
                "stddev_outliers": 1,
                "outliers": "1;0",
                "ld15iqr": 0.11808866999999168,
                "hd15iqr": 0.12268246000002136,
                "ops": 8.362761231928017,
                "total": 1.0761995650000244,
                "iterations": 1
            }
        },
        {
            "group": null,
            "name": "test_06_radiation_pressure",
            "fullname": "tests/benchmarks/test_benchmarks.py::test_06_radiation_pressure",
            "params": null,
            "param": null,
            "extra_info": {},
            "options": {
                "disable_gc": false,
                "timer": "perf_counter",
                "min_rounds": 5,
                "max_time": 1.0,
                "min_time": 5e-06,
                "warmup": false
            },
            "stats": {
                "min": 0.23612438099999622,
                "max": 0.7706344900000204,
                "mean": 0.3471189946000095,
                "stddev": 0.2368142165920526,
                "rounds": 5,
                "median": 0.24050147100001595,
                "iqr": 0.14270970399999783,
                "q1": 0.23761549350000877,
                "q3": 0.3803251975000066,
                "iqr_outliers": 1,
                "stddev_outliers": 1,
                "outliers": "1;1",
                "ld15iqr": 0.23612438099999622,
                "hd15iqr": 0.7706344900000204,
                "ops": 2.880856465813158,
                "total": 1.7355949730000475,
                "iterations": 1
            }
        },
        {
            "group": null,
            "name": "test_07_homodyne",
            "fullname": "tests/benchmarks/test_benchmarks.py::test_07_homodyne",
            "params": null,
            "param": null,
            "extra_info": {},
            "options": {
                "disable_gc": false,
                "timer": "perf_counter",
                "min_rounds": 5,
                "max_time": 1.0,
                "min_time": 5e-06,
                "warmup": false
            },
            "stats": {
                "min": 0.0794206230000043,
                "max": 0.08474709300000427,
                "mean": 0.08131940599999865,
                "stddev": 0.0013662453909944992,
                "rounds": 12,
                "median": 0.0811388534999935,
                "iqr": 0.001163530499994181,
                "q1": 0.08053773849999857,
                "q3": 0.08170126899999275,
                "iqr_outliers": 1,
                "stddev_outliers": 2,
                "outliers": "2;1",
                "ld15iqr": 0.0794206230000043,
                "hd15iqr": 0.08474709300000427,
                "ops": 12.297187709413626,
                "total": 0.9758328719999838,
                "iterations": 1
            }
        },
        {
            "group": null,
            "name": "test_08_optical_spring",
            "fullname": "tests/benchmarks/test_benchmarks.py::test_08_optical_spring",
            "params": null,
            "param": null,
            "extra_info": {},
            "options": {
                "disable_gc": false,
                "timer": "perf_counter",
                "min_rounds": 5,
                "max_time": 1.0,
                "min_time": 5e-06,
                "warmup": false
            },
            "stats": {
                "min": 0.21679202300001066,
                "max": 0.763212880000026,
                "mean": 0.3269961884000054,
                "stddev": 0.24385456450547577,
                "rounds": 5,
                "median": 0.2181896429999881,
                "iqr": 0.13816082675000274,
                "q1": 0.21721509800000405,
                "q3": 0.3553759247500068,
                "iqr_outliers": 1,
                "stddev_outliers": 1,
                "outliers": "1;1",
                "ld15iqr": 0.21679202300001066,
                "hd15iqr": 0.763212880000026,
                "ops": 3.0581396220335377,
                "total": 1.634980942000027,
                "iterations": 1
            }
        },
        {
            "group": null,
            "name": "test_09_aligo_sensitivity",
            "fullname": "tests/benchmarks/test_benchmarks.py::test_09_aligo_sensitivity",
            "params": null,
            "param": null,
            "extra_info": {},
            "options": {
                "disable_gc": false,
                "timer": "perf_counter",
                "min_rounds": 5,
                "max_time": 1.0,
                "min_time": 5e-06,
                "warmup": false
            },
            "stats": {
                "min": 0.2420258520000118,
                "max": 0.26382227900001,
                "mean": 0.2481791064000049,
                "stddev": 0.008904842000561915,
                "rounds": 5,
                "median": 0.24498987999999144,
                "iqr": 0.007722221000022955,
                "q1": 0.2431414762499955,
                "q3": 0.25086369725001845,
                "iqr_outliers": 1,
                "stddev_outliers": 1,
                "outliers": "1;1",
                "ld15iqr": 0.2420258520000118,
                "hd15iqr": 0.26382227900001,
                "ops": 4.029348056351855,
                "total": 1.2408955320000246,
                "iterations": 1
            }
        },
        {
            "group": null,
            "name": "test_10_shifted_beam",
            "fullname": "tests/benchmarks/test_benchmarks.py::test_10_shifted_beam",
            "params": null,
            "param": null,
            "extra_info": {},
            "options": {
                "disable_gc": false,
                "timer": "perf_counter",
                "min_rounds": 5,
                "max_time": 1.0,
                "min_time": 5e-06,
                "warmup": false
            },
            "stats": {
                "min": 0.7051614549999954,
                "max": 1.345965863999993,
                "mean": 0.8369224980000013,
                "stddev": 0.28460843835530797,
                "rounds": 5,
                "median": 0.7105999240000074,
                "iqr": 0.16932162649999327,
                "q1": 0.7053120692500059,
                "q3": 0.8746336957499992,
                "iqr_outliers": 1,
                "stddev_outliers": 1,
                "outliers": "1;1",
                "ld15iqr": 0.7051614549999954,
                "hd15iqr": 1.345965863999993,
                "ops": 1.1948537676902056,
                "total": 4.184612490000006,
                "iterations": 1
            }
        },
        {
            "group": null,
            "name": "test_angular_radiation_pressure",
            "fullname": "tests/benchmarks/test_benchmarks.py::test_angular_radiation_pressure",
            "params": null,
            "param": null,
            "extra_info": {},
            "options": {
                "disable_gc": false,
                "timer": "perf_counter",
                "min_rounds": 5,
                "max_time": 1.0,
                "min_time": 5e-06,
                "warmup": false
            },
            "stats": {
                "min": 0.292019836999998,
                "max": 0.2988571360000094,
                "mean": 0.2950628468000048,
                "stddev": 0.002460601585288988,
                "rounds": 5,
                "median": 0.29493986700001074,
                "iqr": 0.0023360997500105896,
                "q1": 0.29375309449999776,
                "q3": 0.29608919425000835,
                "iqr_outliers": 0,
                "stddev_outliers": 2,
                "outliers": "2;0",
                "ld15iqr": 0.292019836999998,
                "hd15iqr": 0.2988571360000094,
                "ops": 3.389108492801215,
                "total": 1.4753142340000238,
                "iterations": 1
            }
        },
        {
            "group": null,
            "name": "test_cavity_eigenmodes",
            "fullname": "tests/benchmarks/test_benchmarks.py::test_cavity_eigenmodes",
            "params": null,
            "param": null,
            "extra_info": {},
            "options": {
                "disable_gc": false,
                "timer": "perf_counter",
                "min_rounds": 5,
                "max_time": 1.0,
                "min_time": 5e-06,
                "warmup": false
            },
            "stats": {
                "min": 0.24669879100000003,
                "max": 0.2566569100000038,
                "mean": 0.2512797244000069,
                "stddev": 0.004853078793578162,
                "rounds": 5,
                "median": 0.24967425100001606,
                "iqr": 0.00931456725000146,
                "q1": 0.24702543025000523,
                "q3": 0.2563399975000067,
                "iqr_outliers": 0,
                "stddev_outliers": 2,
                "outliers": "2;0",
                "ld15iqr": 0.24669879100000003,
                "hd15iqr": 0.2566569100000038,
                "ops": 3.9796286882586718,
                "total": 1.2563986220000345,
                "iterations": 1
            }
        },
        {
            "group": null,
            "name": "test_coupled_cavity_commands",
            "fullname": "tests/benchmarks/test_benchmarks.py::test_coupled_cavity_commands",
            "params": null,
            "param": null,
            "extra_info": {},
            "options": {
                "disable_gc": false,
                "timer": "perf_counter",
                "min_rounds": 5,
                "max_time": 1.0,
                "min_time": 5e-06,
                "warmup": false
            },
            "stats": {
                "min": 5.532603437000006,
                "max": 6.658234058999994,
                "mean": 5.979143701800001,
                "stddev": 0.5229005746605192,
                "rounds": 5,
                "median": 5.654633144000002,
                "iqr": 0.884775693249992,
                "q1": 5.600309791250005,
                "q3": 6.485085484499997,
                "iqr_outliers": 0,
                "stddev_outliers": 1,
                "outliers": "1;0",
                "ld15iqr": 5.532603437000006,
                "hd15iqr": 6.658234058999994,
                "ops": 0.1672480291281431,
                "total": 29.895718509000005,
                "iterations": 1
            }
        },
        {
            "group": null,
            "name": "test_frequency_dependant_squeezing",
            "fullname": "tests/benchmarks/test_benchmarks.py::test_frequency_dependant_squeezing",
            "params": null,
            "param": null,
            "extra_info": {},
            "options": {
                "disable_gc": false,
                "timer": "perf_counter",
                "min_rounds": 5,
                "max_time": 1.0,
                "min_time": 5e-06,
                "warmup": false
            },
            "stats": {
                "min": 1.4495974170000068,
                "max": 1.4879916830000184,
                "mean": 1.4681867098000112,
                "stddev": 0.013889955381978063,
                "rounds": 5,
                "median": 1.4657046070000206,
                "iqr": 0.015106030999987752,
                "q1": 1.461260562750013,
                "q3": 1.4763665937500008,
                "iqr_outliers": 0,
                "stddev_outliers": 2,
                "outliers": "2;0",
                "ld15iqr": 1.4495974170000068,
                "hd15iqr": 1.4879916830000184,
                "ops": 0.6811122817861598,
                "total": 7.340933549000056,
                "iterations": 1
            }
        },
        {
            "group": null,
            "name": "test_lock_actions",
            "fullname": "tests/benchmarks/test_benchmarks.py::test_lock_actions",
            "params": null,
            "param": null,
            "extra_info": {},
            "options": {
                "disable_gc": false,
                "timer": "perf_counter",
                "min_rounds": 5,
                "max_time": 1.0,
                "min_time": 5e-06,
                "warmup": false
            },
            "stats": {
                "min": 3.037453388000017,
                "max": 3.0584677239999962,
                "mean": 3.0474294577999954,
                "stddev": 0.008079309793446617,
                "rounds": 5,
                "median": 3.04572495299999,
                "iqr": 0.011672469500005889,
                "q1": 3.041966863249989,
                "q3": 3.053639332749995,
                "iqr_outliers": 0,
                "stddev_outliers": 2,
                "outliers": "2;0",
                "ld15iqr": 3.037453388000017,
                "hd15iqr": 3.0584677239999962,
                "ops": 0.32814541365033645,
                "total": 15.237147288999978,
                "iterations": 1
            }
        }
    ],
    "datetime": "2024-09-09T07:15:01.770077",
    "version": "4.0.0"
}