{
    "machine_info": {
        "node": "runner-j1aldqxs-project-39604133-concurrent-0",
        "processor": "",
        "machine": "x86_64",
        "python_compiler": "GCC 12.2.0",
        "python_implementation": "CPython",
        "python_implementation_version": "3.12.7",
        "python_version": "3.12.7",
        "python_build": [
            "main",
            "Oct 19 2024 04:14:06"
        ],
        "release": "5.15.154+",
        "system": "Linux",
        "cpu": {
            "python_version": "3.12.7.final.0 (64 bit)",
            "cpuinfo_version": [
                9,
                0,
                0
            ],
            "cpuinfo_version_string": "9.0.0",
            "arch": "X86_64",
            "bits": 64,
            "count": 2,
            "arch_string_raw": "x86_64",
            "vendor_id_raw": "AuthenticAMD",
            "brand_raw": "AMD EPYC 7B13",
            "hz_advertised_friendly": "2.4500 GHz",
            "hz_actual_friendly": "2.4500 GHz",
            "hz_advertised": [
                2449994000,
                0
            ],
            "hz_actual": [
                2449994000,
                0
            ],
            "model": 1,
            "family": 25,
            "flags": [
                "3dnowext",
                "3dnowprefetch",
                "abm",
                "adx",
                "aes",
                "apic",
                "arat",
                "avx",
                "avx2",
                "bmi1",
                "bmi2",
                "clflush",
                "clflushopt",
                "clwb",
                "clzero",
                "cmov",
                "cmp_legacy",
                "constant_tsc",
                "cpuid",
                "cr8_legacy",
                "cx16",
                "cx8",
                "de",
                "erms",
                "extd_apicid",
                "f16c",
                "fma",
                "fpu",
                "fsgsbase",
                "fsrm",
                "fxsr",
                "fxsr_opt",
                "ht",
                "hypervisor",
                "ibpb",
                "ibrs",
                "invpcid",
                "invpcid_single",
                "lahf_lm",
                "lm",
                "mca",
                "mce",
                "misalignsse",
                "mmx",
                "mmxext",
                "movbe",
                "msr",
                "mtrr",
                "nonstop_tsc",
                "nopl",
                "npt",
                "nrip_save",
                "nx",
                "osvw",
                "osxsave",
                "pae",
                "pat",
                "pcid",
                "pclmulqdq",
                "pdpe1gb",
                "pge",
                "pni",
                "popcnt",
                "pse",
                "pse36",
                "rdpid",
                "rdrand",
                "rdrnd",
                "rdseed",
                "rdtscp",
                "rep_good",
                "sep",
                "sha",
                "sha_ni",
                "smap",
                "smep",
                "ssbd",
                "sse",
                "sse2",
                "sse4_1",
                "sse4_2",
                "sse4a",
                "ssse3",
                "stibp",
                "syscall",
                "topoext",
                "tsc",
                "tsc_adjust",
                "tsc_known_freq",
                "umip",
                "vaes",
                "vme",
                "vmmcall",
                "vpclmulqdq",
                "x2apic",
                "xgetbv1",
                "xsave",
                "xsavec",
                "xsaveerptr",
                "xsaveopt"
            ],
            "l3_cache_size": 524288,
            "l2_cache_size": 524288,
            "l1_data_cache_size": 32768,
            "l1_instruction_cache_size": 32768,
            "l2_cache_line_size": 512,
            "l2_cache_associativity": 6
        }
    },
    "commit_info": {
        "id": "c1798f1b6840d3a0a0638011807b7cbb79cc6d26",
        "time": "2024-10-31T17:15:08+01:00",
        "author_time": "2024-10-31T17:15:08+01:00",
        "dirty": false,
        "project": "finesse3",
        "branch": "(detached head)"
    },
    "benchmarks": [
        {
            "group": null,
            "name": "test_01_simple_cav",
            "fullname": "tests/benchmarks/test_benchmarks.py::test_01_simple_cav",
            "params": null,
            "param": null,
            "extra_info": {},
            "options": {
                "disable_gc": false,
                "timer": "perf_counter",
                "min_rounds": 5,
                "max_time": 1.0,
                "min_time": 5e-06,
                "warmup": false
            },
            "stats": {
                "min": 0.29209385099998997,
                "max": 0.48652022100000636,
                "mean": 0.3351383862000006,
                "stddev": 0.08469859399244999,
                "rounds": 5,
                "median": 0.29797137300001,
                "iqr": 0.052299712499994655,
                "q1": 0.29584183500000094,
                "q3": 0.3481415474999956,
                "iqr_outliers": 1,
                "stddev_outliers": 1,
                "outliers": "1;1",
                "ld15iqr": 0.29209385099998997,
                "hd15iqr": 0.48652022100000636,
                "ops": 2.9838420222123703,
                "total": 1.675691931000003,
                "iterations": 1
            }
        },
        {
            "group": null,
            "name": "test_02_pdh_lock",
            "fullname": "tests/benchmarks/test_benchmarks.py::test_02_pdh_lock",
            "params": null,
            "param": null,
            "extra_info": {},
            "options": {
                "disable_gc": false,
                "timer": "perf_counter",
                "min_rounds": 5,
                "max_time": 1.0,
                "min_time": 5e-06,
                "warmup": false
            },
            "stats": {
                "min": 1.3218325609999795,
                "max": 1.6169202930000068,
                "mean": 1.3922902787999987,
                "stddev": 0.12594591710191438,
                "rounds": 5,
                "median": 1.3397599329999963,
                "iqr": 0.0844621337499909,
                "q1": 1.331215017500007,
                "q3": 1.415677151249998,
                "iqr_outliers": 1,
                "stddev_outliers": 1,
                "outliers": "1;1",
                "ld15iqr": 1.3218325609999795,
                "hd15iqr": 1.6169202930000068,
                "ops": 0.7182410271957728,
                "total": 6.961451393999994,
                "iterations": 1
            }
        },
        {
            "group": null,
            "name": "test_03_near_unstable",
            "fullname": "tests/benchmarks/test_benchmarks.py::test_03_near_unstable",
            "params": null,
            "param": null,
            "extra_info": {},
            "options": {
                "disable_gc": false,
                "timer": "perf_counter",
                "min_rounds": 5,
                "max_time": 1.0,
                "min_time": 5e-06,
                "warmup": false
            },
            "stats": {
                "min": 2.109999996946499e-06,
                "max": 0.000252319999987094,
                "mean": 2.321100892983807e-06,
                "stddev": 1.027305858775478e-06,
                "rounds": 77161,
                "median": 2.300000005561742e-06,
                "iqr": 1.2999996101825673e-07,
                "q1": 2.2100000194313907e-06,
                "q3": 2.3399999804496474e-06,
                "iqr_outliers": 1486,
                "stddev_outliers": 639,
                "outliers": "639;1486",
                "ld15iqr": 2.109999996946499e-06,
                "hd15iqr": 2.5399999969977216e-06,
                "ops": 430830.04406348156,
                "total": 0.17909846600352353,
                "iterations": 1
            }
        },
        {
            "group": null,
            "name": "test_04_geometrical_params",
            "fullname": "tests/benchmarks/test_benchmarks.py::test_04_geometrical_params",
            "params": null,
            "param": null,
            "extra_info": {},
            "options": {
                "disable_gc": false,
                "timer": "perf_counter",
                "min_rounds": 5,
                "max_time": 1.0,
                "min_time": 5e-06,
                "warmup": false
            },
            "stats": {
                "min": 0.49962153199999193,
                "max": 0.8764617360000102,
                "mean": 0.6602824012000041,
                "stddev": 0.19467050515327422,
                "rounds": 5,
                "median": 0.5579699710000057,
                "iqr": 0.3697334132499961,
                "q1": 0.49990323950000715,
                "q3": 0.8696366527500032,
                "iqr_outliers": 0,
                "stddev_outliers": 2,
                "outliers": "2;0",
                "ld15iqr": 0.49962153199999193,
                "hd15iqr": 0.8764617360000102,
                "ops": 1.5145034884809734,
                "total": 3.301412006000021,
                "iterations": 1
            }
        },
        {
            "group": null,
            "name": "test_05_modulation",
            "fullname": "tests/benchmarks/test_benchmarks.py::test_05_modulation",
            "params": null,
            "param": null,
            "extra_info": {},
            "options": {
                "disable_gc": false,
                "timer": "perf_counter",
                "min_rounds": 5,
                "max_time": 1.0,
                "min_time": 5e-06,
                "warmup": false
            },
            "stats": {
                "min": 0.1343353099999831,
                "max": 0.14223537000000874,
                "mean": 0.13798154350000047,
                "stddev": 0.0023314402284009194,
                "rounds": 8,
                "median": 0.13815437950000842,
                "iqr": 0.0020910955000204012,
                "q1": 0.13669767949998857,
                "q3": 0.13878877500000897,
                "iqr_outliers": 1,
                "stddev_outliers": 2,
                "outliers": "2;1",
                "ld15iqr": 0.1343353099999831,
                "hd15iqr": 0.14223537000000874,
                "ops": 7.247346091616931,
                "total": 1.1038523480000038,
                "iterations": 1
            }
        },
        {
            "group": null,
            "name": "test_06_radiation_pressure",
            "fullname": "tests/benchmarks/test_benchmarks.py::test_06_radiation_pressure",
            "params": null,
            "param": null,
            "extra_info": {},
            "options": {
                "disable_gc": false,
                "timer": "perf_counter",
                "min_rounds": 5,
                "max_time": 1.0,
                "min_time": 5e-06,
                "warmup": false
            },
            "stats": {
                "min": 0.2605428679999875,
                "max": 0.706313802000011,
                "mean": 0.3659714708000024,
                "stddev": 0.1911528913045726,
                "rounds": 5,
                "median": 0.28162046100001703,
                "iqr": 0.14068234225002385,
                "q1": 0.26853349624998657,
                "q3": 0.4092158385000104,
                "iqr_outliers": 1,
                "stddev_outliers": 1,
                "outliers": "1;1",
                "ld15iqr": 0.2605428679999875,
                "hd15iqr": 0.706313802000011,
                "ops": 2.732453428170318,
                "total": 1.829857354000012,
                "iterations": 1
            }
        },
        {
            "group": null,
            "name": "test_07_homodyne",
            "fullname": "tests/benchmarks/test_benchmarks.py::test_07_homodyne",
            "params": null,
            "param": null,
            "extra_info": {},
            "options": {
                "disable_gc": false,
                "timer": "perf_counter",
                "min_rounds": 5,
                "max_time": 1.0,
                "min_time": 5e-06,
                "warmup": false
            },
            "stats": {
                "min": 0.0954452539999977,
                "max": 0.10452944499999717,
                "mean": 0.09985826050000526,
                "stddev": 0.003427588642731087,
                "rounds": 10,
                "median": 0.09965130950001821,
                "iqr": 0.007105460999980551,
                "q1": 0.09623905400002286,
                "q3": 0.10334451500000341,
                "iqr_outliers": 0,
                "stddev_outliers": 6,
                "outliers": "6;0",
                "ld15iqr": 0.0954452539999977,
                "hd15iqr": 0.10452944499999717,
                "ops": 10.014194068601338,
                "total": 0.9985826050000526,
                "iterations": 1
            }
        },
        {
            "group": null,
            "name": "test_08_optical_spring",
            "fullname": "tests/benchmarks/test_benchmarks.py::test_08_optical_spring",
            "params": null,
            "param": null,
            "extra_info": {},
            "options": {
                "disable_gc": false,
                "timer": "perf_counter",
                "min_rounds": 5,
                "max_time": 1.0,
                "min_time": 5e-06,
                "warmup": false
            },
            "stats": {
                "min": 0.2505081139999845,
                "max": 0.8021362419999889,
                "mean": 0.3639142243999913,
                "stddev": 0.24500662436075565,
                "rounds": 5,
                "median": 0.2561931459999869,
                "iqr": 0.14498953099999312,
                "q1": 0.25061088649999874,
                "q3": 0.39560041749999186,
                "iqr_outliers": 1,
                "stddev_outliers": 1,
                "outliers": "1;1",
                "ld15iqr": 0.2505081139999845,
                "hd15iqr": 0.8021362419999889,
                "ops": 2.747900282405185,
                "total": 1.8195711219999566,
                "iterations": 1
            }
        },
        {
            "group": null,
            "name": "test_09_aligo_sensitivity",
            "fullname": "tests/benchmarks/test_benchmarks.py::test_09_aligo_sensitivity",
            "params": null,
            "param": null,
            "extra_info": {},
            "options": {
                "disable_gc": false,
                "timer": "perf_counter",
                "min_rounds": 5,
                "max_time": 1.0,
                "min_time": 5e-06,
                "warmup": false
            },
            "stats": {
                "min": 0.2736995690000015,
                "max": 0.28790342099998156,
                "mean": 0.2793771855999978,
                "stddev": 0.005927555856687004,
                "rounds": 5,
                "median": 0.28055697000002056,
                "iqr": 0.008970276999981763,
                "q1": 0.27373747325000153,
                "q3": 0.2827077502499833,
                "iqr_outliers": 0,
                "stddev_outliers": 1,
                "outliers": "1;0",
                "ld15iqr": 0.2736995690000015,
                "hd15iqr": 0.28790342099998156,
                "ops": 3.5793903423157967,
                "total": 1.396885927999989,
                "iterations": 1
            }
        },
        {
            "group": null,
            "name": "test_10_shifted_beam",
            "fullname": "tests/benchmarks/test_benchmarks.py::test_10_shifted_beam",
            "params": null,
            "param": null,
            "extra_info": {},
            "options": {
                "disable_gc": false,
                "timer": "perf_counter",
                "min_rounds": 5,
                "max_time": 1.0,
                "min_time": 5e-06,
                "warmup": false
            },
            "stats": {
                "min": 0.7271173290000092,
                "max": 1.4500991069999998,
                "mean": 0.8980527552000069,
                "stddev": 0.3091892001247866,
                "rounds": 5,
                "median": 0.7708640970000147,
                "iqr": 0.18243509774999467,
                "q1": 0.7592532217500079,
                "q3": 0.9416883195000025,
                "iqr_outliers": 1,
                "stddev_outliers": 1,
                "outliers": "1;1",
                "ld15iqr": 0.7271173290000092,
                "hd15iqr": 1.4500991069999998,
                "ops": 1.1135203296350762,
                "total": 4.490263776000035,
                "iterations": 1
            }
        },
        {
            "group": null,
            "name": "test_angular_radiation_pressure",
            "fullname": "tests/benchmarks/test_benchmarks.py::test_angular_radiation_pressure",
            "params": null,
            "param": null,
            "extra_info": {},
            "options": {
                "disable_gc": false,
                "timer": "perf_counter",
                "min_rounds": 5,
                "max_time": 1.0,
                "min_time": 5e-06,
                "warmup": false
            },
            "stats": {
                "min": 0.32216428699999256,
                "max": 0.3430367310000122,
                "mean": 0.3305320483999992,
                "stddev": 0.00880220909236855,
                "rounds": 5,
                "median": 0.3279230880000057,
                "iqr": 0.014437622500011571,
                "q1": 0.3232573669999894,
                "q3": 0.337694989500001,
                "iqr_outliers": 0,
                "stddev_outliers": 1,
                "outliers": "1;0",
                "ld15iqr": 0.32216428699999256,
                "hd15iqr": 0.3430367310000122,
                "ops": 3.0254252343779755,
                "total": 1.652660241999996,
                "iterations": 1
            }
        },
        {
            "group": null,
            "name": "test_cavity_eigenmodes",
            "fullname": "tests/benchmarks/test_benchmarks.py::test_cavity_eigenmodes",
            "params": null,
            "param": null,
            "extra_info": {},
            "options": {
                "disable_gc": false,
                "timer": "perf_counter",
                "min_rounds": 5,
                "max_time": 1.0,
                "min_time": 5e-06,
                "warmup": false
            },
            "stats": {
                "min": 0.28585251100000164,
                "max": 1.106874547000018,
                "mean": 0.4538344266000024,
                "stddev": 0.36507778268588514,
                "rounds": 5,
                "median": 0.29341350199999283,
                "iqr": 0.20978937225000038,
                "q1": 0.2878330360000021,
                "q3": 0.4976224082500025,
                "iqr_outliers": 1,
                "stddev_outliers": 1,
                "outliers": "1;1",
                "ld15iqr": 0.28585251100000164,
                "hd15iqr": 1.106874547000018,
                "ops": 2.2034467669006816,
                "total": 2.269172133000012,
                "iterations": 1
            }
        },
        {
            "group": null,
            "name": "test_coupled_cavity_commands",
            "fullname": "tests/benchmarks/test_benchmarks.py::test_coupled_cavity_commands",
            "params": null,
            "param": null,
            "extra_info": {},
            "options": {
                "disable_gc": false,
                "timer": "perf_counter",
                "min_rounds": 5,
                "max_time": 1.0,
                "min_time": 5e-06,
                "warmup": false
            },
            "stats": {
                "min": 5.757628531000023,
                "max": 6.852617465000009,
                "mean": 6.197817312800015,
                "stddev": 0.5417772694452283,
                "rounds": 5,
                "median": 5.850775827000007,
                "iqr": 0.9630575207499916,
                "q1": 5.792776267000022,
                "q3": 6.755833787750014,
                "iqr_outliers": 0,
                "stddev_outliers": 1,
                "outliers": "1;0",
                "ld15iqr": 5.757628531000023,
                "hd15iqr": 6.852617465000009,
                "ops": 0.16134712424239325,
                "total": 30.989086564000075,
                "iterations": 1
            }
        },
        {
            "group": null,
            "name": "test_frequency_dependant_squeezing",
            "fullname": "tests/benchmarks/test_benchmarks.py::test_frequency_dependant_squeezing",
            "params": null,
            "param": null,
            "extra_info": {},
            "options": {
                "disable_gc": false,
                "timer": "perf_counter",
                "min_rounds": 5,
                "max_time": 1.0,
                "min_time": 5e-06,
                "warmup": false
            },
            "stats": {
                "min": 1.5544276770000067,
                "max": 1.614010325999999,
                "mean": 1.5797259424000003,
                "stddev": 0.025298616234675057,
                "rounds": 5,
                "median": 1.5851440409999782,
                "iqr": 0.041125559250005495,
                "q1": 1.5548848462500047,
                "q3": 1.5960104055000102,
                "iqr_outliers": 0,
                "stddev_outliers": 1,
                "outliers": "1;0",
                "ld15iqr": 1.5544276770000067,
                "hd15iqr": 1.614010325999999,
                "ops": 0.6330211925751811,
                "total": 7.898629712000002,
                "iterations": 1
            }
        },
        {
            "group": null,
            "name": "test_lock_actions",
            "fullname": "tests/benchmarks/test_benchmarks.py::test_lock_actions",
            "params": null,
            "param": null,
            "extra_info": {},
            "options": {
                "disable_gc": false,
                "timer": "perf_counter",
                "min_rounds": 5,
                "max_time": 1.0,
                "min_time": 5e-06,
                "warmup": false
            },
            "stats": {
                "min": 2.9206092559999774,
                "max": 2.970474949999982,
                "mean": 2.942981557599995,
                "stddev": 0.023636493387377423,
                "rounds": 5,
                "median": 2.9370074470000134,
                "iqr": 0.04502497574999609,
                "q1": 2.9214290884999983,
                "q3": 2.9664540642499944,
                "iqr_outliers": 0,
                "stddev_outliers": 1,
                "outliers": "1;0",
                "ld15iqr": 2.9206092559999774,
                "hd15iqr": 2.970474949999982,
                "ops": 0.3397914599286518,
                "total": 14.714907787999977,
                "iterations": 1
            }
        }
    ],
    "datetime": "2024-10-31T16:21:46.217642+00:00",
    "version": "5.1.0"
}