{
    "machine_info": {
        "node": "runner-nthfetyx-project-39604133-concurrent-0",
        "processor": "",
        "machine": "x86_64",
        "python_compiler": "GCC 12.2.0",
        "python_implementation": "CPython",
        "python_implementation_version": "3.12.3",
        "python_version": "3.12.3",
        "python_build": [
            "main",
            "May 14 2024 07:23:41"
        ],
        "release": "5.15.154+",
        "system": "Linux",
        "cpu": {
            "python_version": "3.12.3.final.0 (64 bit)",
            "cpuinfo_version": [
                9,
                0,
                0
            ],
            "cpuinfo_version_string": "9.0.0",
            "arch": "X86_64",
            "bits": 64,
            "count": 2,
            "arch_string_raw": "x86_64",
            "vendor_id_raw": "AuthenticAMD",
            "brand_raw": "AMD EPYC 7B13",
            "hz_advertised_friendly": "2.4500 GHz",
            "hz_actual_friendly": "2.4500 GHz",
            "hz_advertised": [
                2449996000,
                0
            ],
            "hz_actual": [
                2449996000,
                0
            ],
            "model": 1,
            "family": 25,
            "flags": [
                "3dnowext",
                "3dnowprefetch",
                "abm",
                "adx",
                "aes",
                "apic",
                "arat",
                "avx",
                "avx2",
                "bmi1",
                "bmi2",
                "clflush",
                "clflushopt",
                "clwb",
                "clzero",
                "cmov",
                "cmp_legacy",
                "constant_tsc",
                "cpuid",
                "cr8_legacy",
                "cx16",
                "cx8",
                "de",
                "erms",
                "extd_apicid",
                "f16c",
                "fma",
                "fpu",
                "fsgsbase",
                "fsrm",
                "fxsr",
                "fxsr_opt",
                "ht",
                "hypervisor",
                "ibpb",
                "ibrs",
                "invpcid",
                "invpcid_single",
                "lahf_lm",
                "lm",
                "mca",
                "mce",
                "misalignsse",
                "mmx",
                "mmxext",
                "movbe",
                "msr",
                "mtrr",
                "nonstop_tsc",
                "nopl",
                "npt",
                "nrip_save",
                "nx",
                "osvw",
                "osxsave",
                "pae",
                "pat",
                "pcid",
                "pclmulqdq",
                "pdpe1gb",
                "pge",
                "pni",
                "popcnt",
                "pse",
                "pse36",
                "rdpid",
                "rdrand",
                "rdrnd",
                "rdseed",
                "rdtscp",
                "rep_good",
                "sep",
                "sha",
                "sha_ni",
                "smap",
                "smep",
                "ssbd",
                "sse",
                "sse2",
                "sse4_1",
                "sse4_2",
                "sse4a",
                "ssse3",
                "stibp",
                "syscall",
                "topoext",
                "tsc",
                "tsc_adjust",
                "tsc_known_freq",
                "umip",
                "vaes",
                "vme",
                "vmmcall",
                "vpclmulqdq",
                "x2apic",
                "xgetbv1",
                "xsave",
                "xsavec",
                "xsaveerptr",
                "xsaveopt"
            ],
            "l3_cache_size": 524288,
            "l2_cache_size": 524288,
            "l1_data_cache_size": 32768,
            "l1_instruction_cache_size": 32768,
            "l2_cache_line_size": 512,
            "l2_cache_associativity": 6
        }
    },
    "commit_info": {
        "id": "16cfd891a372d330e79e39ff2aa1fc0e4a2bf8a4",
        "time": "2024-05-30T10:31:24+02:00",
        "author_time": "2024-05-30T10:31:24+02:00",
        "dirty": false,
        "project": "finesse3",
        "branch": "(detached head)"
    },
    "benchmarks": [
        {
            "group": null,
            "name": "test_01_simple_cav",
            "fullname": "tests/benchmarks/test_benchmarks.py::test_01_simple_cav",
            "params": null,
            "param": null,
            "extra_info": {},
            "options": {
                "disable_gc": false,
                "timer": "perf_counter",
                "min_rounds": 5,
                "max_time": 1.0,
                "min_time": 5e-06,
                "warmup": false
            },
            "stats": {
                "min": 0.3664482620000058,
                "max": 0.53294735099999,
                "mean": 0.40365612919999877,
                "stddev": 0.07239676509182957,
                "rounds": 5,
                "median": 0.3713096009999788,
                "iqr": 0.04780750825000979,
                "q1": 0.3688614845000018,
                "q3": 0.41666899275001157,
                "iqr_outliers": 1,
                "stddev_outliers": 1,
                "outliers": "1;1",
                "ld15iqr": 0.3664482620000058,
                "hd15iqr": 0.53294735099999,
                "ops": 2.4773561644707045,
                "total": 2.018280645999994,
                "iterations": 1
            }
        },
        {
            "group": null,
            "name": "test_02_pdh_lock",
            "fullname": "tests/benchmarks/test_benchmarks.py::test_02_pdh_lock",
            "params": null,
            "param": null,
            "extra_info": {},
            "options": {
                "disable_gc": false,
                "timer": "perf_counter",
                "min_rounds": 5,
                "max_time": 1.0,
                "min_time": 5e-06,
                "warmup": false
            },
            "stats": {
                "min": 1.3392065060000107,
                "max": 1.675105512000016,
                "mean": 1.424984906200001,
                "stddev": 0.143634521459406,
                "rounds": 5,
                "median": 1.3457607640000049,
                "iqr": 0.13915196725001522,
                "q1": 1.3440324244999857,
                "q3": 1.483184391750001,
                "iqr_outliers": 0,
                "stddev_outliers": 1,
                "outliers": "1;0",
                "ld15iqr": 1.3392065060000107,
                "hd15iqr": 1.675105512000016,
                "ops": 0.7017618191245929,
                "total": 7.124924531000005,
                "iterations": 1
            }
        },
        {
            "group": null,
            "name": "test_03_near_unstable",
            "fullname": "tests/benchmarks/test_benchmarks.py::test_03_near_unstable",
            "params": null,
            "param": null,
            "extra_info": {},
            "options": {
                "disable_gc": false,
                "timer": "perf_counter",
                "min_rounds": 5,
                "max_time": 1.0,
                "min_time": 5e-06,
                "warmup": false
            },
            "stats": {
                "min": 1.6500000015184924e-06,
                "max": 8.270000000720756e-05,
                "mean": 2.5917020765323276e-06,
                "stddev": 1.1386124056143075e-06,
                "rounds": 43726,
                "median": 3.060000011601005e-06,
                "iqr": 1.4310000153727742e-06,
                "q1": 1.720000000204891e-06,
                "q3": 3.151000015577665e-06,
                "iqr_outliers": 231,
                "stddev_outliers": 460,
                "outliers": "460;231",
                "ld15iqr": 1.6500000015184924e-06,
                "hd15iqr": 5.29999999798747e-06,
                "ops": 385846.8182183927,
                "total": 0.11332476499845257,
                "iterations": 1
            }
        },
        {
            "group": null,
            "name": "test_04_geometrical_params",
            "fullname": "tests/benchmarks/test_benchmarks.py::test_04_geometrical_params",
            "params": null,
            "param": null,
            "extra_info": {},
            "options": {
                "disable_gc": false,
                "timer": "perf_counter",
                "min_rounds": 5,
                "max_time": 1.0,
                "min_time": 5e-06,
                "warmup": false
            },
            "stats": {
                "min": 0.5184568459999923,
                "max": 0.869771677000017,
                "mean": 0.5917419617999997,
                "stddev": 0.15546890868308402,
                "rounds": 5,
                "median": 0.5231947959999843,
                "iqr": 0.09432486275002105,
                "q1": 0.5190985677499924,
                "q3": 0.6134234305000135,
                "iqr_outliers": 1,
                "stddev_outliers": 1,
                "outliers": "1;1",
                "ld15iqr": 0.5184568459999923,
                "hd15iqr": 0.869771677000017,
                "ops": 1.6899257861621544,
                "total": 2.9587098089999984,
                "iterations": 1
            }
        },
        {
            "group": null,
            "name": "test_05_modulation",
            "fullname": "tests/benchmarks/test_benchmarks.py::test_05_modulation",
            "params": null,
            "param": null,
            "extra_info": {},
            "options": {
                "disable_gc": false,
                "timer": "perf_counter",
                "min_rounds": 5,
                "max_time": 1.0,
                "min_time": 5e-06,
                "warmup": false
            },
            "stats": {
                "min": 0.1739738750000015,
                "max": 0.584700306000002,
                "mean": 0.2344492638571499,
                "stddev": 0.15445468704038506,
                "rounds": 7,
                "median": 0.1758508150000182,
                "iqr": 0.0033746472500126856,
                "q1": 0.17518950275000122,
                "q3": 0.1785641500000139,
                "iqr_outliers": 1,
                "stddev_outliers": 1,
                "outliers": "1;1",
                "ld15iqr": 0.1739738750000015,
                "hd15iqr": 0.584700306000002,
                "ops": 4.265315162641333,
                "total": 1.6411448470000494,
                "iterations": 1
            }
        },
        {
            "group": null,
            "name": "test_06_radiation_pressure",
            "fullname": "tests/benchmarks/test_benchmarks.py::test_06_radiation_pressure",
            "params": null,
            "param": null,
            "extra_info": {},
            "options": {
                "disable_gc": false,
                "timer": "perf_counter",
                "min_rounds": 5,
                "max_time": 1.0,
                "min_time": 5e-06,
                "warmup": false
            },
            "stats": {
                "min": 0.3117141550000042,
                "max": 0.3166551739999761,
                "mean": 0.3141809509999973,
                "stddev": 0.002053333973303109,
                "rounds": 5,
                "median": 0.3147465749999867,
                "iqr": 0.0034021539999997685,
                "q1": 0.312265908250005,
                "q3": 0.31566806225000477,
                "iqr_outliers": 0,
                "stddev_outliers": 2,
                "outliers": "2;0",
                "ld15iqr": 0.3117141550000042,
                "hd15iqr": 0.3166551739999761,
                "ops": 3.1828791555220945,
                "total": 1.5709047549999866,
                "iterations": 1
            }
        },
        {
            "group": null,
            "name": "test_07_homodyne",
            "fullname": "tests/benchmarks/test_benchmarks.py::test_07_homodyne",
            "params": null,
            "param": null,
            "extra_info": {},
            "options": {
                "disable_gc": false,
                "timer": "perf_counter",
                "min_rounds": 5,
                "max_time": 1.0,
                "min_time": 5e-06,
                "warmup": false
            },
            "stats": {
                "min": 0.11241886300001624,
                "max": 0.6299566410000068,
                "mean": 0.16733949110000595,
                "stddev": 0.1625748018782692,
                "rounds": 10,
                "median": 0.11655553800000007,
                "iqr": 0.00551616899997498,
                "q1": 0.11282664400002318,
                "q3": 0.11834281299999816,
                "iqr_outliers": 1,
                "stddev_outliers": 1,
                "outliers": "1;1",
                "ld15iqr": 0.11241886300001624,
                "hd15iqr": 0.6299566410000068,
                "ops": 5.975875708874822,
                "total": 1.6733949110000594,
                "iterations": 1
            }
        },
        {
            "group": null,
            "name": "test_08_optical_spring",
            "fullname": "tests/benchmarks/test_benchmarks.py::test_08_optical_spring",
            "params": null,
            "param": null,
            "extra_info": {},
            "options": {
                "disable_gc": false,
                "timer": "perf_counter",
                "min_rounds": 5,
                "max_time": 1.0,
                "min_time": 5e-06,
                "warmup": false
            },
            "stats": {
                "min": 0.28820076899998526,
                "max": 0.30016336700001034,
                "mean": 0.2931747621999989,
                "stddev": 0.0048481446889481515,
                "rounds": 5,
                "median": 0.29319945799997527,
                "iqr": 0.007535033750009745,
                "q1": 0.28889433150000343,
                "q3": 0.2964293652500132,
                "iqr_outliers": 0,
                "stddev_outliers": 2,
                "outliers": "2;0",
                "ld15iqr": 0.28820076899998526,
                "hd15iqr": 0.30016336700001034,
                "ops": 3.410934803855377,
                "total": 1.4658738109999945,
                "iterations": 1
            }
        },
        {
            "group": null,
            "name": "test_09_aligo_sensitivity",
            "fullname": "tests/benchmarks/test_benchmarks.py::test_09_aligo_sensitivity",
            "params": null,
            "param": null,
            "extra_info": {},
            "options": {
                "disable_gc": false,
                "timer": "perf_counter",
                "min_rounds": 5,
                "max_time": 1.0,
                "min_time": 5e-06,
                "warmup": false
            },
            "stats": {
                "min": 0.32325435399999947,
                "max": 0.9320931470000176,
                "mean": 0.4476333441999998,
                "stddev": 0.2708331715702761,
                "rounds": 5,
                "median": 0.32675508400001263,
                "iqr": 0.1556481407500101,
                "q1": 0.32511841824998555,
                "q3": 0.48076655899999565,
                "iqr_outliers": 1,
                "stddev_outliers": 1,
                "outliers": "1;1",
                "ld15iqr": 0.32325435399999947,
                "hd15iqr": 0.9320931470000176,
                "ops": 2.2339712020050193,
                "total": 2.238166720999999,
                "iterations": 1
            }
        },
        {
            "group": null,
            "name": "test_10_shifted_beam",
            "fullname": "tests/benchmarks/test_benchmarks.py::test_10_shifted_beam",
            "params": null,
            "param": null,
            "extra_info": {},
            "options": {
                "disable_gc": false,
                "timer": "perf_counter",
                "min_rounds": 5,
                "max_time": 1.0,
                "min_time": 5e-06,
                "warmup": false
            },
            "stats": {
                "min": 0.7179466679999962,
                "max": 0.7325742860000162,
                "mean": 0.726993100600015,
                "stddev": 0.005486162028034273,
                "rounds": 5,
                "median": 0.7286733760000175,
                "iqr": 0.005490323750002801,
                "q1": 0.724484147250017,
                "q3": 0.7299744710000198,
                "iqr_outliers": 0,
                "stddev_outliers": 2,
                "outliers": "2;0",
                "ld15iqr": 0.7179466679999962,
                "hd15iqr": 0.7325742860000162,
                "ops": 1.3755288725225345,
                "total": 3.6349655030000747,
                "iterations": 1
            }
        },
        {
            "group": null,
            "name": "test_angular_radiation_pressure",
            "fullname": "tests/benchmarks/test_benchmarks.py::test_angular_radiation_pressure",
            "params": null,
            "param": null,
            "extra_info": {},
            "options": {
                "disable_gc": false,
                "timer": "perf_counter",
                "min_rounds": 5,
                "max_time": 1.0,
                "min_time": 5e-06,
                "warmup": false
            },
            "stats": {
                "min": 0.331730403000023,
                "max": 0.34088778200001,
                "mean": 0.33665072420000114,
                "stddev": 0.0037805722493760895,
                "rounds": 5,
                "median": 0.33818135199999233,
                "iqr": 0.006010259749984925,
                "q1": 0.3332424247500043,
                "q3": 0.33925268449998924,
                "iqr_outliers": 0,
                "stddev_outliers": 2,
                "outliers": "2;0",
                "ld15iqr": 0.331730403000023,
                "hd15iqr": 0.34088778200001,
                "ops": 2.9704376913976547,
                "total": 1.6832536210000058,
                "iterations": 1
            }
        },
        {
            "group": null,
            "name": "test_cavity_eigenmodes",
            "fullname": "tests/benchmarks/test_benchmarks.py::test_cavity_eigenmodes",
            "params": null,
            "param": null,
            "extra_info": {},
            "options": {
                "disable_gc": false,
                "timer": "perf_counter",
                "min_rounds": 5,
                "max_time": 1.0,
                "min_time": 5e-06,
                "warmup": false
            },
            "stats": {
                "min": 0.2645731620000049,
                "max": 1.1523547460000145,
                "mean": 0.44922965600000564,
                "stddev": 0.393104346517387,
                "rounds": 5,
                "median": 0.2772976910000011,
                "iqr": 0.2283776802499844,
                "q1": 0.26989815375001314,
                "q3": 0.49827583399999753,
                "iqr_outliers": 1,
                "stddev_outliers": 1,
                "outliers": "1;1",
                "ld15iqr": 0.2645731620000049,
                "hd15iqr": 1.1523547460000145,
                "ops": 2.2260329135527672,
                "total": 2.2461482800000283,
                "iterations": 1
            }
        },
        {
            "group": null,
            "name": "test_coupled_cavity_commands",
            "fullname": "tests/benchmarks/test_benchmarks.py::test_coupled_cavity_commands",
            "params": null,
            "param": null,
            "extra_info": {},
            "options": {
                "disable_gc": false,
                "timer": "perf_counter",
                "min_rounds": 5,
                "max_time": 1.0,
                "min_time": 5e-06,
                "warmup": false
            },
            "stats": {
                "min": 4.371334668000003,
                "max": 5.520479693999988,
                "mean": 4.821629375599997,
                "stddev": 0.5937148647566434,
                "rounds": 5,
                "median": 4.398346884000006,
                "iqr": 1.0553678895000047,
                "q1": 4.390537462499992,
                "q3": 5.445905351999997,
                "iqr_outliers": 0,
                "stddev_outliers": 2,
                "outliers": "2;0",
                "ld15iqr": 4.371334668000003,
                "hd15iqr": 5.520479693999988,
                "ops": 0.20739876960691558,
                "total": 24.108146877999985,
                "iterations": 1
            }
        },
        {
            "group": null,
            "name": "test_frequency_dependant_squeezing",
            "fullname": "tests/benchmarks/test_benchmarks.py::test_frequency_dependant_squeezing",
            "params": null,
            "param": null,
            "extra_info": {},
            "options": {
                "disable_gc": false,
                "timer": "perf_counter",
                "min_rounds": 5,
                "max_time": 1.0,
                "min_time": 5e-06,
                "warmup": false
            },
            "stats": {
                "min": 1.513560938000012,
                "max": 2.9452330240000038,
                "mean": 1.812348911400005,
                "stddev": 0.6334624914550282,
                "rounds": 5,
                "median": 1.5352417519999904,
                "iqr": 0.38143281425001163,
                "q1": 1.5170236542500035,
                "q3": 1.8984564685000151,
                "iqr_outliers": 1,
                "stddev_outliers": 1,
                "outliers": "1;1",
                "ld15iqr": 1.513560938000012,
                "hd15iqr": 2.9452330240000038,
                "ops": 0.5517701330631302,
                "total": 9.061744557000026,
                "iterations": 1
            }
        },
        {
            "group": null,
            "name": "test_lock_actions",
            "fullname": "tests/benchmarks/test_benchmarks.py::test_lock_actions",
            "params": null,
            "param": null,
            "extra_info": {},
            "options": {
                "disable_gc": false,
                "timer": "perf_counter",
                "min_rounds": 5,
                "max_time": 1.0,
                "min_time": 5e-06,
                "warmup": false
            },
            "stats": {
                "min": 4.733361435999996,
                "max": 6.252634300000011,
                "mean": 5.189034479200001,
                "stddev": 0.6081725655439225,
                "rounds": 5,
                "median": 4.960211163999986,
                "iqr": 0.5156206214999841,
                "q1": 4.865051217250013,
                "q3": 5.380671838749997,
                "iqr_outliers": 1,
                "stddev_outliers": 1,
                "outliers": "1;1",
                "ld15iqr": 4.733361435999996,
                "hd15iqr": 6.252634300000011,
                "ops": 0.19271407889241296,
                "total": 25.945172396000004,
                "iterations": 1
            }
        }
    ],
    "datetime": "2024-05-30T08:38:10.763920",
    "version": "4.0.0"
}