{
    "machine_info": {
        "node": "runner-ns46nmmj-project-39604133-concurrent-0",
        "processor": "",
        "machine": "x86_64",
        "python_compiler": "GCC 12.2.0",
        "python_implementation": "CPython",
        "python_implementation_version": "3.12.3",
        "python_version": "3.12.3",
        "python_build": [
            "main",
            "May 14 2024 07:23:41"
        ],
        "release": "5.15.154+",
        "system": "Linux",
        "cpu": {
            "python_version": "3.12.3.final.0 (64 bit)",
            "cpuinfo_version": [
                9,
                0,
                0
            ],
            "cpuinfo_version_string": "9.0.0",
            "arch": "X86_64",
            "bits": 64,
            "count": 2,
            "arch_string_raw": "x86_64",
            "vendor_id_raw": "AuthenticAMD",
            "brand_raw": "AMD EPYC 7B13",
            "hz_advertised_friendly": "2.4500 GHz",
            "hz_actual_friendly": "2.4500 GHz",
            "hz_advertised": [
                2449996000,
                0
            ],
            "hz_actual": [
                2449996000,
                0
            ],
            "model": 1,
            "family": 25,
            "flags": [
                "3dnowext",
                "3dnowprefetch",
                "abm",
                "adx",
                "aes",
                "apic",
                "arat",
                "avx",
                "avx2",
                "bmi1",
                "bmi2",
                "clflush",
                "clflushopt",
                "clwb",
                "clzero",
                "cmov",
                "cmp_legacy",
                "constant_tsc",
                "cpuid",
                "cr8_legacy",
                "cx16",
                "cx8",
                "de",
                "erms",
                "extd_apicid",
                "f16c",
                "fma",
                "fpu",
                "fsgsbase",
                "fsrm",
                "fxsr",
                "fxsr_opt",
                "ht",
                "hypervisor",
                "ibpb",
                "ibrs",
                "invpcid",
                "invpcid_single",
                "lahf_lm",
                "lm",
                "mca",
                "mce",
                "misalignsse",
                "mmx",
                "mmxext",
                "movbe",
                "msr",
                "mtrr",
                "nonstop_tsc",
                "nopl",
                "npt",
                "nrip_save",
                "nx",
                "osvw",
                "osxsave",
                "pae",
                "pat",
                "pcid",
                "pclmulqdq",
                "pdpe1gb",
                "pge",
                "pni",
                "popcnt",
                "pse",
                "pse36",
                "rdpid",
                "rdrand",
                "rdrnd",
                "rdseed",
                "rdtscp",
                "rep_good",
                "sep",
                "sha",
                "sha_ni",
                "smap",
                "smep",
                "ssbd",
                "sse",
                "sse2",
                "sse4_1",
                "sse4_2",
                "sse4a",
                "ssse3",
                "stibp",
                "syscall",
                "topoext",
                "tsc",
                "tsc_adjust",
                "tsc_known_freq",
                "umip",
                "vaes",
                "vme",
                "vmmcall",
                "vpclmulqdq",
                "x2apic",
                "xgetbv1",
                "xsave",
                "xsavec",
                "xsaveerptr",
                "xsaveopt"
            ],
            "l3_cache_size": 524288,
            "l2_cache_size": 524288,
            "l1_data_cache_size": 32768,
            "l1_instruction_cache_size": 32768,
            "l2_cache_line_size": 512,
            "l2_cache_associativity": 6
        }
    },
    "commit_info": {
        "id": "52c56716622843d3cb84e8a5dc9a8c4e66a7e43c",
        "time": "2024-05-21T10:15:25+02:00",
        "author_time": "2024-05-21T10:15:25+02:00",
        "dirty": false,
        "project": "finesse3",
        "branch": "(detached head)"
    },
    "benchmarks": [
        {
            "group": null,
            "name": "test_01_simple_cav",
            "fullname": "tests/benchmarks/test_benchmarks.py::test_01_simple_cav",
            "params": null,
            "param": null,
            "extra_info": {},
            "options": {
                "disable_gc": false,
                "timer": "perf_counter",
                "min_rounds": 5,
                "max_time": 1.0,
                "min_time": 5e-06,
                "warmup": false
            },
            "stats": {
                "min": 0.3537533039999943,
                "max": 0.5114941380000033,
                "mean": 0.3886287125999985,
                "stddev": 0.06880359239126951,
                "rounds": 5,
                "median": 0.35778154599999823,
                "iqr": 0.04608699974999553,
                "q1": 0.3551553960000007,
                "q3": 0.4012423957499962,
                "iqr_outliers": 1,
                "stddev_outliers": 1,
                "outliers": "1;1",
                "ld15iqr": 0.3537533039999943,
                "hd15iqr": 0.5114941380000033,
                "ops": 2.5731500724941645,
                "total": 1.9431435629999925,
                "iterations": 1
            }
        },
        {
            "group": null,
            "name": "test_02_pdh_lock",
            "fullname": "tests/benchmarks/test_benchmarks.py::test_02_pdh_lock",
            "params": null,
            "param": null,
            "extra_info": {},
            "options": {
                "disable_gc": false,
                "timer": "perf_counter",
                "min_rounds": 5,
                "max_time": 1.0,
                "min_time": 5e-06,
                "warmup": false
            },
            "stats": {
                "min": 1.285336065999985,
                "max": 1.5426953369999978,
                "mean": 1.3419597357999975,
                "stddev": 0.1123047956079909,
                "rounds": 5,
                "median": 1.2944214119999913,
                "iqr": 0.0696773547499916,
                "q1": 1.2889199470000072,
                "q3": 1.3585973017499988,
                "iqr_outliers": 1,
                "stddev_outliers": 1,
                "outliers": "1;1",
                "ld15iqr": 1.285336065999985,
                "hd15iqr": 1.5426953369999978,
                "ops": 0.7451788405587734,
                "total": 6.709798678999988,
                "iterations": 1
            }
        },
        {
            "group": null,
            "name": "test_03_near_unstable",
            "fullname": "tests/benchmarks/test_benchmarks.py::test_03_near_unstable",
            "params": null,
            "param": null,
            "extra_info": {},
            "options": {
                "disable_gc": false,
                "timer": "perf_counter",
                "min_rounds": 5,
                "max_time": 1.0,
                "min_time": 5e-06,
                "warmup": false
            },
            "stats": {
                "min": 1.70999999227206e-06,
                "max": 0.000163600000007591,
                "mean": 2.660580275513984e-06,
                "stddev": 1.8517347986075653e-06,
                "rounds": 57340,
                "median": 3.0999999864889105e-06,
                "iqr": 1.4090000206579134e-06,
                "q1": 1.7999999784024112e-06,
                "q3": 3.2089999990603246e-06,
                "iqr_outliers": 382,
                "stddev_outliers": 394,
                "outliers": "394;382",
                "ld15iqr": 1.70999999227206e-06,
                "hd15iqr": 5.340000001297085e-06,
                "ops": 375857.8567251894,
                "total": 0.15255767299797185,
                "iterations": 1
            }
        },
        {
            "group": null,
            "name": "test_04_geometrical_params",
            "fullname": "tests/benchmarks/test_benchmarks.py::test_04_geometrical_params",
            "params": null,
            "param": null,
            "extra_info": {},
            "options": {
                "disable_gc": false,
                "timer": "perf_counter",
                "min_rounds": 5,
                "max_time": 1.0,
                "min_time": 5e-06,
                "warmup": false
            },
            "stats": {
                "min": 0.49778223900000285,
                "max": 0.8368198080000013,
                "mean": 0.5726443360000019,
                "stddev": 0.14777713357437527,
                "rounds": 5,
                "median": 0.510647333999998,
                "iqr": 0.08826977400001823,
                "q1": 0.5044299809999941,
                "q3": 0.5926997550000124,
                "iqr_outliers": 1,
                "stddev_outliers": 1,
                "outliers": "1;1",
                "ld15iqr": 0.49778223900000285,
                "hd15iqr": 0.8368198080000013,
                "ops": 1.7462846257855884,
                "total": 2.8632216800000094,
                "iterations": 1
            }
        },
        {
            "group": null,
            "name": "test_05_modulation",
            "fullname": "tests/benchmarks/test_benchmarks.py::test_05_modulation",
            "params": null,
            "param": null,
            "extra_info": {},
            "options": {
                "disable_gc": false,
                "timer": "perf_counter",
                "min_rounds": 5,
                "max_time": 1.0,
                "min_time": 5e-06,
                "warmup": false
            },
            "stats": {
                "min": 0.16963372499998286,
                "max": 0.5295888859999991,
                "mean": 0.21647415799999692,
                "stddev": 0.12652202862815634,
                "rounds": 8,
                "median": 0.17189153399999668,
                "iqr": 0.00149450449998767,
                "q1": 0.17144964400000617,
                "q3": 0.17294414849999384,
                "iqr_outliers": 1,
                "stddev_outliers": 1,
                "outliers": "1;1",
                "ld15iqr": 0.16963372499998286,
                "hd15iqr": 0.5295888859999991,
                "ops": 4.619489038502296,
                "total": 1.7317932639999754,
                "iterations": 1
            }
        },
        {
            "group": null,
            "name": "test_06_radiation_pressure",
            "fullname": "tests/benchmarks/test_benchmarks.py::test_06_radiation_pressure",
            "params": null,
            "param": null,
            "extra_info": {},
            "options": {
                "disable_gc": false,
                "timer": "perf_counter",
                "min_rounds": 5,
                "max_time": 1.0,
                "min_time": 5e-06,
                "warmup": false
            },
            "stats": {
                "min": 0.23186243099999615,
                "max": 0.2350631800000258,
                "mean": 0.23332468620000668,
                "stddev": 0.0012701770553844175,
                "rounds": 5,
                "median": 0.2329081599999938,
                "iqr": 0.0019174172499987208,
                "q1": 0.23245311525001,
                "q3": 0.23437053250000872,
                "iqr_outliers": 0,
                "stddev_outliers": 2,
                "outliers": "2;0",
                "ld15iqr": 0.23186243099999615,
                "hd15iqr": 0.2350631800000258,
                "ops": 4.285873116498255,
                "total": 1.1666234310000334,
                "iterations": 1
            }
        },
        {
            "group": null,
            "name": "test_07_homodyne",
            "fullname": "tests/benchmarks/test_benchmarks.py::test_07_homodyne",
            "params": null,
            "param": null,
            "extra_info": {},
            "options": {
                "disable_gc": false,
                "timer": "perf_counter",
                "min_rounds": 5,
                "max_time": 1.0,
                "min_time": 5e-06,
                "warmup": false
            },
            "stats": {
                "min": 0.10949925900001745,
                "max": 0.11614649499998109,
                "mean": 0.11203081169999791,
                "stddev": 0.0019682076139359407,
                "rounds": 10,
                "median": 0.11163295500000459,
                "iqr": 0.001989955999988524,
                "q1": 0.11119798999999375,
                "q3": 0.11318794599998228,
                "iqr_outliers": 0,
                "stddev_outliers": 3,
                "outliers": "3;0",
                "ld15iqr": 0.10949925900001745,
                "hd15iqr": 0.11614649499998109,
                "ops": 8.92611581426236,
                "total": 1.1203081169999791,
                "iterations": 1
            }
        },
        {
            "group": null,
            "name": "test_08_optical_spring",
            "fullname": "tests/benchmarks/test_benchmarks.py::test_08_optical_spring",
            "params": null,
            "param": null,
            "extra_info": {},
            "options": {
                "disable_gc": false,
                "timer": "perf_counter",
                "min_rounds": 5,
                "max_time": 1.0,
                "min_time": 5e-06,
                "warmup": false
            },
            "stats": {
                "min": 0.28401379600001064,
                "max": 0.29224094900001774,
                "mean": 0.2883783136000034,
                "stddev": 0.003818129478617522,
                "rounds": 5,
                "median": 0.28975689800000737,
                "iqr": 0.007038356500004284,
                "q1": 0.2844676367499943,
                "q3": 0.2915059932499986,
                "iqr_outliers": 0,
                "stddev_outliers": 2,
                "outliers": "2;0",
                "ld15iqr": 0.28401379600001064,
                "hd15iqr": 0.29224094900001774,
                "ops": 3.4676671332056377,
                "total": 1.4418915680000168,
                "iterations": 1
            }
        },
        {
            "group": null,
            "name": "test_09_aligo_sensitivity",
            "fullname": "tests/benchmarks/test_benchmarks.py::test_09_aligo_sensitivity",
            "params": null,
            "param": null,
            "extra_info": {},
            "options": {
                "disable_gc": false,
                "timer": "perf_counter",
                "min_rounds": 5,
                "max_time": 1.0,
                "min_time": 5e-06,
                "warmup": false
            },
            "stats": {
                "min": 0.3152243540000086,
                "max": 0.8918411779999929,
                "mean": 0.43233480140000324,
                "stddev": 0.25688124747814106,
                "rounds": 5,
                "median": 0.318768045000013,
                "iqr": 0.1478484224999974,
                "q1": 0.31539914150000214,
                "q3": 0.46324756399999956,
                "iqr_outliers": 1,
                "stddev_outliers": 1,
                "outliers": "1;1",
                "ld15iqr": 0.3152243540000086,
                "hd15iqr": 0.8918411779999929,
                "ops": 2.3130222151021878,
                "total": 2.161674007000016,
                "iterations": 1
            }
        },
        {
            "group": null,
            "name": "test_10_shifted_beam",
            "fullname": "tests/benchmarks/test_benchmarks.py::test_10_shifted_beam",
            "params": null,
            "param": null,
            "extra_info": {},
            "options": {
                "disable_gc": false,
                "timer": "perf_counter",
                "min_rounds": 5,
                "max_time": 1.0,
                "min_time": 5e-06,
                "warmup": false
            },
            "stats": {
                "min": 0.7066223690000015,
                "max": 0.716150841000001,
                "mean": 0.710455039999988,
                "stddev": 0.00381005252885176,
                "rounds": 5,
                "median": 0.7087580199999763,
                "iqr": 0.005389760500001728,
                "q1": 0.7079307597499849,
                "q3": 0.7133205202499866,
                "iqr_outliers": 0,
                "stddev_outliers": 2,
                "outliers": "2;0",
                "ld15iqr": 0.7066223690000015,
                "hd15iqr": 0.716150841000001,
                "ops": 1.40754860434239,
                "total": 3.55227519999994,
                "iterations": 1
            }
        },
        {
            "group": null,
            "name": "test_angular_radiation_pressure",
            "fullname": "tests/benchmarks/test_benchmarks.py::test_angular_radiation_pressure",
            "params": null,
            "param": null,
            "extra_info": {},
            "options": {
                "disable_gc": false,
                "timer": "perf_counter",
                "min_rounds": 5,
                "max_time": 1.0,
                "min_time": 5e-06,
                "warmup": false
            },
            "stats": {
                "min": 0.32678092800000513,
                "max": 0.33528144999999654,
                "mean": 0.33158308480000187,
                "stddev": 0.0035666926470645714,
                "rounds": 5,
                "median": 0.33110653800000023,
                "iqr": 0.005900654499974678,
                "q1": 0.32908741050001566,
                "q3": 0.33498806499999034,
                "iqr_outliers": 0,
                "stddev_outliers": 2,
                "outliers": "2;0",
                "ld15iqr": 0.32678092800000513,
                "hd15iqr": 0.33528144999999654,
                "ops": 3.0158353843748134,
                "total": 1.6579154240000094,
                "iterations": 1
            }
        },
        {
            "group": null,
            "name": "test_cavity_eigenmodes",
            "fullname": "tests/benchmarks/test_benchmarks.py::test_cavity_eigenmodes",
            "params": null,
            "param": null,
            "extra_info": {},
            "options": {
                "disable_gc": false,
                "timer": "perf_counter",
                "min_rounds": 5,
                "max_time": 1.0,
                "min_time": 5e-06,
                "warmup": false
            },
            "stats": {
                "min": 0.2610622800000044,
                "max": 1.0513842410000223,
                "mean": 0.4215506008000034,
                "stddev": 0.3520968634569945,
                "rounds": 5,
                "median": 0.264543481000004,
                "iqr": 0.20141627675001672,
                "q1": 0.2623838024999898,
                "q3": 0.46380007925000655,
                "iqr_outliers": 1,
                "stddev_outliers": 1,
                "outliers": "1;1",
                "ld15iqr": 0.2610622800000044,
                "hd15iqr": 1.0513842410000223,
                "ops": 2.3721944604093466,
                "total": 2.107753004000017,
                "iterations": 1
            }
        },
        {
            "group": null,
            "name": "test_coupled_cavity_commands",
            "fullname": "tests/benchmarks/test_benchmarks.py::test_coupled_cavity_commands",
            "params": null,
            "param": null,
            "extra_info": {},
            "options": {
                "disable_gc": false,
                "timer": "perf_counter",
                "min_rounds": 5,
                "max_time": 1.0,
                "min_time": 5e-06,
                "warmup": false
            },
            "stats": {
                "min": 4.249592516999996,
                "max": 5.386657229999997,
                "mean": 4.703275877800001,
                "stddev": 0.5469986555133969,
                "rounds": 5,
                "median": 4.397771776000013,
                "iqr": 0.9779942152499927,
                "q1": 4.271418310500003,
                "q3": 5.249412525749996,
                "iqr_outliers": 0,
                "stddev_outliers": 1,
                "outliers": "1;0",
                "ld15iqr": 4.249592516999996,
                "hd15iqr": 5.386657229999997,
                "ops": 0.21261776386967093,
                "total": 23.516379389000008,
                "iterations": 1
            }
        },
        {
            "group": null,
            "name": "test_frequency_dependant_squeezing",
            "fullname": "tests/benchmarks/test_benchmarks.py::test_frequency_dependant_squeezing",
            "params": null,
            "param": null,
            "extra_info": {},
            "options": {
                "disable_gc": false,
                "timer": "perf_counter",
                "min_rounds": 5,
                "max_time": 1.0,
                "min_time": 5e-06,
                "warmup": false
            },
            "stats": {
                "min": 1.4674599829999977,
                "max": 2.6969774320000113,
                "mean": 1.719398503800005,
                "stddev": 0.5465121808570327,
                "rounds": 5,
                "median": 1.4756742150000264,
                "iqr": 0.31453976450001164,
                "q1": 1.4721151279999916,
                "q3": 1.7866548925000032,
                "iqr_outliers": 1,
                "stddev_outliers": 1,
                "outliers": "1;1",
                "ld15iqr": 1.4674599829999977,
                "hd15iqr": 2.6969774320000113,
                "ops": 0.581598738041194,
                "total": 8.596992519000025,
                "iterations": 1
            }
        },
        {
            "group": null,
            "name": "test_lock_actions",
            "fullname": "tests/benchmarks/test_benchmarks.py::test_lock_actions",
            "params": null,
            "param": null,
            "extra_info": {},
            "options": {
                "disable_gc": false,
                "timer": "perf_counter",
                "min_rounds": 5,
                "max_time": 1.0,
                "min_time": 5e-06,
                "warmup": false
            },
            "stats": {
                "min": 4.799137507000012,
                "max": 6.213785285,
                "mean": 5.148562025800009,
                "stddev": 0.5993301402629441,
                "rounds": 5,
                "median": 4.883561917999998,
                "iqr": 0.44943680424999144,
                "q1": 4.84426897900002,
                "q3": 5.293705783250012,
                "iqr_outliers": 1,
                "stddev_outliers": 1,
                "outliers": "1;1",
                "ld15iqr": 4.799137507000012,
                "hd15iqr": 6.213785285,
                "ops": 0.1942289895681338,
                "total": 25.74281012900005,
                "iterations": 1
            }
        }
    ],
    "datetime": "2024-05-21T08:22:15.653934",
    "version": "4.0.0"
}