{
    "machine_info": {
        "node": "runner-xs6vzpvo-project-39604133-concurrent-0",
        "processor": "",
        "machine": "x86_64",
        "python_compiler": "GCC 12.2.0",
        "python_implementation": "CPython",
        "python_implementation_version": "3.13.1",
        "python_version": "3.13.1",
        "python_build": [
            "main",
            "Jan 24 2025 19:39:23"
        ],
        "release": "5.15.154+",
        "system": "Linux",
        "cpu": {
            "python_version": "3.13.1.final.0 (64 bit)",
            "cpuinfo_version": [
                9,
                0,
                0
            ],
            "cpuinfo_version_string": "9.0.0",
            "arch": "X86_64",
            "bits": 64,
            "count": 2,
            "arch_string_raw": "x86_64",
            "vendor_id_raw": "AuthenticAMD",
            "brand_raw": "AMD EPYC 7B13",
            "hz_advertised_friendly": "2.4500 GHz",
            "hz_actual_friendly": "2.4500 GHz",
            "hz_advertised": [
                2449996000,
                0
            ],
            "hz_actual": [
                2449996000,
                0
            ],
            "model": 1,
            "family": 25,
            "flags": [
                "3dnowext",
                "3dnowprefetch",
                "abm",
                "adx",
                "aes",
                "apic",
                "arat",
                "avx",
                "avx2",
                "bmi1",
                "bmi2",
                "clflush",
                "clflushopt",
                "clwb",
                "clzero",
                "cmov",
                "cmp_legacy",
                "constant_tsc",
                "cpuid",
                "cr8_legacy",
                "cx16",
                "cx8",
                "de",
                "erms",
                "extd_apicid",
                "f16c",
                "fma",
                "fpu",
                "fsgsbase",
                "fsrm",
                "fxsr",
                "fxsr_opt",
                "ht",
                "hypervisor",
                "ibpb",
                "ibrs",
                "invpcid",
                "invpcid_single",
                "lahf_lm",
                "lm",
                "mca",
                "mce",
                "misalignsse",
                "mmx",
                "mmxext",
                "movbe",
                "msr",
                "mtrr",
                "nonstop_tsc",
                "nopl",
                "npt",
                "nrip_save",
                "nx",
                "osvw",
                "osxsave",
                "pae",
                "pat",
                "pcid",
                "pclmulqdq",
                "pdpe1gb",
                "pge",
                "pni",
                "popcnt",
                "pse",
                "pse36",
                "rdpid",
                "rdrand",
                "rdrnd",
                "rdseed",
                "rdtscp",
                "rep_good",
                "sep",
                "sha",
                "sha_ni",
                "smap",
                "smep",
                "ssbd",
                "sse",
                "sse2",
                "sse4_1",
                "sse4_2",
                "sse4a",
                "ssse3",
                "stibp",
                "syscall",
                "topoext",
                "tsc",
                "tsc_adjust",
                "tsc_known_freq",
                "umip",
                "vaes",
                "vme",
                "vmmcall",
                "vpclmulqdq",
                "x2apic",
                "xgetbv1",
                "xsave",
                "xsavec",
                "xsaveerptr",
                "xsaveopt"
            ],
            "l3_cache_size": 524288,
            "l2_cache_size": 524288,
            "l1_data_cache_size": 32768,
            "l1_instruction_cache_size": 32768,
            "l2_cache_line_size": 512,
            "l2_cache_associativity": 6
        }
    },
    "commit_info": {
        "id": "883b64b0483155850aff90896c14eb210405cfc2",
        "time": "2025-01-27T09:27:39+00:00",
        "author_time": "2025-01-27T09:27:39+00:00",
        "dirty": false,
        "project": "finesse3",
        "branch": "(detached head)"
    },
    "benchmarks": [
        {
            "group": null,
            "name": "test_01_simple_cav",
            "fullname": "tests/benchmarks/test_benchmarks.py::test_01_simple_cav",
            "params": null,
            "param": null,
            "extra_info": {},
            "options": {
                "disable_gc": false,
                "timer": "perf_counter",
                "min_rounds": 5,
                "max_time": 1.0,
                "min_time": 5e-06,
                "warmup": false
            },
            "stats": {
                "min": 0.29820743999999877,
                "max": 0.5373079569999959,
                "mean": 0.3488476364000007,
                "stddev": 0.10537743204646341,
                "rounds": 5,
                "median": 0.302423368999996,
                "iqr": 0.061916739249994635,
                "q1": 0.3008433360000069,
                "q3": 0.36276007525000153,
                "iqr_outliers": 1,
                "stddev_outliers": 1,
                "outliers": "1;1",
                "ld15iqr": 0.29820743999999877,
                "hd15iqr": 0.5373079569999959,
                "ops": 2.866580981656317,
                "total": 1.7442381820000037,
                "iterations": 1
            }
        },
        {
            "group": null,
            "name": "test_02_pdh_lock",
            "fullname": "tests/benchmarks/test_benchmarks.py::test_02_pdh_lock",
            "params": null,
            "param": null,
            "extra_info": {},
            "options": {
                "disable_gc": false,
                "timer": "perf_counter",
                "min_rounds": 5,
                "max_time": 1.0,
                "min_time": 5e-06,
                "warmup": false
            },
            "stats": {
                "min": 1.3447534770000118,
                "max": 1.688240981000007,
                "mean": 1.4775073338000027,
                "stddev": 0.16890352174078208,
                "rounds": 5,
                "median": 1.364075103999994,
                "iqr": 0.29422083274997846,
                "q1": 1.3534390560000134,
                "q3": 1.6476598887499918,
                "iqr_outliers": 0,
                "stddev_outliers": 1,
                "outliers": "1;0",
                "ld15iqr": 1.3447534770000118,
                "hd15iqr": 1.688240981000007,
                "ops": 0.6768155914516505,
                "total": 7.3875366690000135,
                "iterations": 1
            }
        },
        {
            "group": null,
            "name": "test_03_near_unstable",
            "fullname": "tests/benchmarks/test_benchmarks.py::test_03_near_unstable",
            "params": null,
            "param": null,
            "extra_info": {},
            "options": {
                "disable_gc": false,
                "timer": "perf_counter",
                "min_rounds": 5,
                "max_time": 1.0,
                "min_time": 5e-06,
                "warmup": false
            },
            "stats": {
                "min": 2.059999985704053e-06,
                "max": 7.122000002368623e-05,
                "mean": 2.2209103422666e-06,
                "stddev": 6.420149981175225e-07,
                "rounds": 55433,
                "median": 2.170000016121776e-06,
                "iqr": 5.100002908875467e-08,
                "q1": 2.148999982409805e-06,
                "q3": 2.2000000114985596e-06,
                "iqr_outliers": 1634,
                "stddev_outliers": 792,
                "outliers": "792;1634",
                "ld15iqr": 2.0799999731480057e-06,
                "hd15iqr": 2.27999998969608e-06,
                "ops": 450265.8126124207,
                "total": 0.12311172300286444,
                "iterations": 1
            }
        },
        {
            "group": null,
            "name": "test_04_geometrical_params",
            "fullname": "tests/benchmarks/test_benchmarks.py::test_04_geometrical_params",
            "params": null,
            "param": null,
            "extra_info": {},
            "options": {
                "disable_gc": false,
                "timer": "perf_counter",
                "min_rounds": 5,
                "max_time": 1.0,
                "min_time": 5e-06,
                "warmup": false
            },
            "stats": {
                "min": 0.45978088699999375,
                "max": 0.9836512959999766,
                "mean": 0.5775754251999956,
                "stddev": 0.22752339056559304,
                "rounds": 5,
                "median": 0.4858994440000117,
                "iqr": 0.15613654100000218,
                "q1": 0.4618153144999937,
                "q3": 0.6179518554999959,
                "iqr_outliers": 1,
                "stddev_outliers": 1,
                "outliers": "1;1",
                "ld15iqr": 0.45978088699999375,
                "hd15iqr": 0.9836512959999766,
                "ops": 1.7313756028552159,
                "total": 2.887877125999978,
                "iterations": 1
            }
        },
        {
            "group": null,
            "name": "test_05_modulation",
            "fullname": "tests/benchmarks/test_benchmarks.py::test_05_modulation",
            "params": null,
            "param": null,
            "extra_info": {},
            "options": {
                "disable_gc": false,
                "timer": "perf_counter",
                "min_rounds": 5,
                "max_time": 1.0,
                "min_time": 5e-06,
                "warmup": false
            },
            "stats": {
                "min": 0.1360153509999975,
                "max": 0.14097640099998898,
                "mean": 0.13915229224999948,
                "stddev": 0.0019690308132816583,
                "rounds": 8,
                "median": 0.14010161100000573,
                "iqr": 0.0034157800000116367,
                "q1": 0.13729795099999365,
                "q3": 0.14071373100000528,
                "iqr_outliers": 0,
                "stddev_outliers": 2,
                "outliers": "2;0",
                "ld15iqr": 0.1360153509999975,
                "hd15iqr": 0.14097640099998898,
                "ops": 7.1863710171831805,
                "total": 1.1132183379999958,
                "iterations": 1
            }
        },
        {
            "group": null,
            "name": "test_06_radiation_pressure",
            "fullname": "tests/benchmarks/test_benchmarks.py::test_06_radiation_pressure",
            "params": null,
            "param": null,
            "extra_info": {},
            "options": {
                "disable_gc": false,
                "timer": "perf_counter",
                "min_rounds": 5,
                "max_time": 1.0,
                "min_time": 5e-06,
                "warmup": false
            },
            "stats": {
                "min": 0.2788264020000213,
                "max": 0.29307242999999517,
                "mean": 0.28574268899999994,
                "stddev": 0.005675968609689059,
                "rounds": 5,
                "median": 0.2858963909999943,
                "iqr": 0.009085285499985218,
                "q1": 0.2810390445000053,
                "q3": 0.2901243299999905,
                "iqr_outliers": 0,
                "stddev_outliers": 2,
                "outliers": "2;0",
                "ld15iqr": 0.2788264020000213,
                "hd15iqr": 0.29307242999999517,
                "ops": 3.4996520943358247,
                "total": 1.4287134449999996,
                "iterations": 1
            }
        },
        {
            "group": null,
            "name": "test_07_homodyne",
            "fullname": "tests/benchmarks/test_benchmarks.py::test_07_homodyne",
            "params": null,
            "param": null,
            "extra_info": {},
            "options": {
                "disable_gc": false,
                "timer": "perf_counter",
                "min_rounds": 5,
                "max_time": 1.0,
                "min_time": 5e-06,
                "warmup": false
            },
            "stats": {
                "min": 0.09726582600001166,
                "max": 0.11052192500000046,
                "mean": 0.1020979240000031,
                "stddev": 0.0052106356972000285,
                "rounds": 5,
                "median": 0.10086471700000743,
                "iqr": 0.006666014749995952,
                "q1": 0.09832939350000203,
                "q3": 0.10499540824999798,
                "iqr_outliers": 0,
                "stddev_outliers": 1,
                "outliers": "1;0",
                "ld15iqr": 0.09726582600001166,
                "hd15iqr": 0.11052192500000046,
                "ops": 9.794518446819444,
                "total": 0.5104896200000155,
                "iterations": 1
            }
        },
        {
            "group": null,
            "name": "test_08_optical_spring",
            "fullname": "tests/benchmarks/test_benchmarks.py::test_08_optical_spring",
            "params": null,
            "param": null,
            "extra_info": {},
            "options": {
                "disable_gc": false,
                "timer": "perf_counter",
                "min_rounds": 5,
                "max_time": 1.0,
                "min_time": 5e-06,
                "warmup": false
            },
            "stats": {
                "min": 0.26166131400000836,
                "max": 0.26535757399997806,
                "mean": 0.26339274399999796,
                "stddev": 0.0015901809194424708,
                "rounds": 5,
                "median": 0.2640110840000034,
                "iqr": 0.002604874999974527,
                "q1": 0.261800079000011,
                "q3": 0.26440495399998554,
                "iqr_outliers": 0,
                "stddev_outliers": 2,
                "outliers": "2;0",
                "ld15iqr": 0.26166131400000836,
                "hd15iqr": 0.26535757399997806,
                "ops": 3.796611800361546,
                "total": 1.3169637199999897,
                "iterations": 1
            }
        },
        {
            "group": null,
            "name": "test_09_aligo_sensitivity",
            "fullname": "tests/benchmarks/test_benchmarks.py::test_09_aligo_sensitivity",
            "params": null,
            "param": null,
            "extra_info": {},
            "options": {
                "disable_gc": false,
                "timer": "perf_counter",
                "min_rounds": 5,
                "max_time": 1.0,
                "min_time": 5e-06,
                "warmup": false
            },
            "stats": {
                "min": 0.2887225409999985,
                "max": 1.1202494979999926,
                "mean": 0.45568787419999807,
                "stddev": 0.37150180267331545,
                "rounds": 5,
                "median": 0.28999458100000197,
                "iqr": 0.20877922750000977,
                "q1": 0.289034172749993,
                "q3": 0.49781340025000276,
                "iqr_outliers": 1,
                "stddev_outliers": 1,
                "outliers": "1;1",
                "ld15iqr": 0.2887225409999985,
                "hd15iqr": 1.1202494979999926,
                "ops": 2.1944845509782147,
                "total": 2.2784393709999904,
                "iterations": 1
            }
        },
        {
            "group": null,
            "name": "test_10_shifted_beam",
            "fullname": "tests/benchmarks/test_benchmarks.py::test_10_shifted_beam",
            "params": null,
            "param": null,
            "extra_info": {},
            "options": {
                "disable_gc": false,
                "timer": "perf_counter",
                "min_rounds": 5,
                "max_time": 1.0,
                "min_time": 5e-06,
                "warmup": false
            },
            "stats": {
                "min": 0.764505325000016,
                "max": 0.7707202249999909,
                "mean": 0.7682361070000013,
                "stddev": 0.0023381606596626237,
                "rounds": 5,
                "median": 0.768997435000017,
                "iqr": 0.002656510000015544,
                "q1": 0.7669340199999866,
                "q3": 0.7695905300000021,
                "iqr_outliers": 0,
                "stddev_outliers": 2,
                "outliers": "2;0",
                "ld15iqr": 0.764505325000016,
                "hd15iqr": 0.7707202249999909,
                "ops": 1.3016831555926833,
                "total": 3.8411805350000066,
                "iterations": 1
            }
        },
        {
            "group": null,
            "name": "test_angular_radiation_pressure",
            "fullname": "tests/benchmarks/test_benchmarks.py::test_angular_radiation_pressure",
            "params": null,
            "param": null,
            "extra_info": {},
            "options": {
                "disable_gc": false,
                "timer": "perf_counter",
                "min_rounds": 5,
                "max_time": 1.0,
                "min_time": 5e-06,
                "warmup": false
            },
            "stats": {
                "min": 0.3349505140000133,
                "max": 0.3393332340000086,
                "mean": 0.3370102040000063,
                "stddev": 0.0018715153854965052,
                "rounds": 5,
                "median": 0.33747794399999975,
                "iqr": 0.003186410000004969,
                "q1": 0.33517576150000394,
                "q3": 0.3383621715000089,
                "iqr_outliers": 0,
                "stddev_outliers": 2,
                "outliers": "2;0",
                "ld15iqr": 0.3349505140000133,
                "hd15iqr": 0.3393332340000086,
                "ops": 2.967269204703313,
                "total": 1.6850510200000315,
                "iterations": 1
            }
        },
        {
            "group": null,
            "name": "test_cavity_eigenmodes",
            "fullname": "tests/benchmarks/test_benchmarks.py::test_cavity_eigenmodes",
            "params": null,
            "param": null,
            "extra_info": {},
            "options": {
                "disable_gc": false,
                "timer": "perf_counter",
                "min_rounds": 5,
                "max_time": 1.0,
                "min_time": 5e-06,
                "warmup": false
            },
            "stats": {
                "min": 0.2709534230000088,
                "max": 1.3099079509999854,
                "mean": 0.48487994779999893,
                "stddev": 0.4612386584974949,
                "rounds": 5,
                "median": 0.2809685619999982,
                "iqr": 0.2670022012500013,
                "q1": 0.2750702472499995,
                "q3": 0.5420724485000008,
                "iqr_outliers": 1,
                "stddev_outliers": 1,
                "outliers": "1;1",
                "ld15iqr": 0.2709534230000088,
                "hd15iqr": 1.3099079509999854,
                "ops": 2.0623661682385666,
                "total": 2.4243997389999947,
                "iterations": 1
            }
        },
        {
            "group": null,
            "name": "test_coupled_cavity_commands",
            "fullname": "tests/benchmarks/test_benchmarks.py::test_coupled_cavity_commands",
            "params": null,
            "param": null,
            "extra_info": {},
            "options": {
                "disable_gc": false,
                "timer": "perf_counter",
                "min_rounds": 5,
                "max_time": 1.0,
                "min_time": 5e-06,
                "warmup": false
            },
            "stats": {
                "min": 6.160564998000012,
                "max": 7.417659217999983,
                "mean": 6.4201782028000025,
                "stddev": 0.5576897110936524,
                "rounds": 5,
                "median": 6.168706618000016,
                "iqr": 0.3283152515000225,
                "q1": 6.165855468749989,
                "q3": 6.494170720250011,
                "iqr_outliers": 1,
                "stddev_outliers": 1,
                "outliers": "1;1",
                "ld15iqr": 6.160564998000012,
                "hd15iqr": 7.417659217999983,
                "ops": 0.15575891640575876,
                "total": 32.10089101400001,
                "iterations": 1
            }
        },
        {
            "group": null,
            "name": "test_frequency_dependant_squeezing",
            "fullname": "tests/benchmarks/test_benchmarks.py::test_frequency_dependant_squeezing",
            "params": null,
            "param": null,
            "extra_info": {},
            "options": {
                "disable_gc": false,
                "timer": "perf_counter",
                "min_rounds": 5,
                "max_time": 1.0,
                "min_time": 5e-06,
                "warmup": false
            },
            "stats": {
                "min": 1.713767249,
                "max": 1.7554501639999955,
                "mean": 1.730178895399996,
                "stddev": 0.016584040032018202,
                "rounds": 5,
                "median": 1.7228168309999887,
                "iqr": 0.02282732699999457,
                "q1": 1.7193111005000006,
                "q3": 1.7421384274999951,
                "iqr_outliers": 0,
                "stddev_outliers": 1,
                "outliers": "1;0",
                "ld15iqr": 1.713767249,
                "hd15iqr": 1.7554501639999955,
                "ops": 0.5779749149979155,
                "total": 8.65089447699998,
                "iterations": 1
            }
        },
        {
            "group": null,
            "name": "test_lock_actions",
            "fullname": "tests/benchmarks/test_benchmarks.py::test_lock_actions",
            "params": null,
            "param": null,
            "extra_info": {},
            "options": {
                "disable_gc": false,
                "timer": "perf_counter",
                "min_rounds": 5,
                "max_time": 1.0,
                "min_time": 5e-06,
                "warmup": false
            },
            "stats": {
                "min": 3.1621604239999783,
                "max": 4.881322697999963,
                "mean": 3.5270339575999854,
                "stddev": 0.7573266430541407,
                "rounds": 5,
                "median": 3.200928259999955,
                "iqr": 0.45596998899996777,
                "q1": 3.1739847980000206,
                "q3": 3.6299547869999884,
                "iqr_outliers": 1,
                "stddev_outliers": 1,
                "outliers": "1;1",
                "ld15iqr": 3.1621604239999783,
                "hd15iqr": 4.881322697999963,
                "ops": 0.2835243470920429,
                "total": 17.635169787999928,
                "iterations": 1
            }
        }
    ],
    "datetime": "2025-01-27T09:34:14.974169+00:00",
    "version": "5.1.0"
}