{
    "machine_info": {
        "node": "runner-jhcjxvh-project-39604133-concurrent-0",
        "processor": "",
        "machine": "x86_64",
        "python_compiler": "GCC 12.2.0",
        "python_implementation": "CPython",
        "python_implementation_version": "3.13.1",
        "python_version": "3.13.1",
        "python_build": [
            "main",
            "Jan 14 2025 05:25:12"
        ],
        "release": "5.15.154+",
        "system": "Linux",
        "cpu": {
            "python_version": "3.13.1.final.0 (64 bit)",
            "cpuinfo_version": [
                9,
                0,
                0
            ],
            "cpuinfo_version_string": "9.0.0",
            "arch": "X86_64",
            "bits": 64,
            "count": 2,
            "arch_string_raw": "x86_64",
            "vendor_id_raw": "AuthenticAMD",
            "brand_raw": "AMD EPYC 7B13",
            "hz_advertised_friendly": "2.4500 GHz",
            "hz_actual_friendly": "2.4500 GHz",
            "hz_advertised": [
                2449996000,
                0
            ],
            "hz_actual": [
                2449996000,
                0
            ],
            "model": 1,
            "family": 25,
            "flags": [
                "3dnowext",
                "3dnowprefetch",
                "abm",
                "adx",
                "aes",
                "apic",
                "arat",
                "avx",
                "avx2",
                "bmi1",
                "bmi2",
                "clflush",
                "clflushopt",
                "clwb",
                "clzero",
                "cmov",
                "cmp_legacy",
                "constant_tsc",
                "cpuid",
                "cr8_legacy",
                "cx16",
                "cx8",
                "de",
                "erms",
                "extd_apicid",
                "f16c",
                "fma",
                "fpu",
                "fsgsbase",
                "fsrm",
                "fxsr",
                "fxsr_opt",
                "ht",
                "hypervisor",
                "ibpb",
                "ibrs",
                "invpcid",
                "invpcid_single",
                "lahf_lm",
                "lm",
                "mca",
                "mce",
                "misalignsse",
                "mmx",
                "mmxext",
                "movbe",
                "msr",
                "mtrr",
                "nonstop_tsc",
                "nopl",
                "npt",
                "nrip_save",
                "nx",
                "osvw",
                "osxsave",
                "pae",
                "pat",
                "pcid",
                "pclmulqdq",
                "pdpe1gb",
                "pge",
                "pni",
                "popcnt",
                "pse",
                "pse36",
                "rdpid",
                "rdrand",
                "rdrnd",
                "rdseed",
                "rdtscp",
                "rep_good",
                "sep",
                "sha",
                "sha_ni",
                "smap",
                "smep",
                "ssbd",
                "sse",
                "sse2",
                "sse4_1",
                "sse4_2",
                "sse4a",
                "ssse3",
                "stibp",
                "syscall",
                "topoext",
                "tsc",
                "tsc_adjust",
                "tsc_known_freq",
                "umip",
                "vaes",
                "vme",
                "vmmcall",
                "vpclmulqdq",
                "x2apic",
                "xgetbv1",
                "xsave",
                "xsavec",
                "xsaveerptr",
                "xsaveopt"
            ],
            "l3_cache_size": 524288,
            "l2_cache_size": 524288,
            "l1_data_cache_size": 32768,
            "l1_instruction_cache_size": 32768,
            "l2_cache_line_size": 512,
            "l2_cache_associativity": 6
        }
    },
    "commit_info": {
        "id": "94f2eea9f223f3f8814393f30aa769ff2c26984e",
        "time": "2025-01-23T14:33:56+01:00",
        "author_time": "2025-01-23T14:33:56+01:00",
        "dirty": false,
        "project": "finesse3",
        "branch": "(detached head)"
    },
    "benchmarks": [
        {
            "group": null,
            "name": "test_01_simple_cav",
            "fullname": "tests/benchmarks/test_benchmarks.py::test_01_simple_cav",
            "params": null,
            "param": null,
            "extra_info": {},
            "options": {
                "disable_gc": false,
                "timer": "perf_counter",
                "min_rounds": 5,
                "max_time": 1.0,
                "min_time": 5e-06,
                "warmup": false
            },
            "stats": {
                "min": 0.2846116219999999,
                "max": 0.4919943440000054,
                "mean": 0.3283895202000025,
                "stddev": 0.0915357821894383,
                "rounds": 5,
                "median": 0.28646327100000235,
                "iqr": 0.058561165499991574,
                "q1": 0.2848745495000067,
                "q3": 0.34343571499999825,
                "iqr_outliers": 1,
                "stddev_outliers": 1,
                "outliers": "1;1",
                "ld15iqr": 0.2846116219999999,
                "hd15iqr": 0.4919943440000054,
                "ops": 3.0451641678180215,
                "total": 1.6419476010000125,
                "iterations": 1
            }
        },
        {
            "group": null,
            "name": "test_02_pdh_lock",
            "fullname": "tests/benchmarks/test_benchmarks.py::test_02_pdh_lock",
            "params": null,
            "param": null,
            "extra_info": {},
            "options": {
                "disable_gc": false,
                "timer": "perf_counter",
                "min_rounds": 5,
                "max_time": 1.0,
                "min_time": 5e-06,
                "warmup": false
            },
            "stats": {
                "min": 1.3035643099999987,
                "max": 1.6165092299999912,
                "mean": 1.429924972799995,
                "stddev": 0.1560621876795995,
                "rounds": 5,
                "median": 1.3239808470000014,
                "iqr": 0.2748781127499953,
                "q1": 1.317159064999995,
                "q3": 1.5920371777499902,
                "iqr_outliers": 0,
                "stddev_outliers": 1,
                "outliers": "1;0",
                "ld15iqr": 1.3035643099999987,
                "hd15iqr": 1.6165092299999912,
                "ops": 0.6993373911372838,
                "total": 7.149624863999975,
                "iterations": 1
            }
        },
        {
            "group": null,
            "name": "test_03_near_unstable",
            "fullname": "tests/benchmarks/test_benchmarks.py::test_03_near_unstable",
            "params": null,
            "param": null,
            "extra_info": {},
            "options": {
                "disable_gc": false,
                "timer": "perf_counter",
                "min_rounds": 5,
                "max_time": 1.0,
                "min_time": 5e-06,
                "warmup": false
            },
            "stats": {
                "min": 2.12000000487933e-06,
                "max": 2.0590000019637955e-05,
                "mean": 2.2374192235272733e-06,
                "stddev": 4.639431821315062e-07,
                "rounds": 60717,
                "median": 2.2000000114985596e-06,
                "iqr": 3.999997488790541e-08,
                "q1": 2.180000024054607e-06,
                "q3": 2.2199999989425123e-06,
                "iqr_outliers": 1292,
                "stddev_outliers": 546,
                "outliers": "546;1292",
                "ld15iqr": 2.1289999949658522e-06,
                "hd15iqr": 2.27999998969608e-06,
                "ops": 446943.50950623734,
                "total": 0.13584938299490545,
                "iterations": 1
            }
        },
        {
            "group": null,
            "name": "test_04_geometrical_params",
            "fullname": "tests/benchmarks/test_benchmarks.py::test_04_geometrical_params",
            "params": null,
            "param": null,
            "extra_info": {},
            "options": {
                "disable_gc": false,
                "timer": "perf_counter",
                "min_rounds": 5,
                "max_time": 1.0,
                "min_time": 5e-06,
                "warmup": false
            },
            "stats": {
                "min": 0.4363587779999989,
                "max": 0.9342852449999839,
                "mean": 0.5386336701999994,
                "stddev": 0.2212085200261144,
                "rounds": 5,
                "median": 0.4390992539999843,
                "iqr": 0.13102022175000627,
                "q1": 0.43710479475000596,
                "q3": 0.5681250165000122,
                "iqr_outliers": 1,
                "stddev_outliers": 1,
                "outliers": "1;1",
                "ld15iqr": 0.4363587779999989,
                "hd15iqr": 0.9342852449999839,
                "ops": 1.8565493680123843,
                "total": 2.693168350999997,
                "iterations": 1
            }
        },
        {
            "group": null,
            "name": "test_05_modulation",
            "fullname": "tests/benchmarks/test_benchmarks.py::test_05_modulation",
            "params": null,
            "param": null,
            "extra_info": {},
            "options": {
                "disable_gc": false,
                "timer": "perf_counter",
                "min_rounds": 5,
                "max_time": 1.0,
                "min_time": 5e-06,
                "warmup": false
            },
            "stats": {
                "min": 0.13150866799998084,
                "max": 0.15644470999998816,
                "mean": 0.1361083383750028,
                "stddev": 0.008376907314317719,
                "rounds": 8,
                "median": 0.1330031470000108,
                "iqr": 0.003304670499986173,
                "q1": 0.13207442350001486,
                "q3": 0.13537909400000103,
                "iqr_outliers": 1,
                "stddev_outliers": 1,
                "outliers": "1;1",
                "ld15iqr": 0.13150866799998084,
                "hd15iqr": 0.15644470999998816,
                "ops": 7.347088443948388,
                "total": 1.0888667070000224,
                "iterations": 1
            }
        },
        {
            "group": null,
            "name": "test_06_radiation_pressure",
            "fullname": "tests/benchmarks/test_benchmarks.py::test_06_radiation_pressure",
            "params": null,
            "param": null,
            "extra_info": {},
            "options": {
                "disable_gc": false,
                "timer": "perf_counter",
                "min_rounds": 5,
                "max_time": 1.0,
                "min_time": 5e-06,
                "warmup": false
            },
            "stats": {
                "min": 0.2705631390000178,
                "max": 0.27701872099999036,
                "mean": 0.27384606099999476,
                "stddev": 0.0026136984093625155,
                "rounds": 5,
                "median": 0.27402584499998284,
                "iqr": 0.00430713499997637,
                "q1": 0.27165264000000633,
                "q3": 0.2759597749999827,
                "iqr_outliers": 0,
                "stddev_outliers": 2,
                "outliers": "2;0",
                "ld15iqr": 0.2705631390000178,
                "hd15iqr": 0.27701872099999036,
                "ops": 3.651686631344386,
                "total": 1.3692303049999737,
                "iterations": 1
            }
        },
        {
            "group": null,
            "name": "test_07_homodyne",
            "fullname": "tests/benchmarks/test_benchmarks.py::test_07_homodyne",
            "params": null,
            "param": null,
            "extra_info": {},
            "options": {
                "disable_gc": false,
                "timer": "perf_counter",
                "min_rounds": 5,
                "max_time": 1.0,
                "min_time": 5e-06,
                "warmup": false
            },
            "stats": {
                "min": 0.09266605299998787,
                "max": 0.09691662899999187,
                "mean": 0.09477635099999589,
                "stddev": 0.002088549512873466,
                "rounds": 5,
                "median": 0.09473137099999462,
                "iqr": 0.004138900999983264,
                "q1": 0.09271627300000773,
                "q3": 0.096855173999991,
                "iqr_outliers": 0,
                "stddev_outliers": 2,
                "outliers": "2;0",
                "ld15iqr": 0.09266605299998787,
                "hd15iqr": 0.09691662899999187,
                "ops": 10.5511553193269,
                "total": 0.4738817549999794,
                "iterations": 1
            }
        },
        {
            "group": null,
            "name": "test_08_optical_spring",
            "fullname": "tests/benchmarks/test_benchmarks.py::test_08_optical_spring",
            "params": null,
            "param": null,
            "extra_info": {},
            "options": {
                "disable_gc": false,
                "timer": "perf_counter",
                "min_rounds": 5,
                "max_time": 1.0,
                "min_time": 5e-06,
                "warmup": false
            },
            "stats": {
                "min": 0.2477195050000205,
                "max": 0.2800648179999996,
                "mean": 0.26179505460000885,
                "stddev": 0.015788880424942055,
                "rounds": 5,
                "median": 0.2538902850000113,
                "iqr": 0.02919000449999487,
                "q1": 0.24911578750000984,
                "q3": 0.2783057920000047,
                "iqr_outliers": 0,
                "stddev_outliers": 2,
                "outliers": "2;0",
                "ld15iqr": 0.2477195050000205,
                "hd15iqr": 0.2800648179999996,
                "ops": 3.8197818577126257,
                "total": 1.3089752730000441,
                "iterations": 1
            }
        },
        {
            "group": null,
            "name": "test_09_aligo_sensitivity",
            "fullname": "tests/benchmarks/test_benchmarks.py::test_09_aligo_sensitivity",
            "params": null,
            "param": null,
            "extra_info": {},
            "options": {
                "disable_gc": false,
                "timer": "perf_counter",
                "min_rounds": 5,
                "max_time": 1.0,
                "min_time": 5e-06,
                "warmup": false
            },
            "stats": {
                "min": 0.27628034599999296,
                "max": 1.1534828030000028,
                "mean": 0.4541489493999961,
                "stddev": 0.3909484511775472,
                "rounds": 5,
                "median": 0.28006932099998494,
                "iqr": 0.22348785900001644,
                "q1": 0.2773185679999912,
                "q3": 0.5008064270000077,
                "iqr_outliers": 1,
                "stddev_outliers": 1,
                "outliers": "1;1",
                "ld15iqr": 0.27628034599999296,
                "hd15iqr": 1.1534828030000028,
                "ops": 2.2019207604050632,
                "total": 2.2707447469999806,
                "iterations": 1
            }
        },
        {
            "group": null,
            "name": "test_10_shifted_beam",
            "fullname": "tests/benchmarks/test_benchmarks.py::test_10_shifted_beam",
            "params": null,
            "param": null,
            "extra_info": {},
            "options": {
                "disable_gc": false,
                "timer": "perf_counter",
                "min_rounds": 5,
                "max_time": 1.0,
                "min_time": 5e-06,
                "warmup": false
            },
            "stats": {
                "min": 0.7474883090000048,
                "max": 0.7602859220000084,
                "mean": 0.754005270600004,
                "stddev": 0.004696634649855103,
                "rounds": 5,
                "median": 0.7550160209999888,
                "iqr": 0.005569840499987322,
                "q1": 0.7509003965000147,
                "q3": 0.756470237000002,
                "iqr_outliers": 0,
                "stddev_outliers": 2,
                "outliers": "2;0",
                "ld15iqr": 0.7474883090000048,
                "hd15iqr": 0.7602859220000084,
                "ops": 1.326250676211115,
                "total": 3.77002635300002,
                "iterations": 1
            }
        },
        {
            "group": null,
            "name": "test_angular_radiation_pressure",
            "fullname": "tests/benchmarks/test_benchmarks.py::test_angular_radiation_pressure",
            "params": null,
            "param": null,
            "extra_info": {},
            "options": {
                "disable_gc": false,
                "timer": "perf_counter",
                "min_rounds": 5,
                "max_time": 1.0,
                "min_time": 5e-06,
                "warmup": false
            },
            "stats": {
                "min": 0.3179695890000005,
                "max": 0.3229677089999825,
                "mean": 0.32034608459999847,
                "stddev": 0.001786721071621569,
                "rounds": 5,
                "median": 0.32016562800001225,
                "iqr": 0.001740407249990028,
                "q1": 0.31948227000000173,
                "q3": 0.32122267724999176,
                "iqr_outliers": 0,
                "stddev_outliers": 2,
                "outliers": "2;0",
                "ld15iqr": 0.3179695890000005,
                "hd15iqr": 0.3229677089999825,
                "ops": 3.121623918858426,
                "total": 1.6017304229999922,
                "iterations": 1
            }
        },
        {
            "group": null,
            "name": "test_cavity_eigenmodes",
            "fullname": "tests/benchmarks/test_benchmarks.py::test_cavity_eigenmodes",
            "params": null,
            "param": null,
            "extra_info": {},
            "options": {
                "disable_gc": false,
                "timer": "perf_counter",
                "min_rounds": 5,
                "max_time": 1.0,
                "min_time": 5e-06,
                "warmup": false
            },
            "stats": {
                "min": 0.25742026800000417,
                "max": 1.255704406999996,
                "mean": 0.46233345540000526,
                "stddev": 0.44353833192438286,
                "rounds": 5,
                "median": 0.26690019700001244,
                "iqr": 0.25705878200000853,
                "q1": 0.2599770952500009,
                "q3": 0.5170358772500094,
                "iqr_outliers": 1,
                "stddev_outliers": 1,
                "outliers": "1;1",
                "ld15iqr": 0.25742026800000417,
                "hd15iqr": 1.255704406999996,
                "ops": 2.162941029510426,
                "total": 2.3116672770000264,
                "iterations": 1
            }
        },
        {
            "group": null,
            "name": "test_coupled_cavity_commands",
            "fullname": "tests/benchmarks/test_benchmarks.py::test_coupled_cavity_commands",
            "params": null,
            "param": null,
            "extra_info": {},
            "options": {
                "disable_gc": false,
                "timer": "perf_counter",
                "min_rounds": 5,
                "max_time": 1.0,
                "min_time": 5e-06,
                "warmup": false
            },
            "stats": {
                "min": 5.826148301999979,
                "max": 6.918986994999983,
                "mean": 6.055349479999995,
                "stddev": 0.4829092822986416,
                "rounds": 5,
                "median": 5.839219135999997,
                "iqr": 0.28822035399998924,
                "q1": 5.833679097750007,
                "q3": 6.1218994517499965,
                "iqr_outliers": 1,
                "stddev_outliers": 1,
                "outliers": "1;1",
                "ld15iqr": 5.826148301999979,
                "hd15iqr": 6.918986994999983,
                "ops": 0.1651432346395308,
                "total": 30.276747399999977,
                "iterations": 1
            }
        },
        {
            "group": null,
            "name": "test_frequency_dependant_squeezing",
            "fullname": "tests/benchmarks/test_benchmarks.py::test_frequency_dependant_squeezing",
            "params": null,
            "param": null,
            "extra_info": {},
            "options": {
                "disable_gc": false,
                "timer": "perf_counter",
                "min_rounds": 5,
                "max_time": 1.0,
                "min_time": 5e-06,
                "warmup": false
            },
            "stats": {
                "min": 1.6456441989999746,
                "max": 1.668689262000015,
                "mean": 1.6557596965999948,
                "stddev": 0.009635302056342386,
                "rounds": 5,
                "median": 1.657799783999991,
                "iqr": 0.015592610750019276,
                "q1": 1.6464948414999867,
                "q3": 1.662087452250006,
                "iqr_outliers": 0,
                "stddev_outliers": 2,
                "outliers": "2;0",
                "ld15iqr": 1.6456441989999746,
                "hd15iqr": 1.668689262000015,
                "ops": 0.6039523742807855,
                "total": 8.278798482999974,
                "iterations": 1
            }
        },
        {
            "group": null,
            "name": "test_lock_actions",
            "fullname": "tests/benchmarks/test_benchmarks.py::test_lock_actions",
            "params": null,
            "param": null,
            "extra_info": {},
            "options": {
                "disable_gc": false,
                "timer": "perf_counter",
                "min_rounds": 5,
                "max_time": 1.0,
                "min_time": 5e-06,
                "warmup": false
            },
            "stats": {
                "min": 3.102380576999991,
                "max": 4.760478075999998,
                "mean": 3.447581750400002,
                "stddev": 0.7341088285163978,
                "rounds": 5,
                "median": 3.121347872000001,
                "iqr": 0.44130788649999886,
                "q1": 3.1073417235000065,
                "q3": 3.5486496100000053,
                "iqr_outliers": 1,
                "stddev_outliers": 1,
                "outliers": "1;1",
                "ld15iqr": 3.102380576999991,
                "hd15iqr": 4.760478075999998,
                "ops": 0.2900583865441265,
                "total": 17.23790875200001,
                "iterations": 1
            }
        }
    ],
    "datetime": "2025-01-23T13:40:49.295153+00:00",
    "version": "5.1.0"
}