{
    "machine_info": {
        "node": "runner-ykxhnyexq-project-39604133-concurrent-0",
        "processor": "",
        "machine": "x86_64",
        "python_compiler": "GCC 12.2.0",
        "python_implementation": "CPython",
        "python_implementation_version": "3.12.5",
        "python_version": "3.12.5",
        "python_build": [
            "main",
            "Sep  5 2024 00:16:34"
        ],
        "release": "5.15.154+",
        "system": "Linux",
        "cpu": {
            "python_version": "3.12.5.final.0 (64 bit)",
            "cpuinfo_version": [
                9,
                0,
                0
            ],
            "cpuinfo_version_string": "9.0.0",
            "arch": "X86_64",
            "bits": 64,
            "count": 2,
            "arch_string_raw": "x86_64",
            "vendor_id_raw": "AuthenticAMD",
            "brand_raw": "AMD EPYC 7B13",
            "hz_advertised_friendly": "2.4500 GHz",
            "hz_actual_friendly": "2.4500 GHz",
            "hz_advertised": [
                2449998000,
                0
            ],
            "hz_actual": [
                2449998000,
                0
            ],
            "model": 1,
            "family": 25,
            "flags": [
                "3dnowext",
                "3dnowprefetch",
                "abm",
                "adx",
                "aes",
                "apic",
                "arat",
                "avx",
                "avx2",
                "bmi1",
                "bmi2",
                "clflush",
                "clflushopt",
                "clwb",
                "clzero",
                "cmov",
                "cmp_legacy",
                "constant_tsc",
                "cpuid",
                "cr8_legacy",
                "cx16",
                "cx8",
                "de",
                "erms",
                "extd_apicid",
                "f16c",
                "fma",
                "fpu",
                "fsgsbase",
                "fsrm",
                "fxsr",
                "fxsr_opt",
                "ht",
                "hypervisor",
                "ibpb",
                "ibrs",
                "invpcid",
                "invpcid_single",
                "lahf_lm",
                "lm",
                "mca",
                "mce",
                "misalignsse",
                "mmx",
                "mmxext",
                "movbe",
                "msr",
                "mtrr",
                "nonstop_tsc",
                "nopl",
                "npt",
                "nrip_save",
                "nx",
                "osvw",
                "osxsave",
                "pae",
                "pat",
                "pcid",
                "pclmulqdq",
                "pdpe1gb",
                "pge",
                "pni",
                "popcnt",
                "pse",
                "pse36",
                "rdpid",
                "rdrand",
                "rdrnd",
                "rdseed",
                "rdtscp",
                "rep_good",
                "sep",
                "sha",
                "sha_ni",
                "smap",
                "smep",
                "ssbd",
                "sse",
                "sse2",
                "sse4_1",
                "sse4_2",
                "sse4a",
                "ssse3",
                "stibp",
                "syscall",
                "topoext",
                "tsc",
                "tsc_adjust",
                "tsc_known_freq",
                "umip",
                "vaes",
                "vme",
                "vmmcall",
                "vpclmulqdq",
                "x2apic",
                "xgetbv1",
                "xsave",
                "xsavec",
                "xsaveerptr",
                "xsaveopt"
            ],
            "l3_cache_size": 524288,
            "l2_cache_size": 524288,
            "l1_data_cache_size": 32768,
            "l1_instruction_cache_size": 32768,
            "l2_cache_line_size": 512,
            "l2_cache_associativity": 6
        }
    },
    "commit_info": {
        "id": "71d97a4f0ea5f6d144ae5733af08748a4309ad51",
        "time": "2024-09-05T11:37:22+02:00",
        "author_time": "2024-09-05T11:37:22+02:00",
        "dirty": false,
        "project": "finesse3",
        "branch": "(detached head)"
    },
    "benchmarks": [
        {
            "group": null,
            "name": "test_01_simple_cav",
            "fullname": "tests/benchmarks/test_benchmarks.py::test_01_simple_cav",
            "params": null,
            "param": null,
            "extra_info": {},
            "options": {
                "disable_gc": false,
                "timer": "perf_counter",
                "min_rounds": 5,
                "max_time": 1.0,
                "min_time": 5e-06,
                "warmup": false
            },
            "stats": {
                "min": 0.28307290399999374,
                "max": 0.48961660599999846,
                "mean": 0.3617086701999881,
                "stddev": 0.10755473533875037,
                "rounds": 5,
                "median": 0.28372886399998265,
                "iqr": 0.190882252250006,
                "q1": 0.28319192899998313,
                "q3": 0.4740741812499891,
                "iqr_outliers": 0,
                "stddev_outliers": 1,
                "outliers": "1;0",
                "ld15iqr": 0.28307290399999374,
                "hd15iqr": 0.48961660599999846,
                "ops": 2.7646558747046392,
                "total": 1.8085433509999405,
                "iterations": 1
            }
        },
        {
            "group": null,
            "name": "test_02_pdh_lock",
            "fullname": "tests/benchmarks/test_benchmarks.py::test_02_pdh_lock",
            "params": null,
            "param": null,
            "extra_info": {},
            "options": {
                "disable_gc": false,
                "timer": "perf_counter",
                "min_rounds": 5,
                "max_time": 1.0,
                "min_time": 5e-06,
                "warmup": false
            },
            "stats": {
                "min": 1.2053533770000229,
                "max": 1.500934352999991,
                "mean": 1.2788811140000007,
                "stddev": 0.12504059428335723,
                "rounds": 5,
                "median": 1.221379657,
                "iqr": 0.09450389774998769,
                "q1": 1.216060836000004,
                "q3": 1.3105647337499917,
                "iqr_outliers": 1,
                "stddev_outliers": 1,
                "outliers": "1;1",
                "ld15iqr": 1.2053533770000229,
                "hd15iqr": 1.500934352999991,
                "ops": 0.7819335112958744,
                "total": 6.3944055700000035,
                "iterations": 1
            }
        },
        {
            "group": null,
            "name": "test_03_near_unstable",
            "fullname": "tests/benchmarks/test_benchmarks.py::test_03_near_unstable",
            "params": null,
            "param": null,
            "extra_info": {},
            "options": {
                "disable_gc": false,
                "timer": "perf_counter",
                "min_rounds": 5,
                "max_time": 1.0,
                "min_time": 5e-06,
                "warmup": false
            },
            "stats": {
                "min": 1.879999985021641e-06,
                "max": 0.0006531200000097215,
                "mean": 2.1046907765889894e-06,
                "stddev": 2.7188540362370024e-06,
                "rounds": 60791,
                "median": 2.0500000061929313e-06,
                "iqr": 9.999999406318238e-08,
                "q1": 1.9800000075065327e-06,
                "q3": 2.080000001569715e-06,
                "iqr_outliers": 1336,
                "stddev_outliers": 384,
                "outliers": "384;1336",
                "ld15iqr": 1.879999985021641e-06,
                "hd15iqr": 2.2300000068753434e-06,
                "ops": 475129.17865334626,
                "total": 0.12794625699962126,
                "iterations": 1
            }
        },
        {
            "group": null,
            "name": "test_04_geometrical_params",
            "fullname": "tests/benchmarks/test_benchmarks.py::test_04_geometrical_params",
            "params": null,
            "param": null,
            "extra_info": {},
            "options": {
                "disable_gc": false,
                "timer": "perf_counter",
                "min_rounds": 5,
                "max_time": 1.0,
                "min_time": 5e-06,
                "warmup": false
            },
            "stats": {
                "min": 0.4819300020000128,
                "max": 0.8799534910000091,
                "mean": 0.5680575550000129,
                "stddev": 0.17443146705316373,
                "rounds": 5,
                "median": 0.49237943400001427,
                "iqr": 0.10395497724999814,
                "q1": 0.48801726600001416,
                "q3": 0.5919722432500123,
                "iqr_outliers": 1,
                "stddev_outliers": 1,
                "outliers": "1;1",
                "ld15iqr": 0.4819300020000128,
                "hd15iqr": 0.8799534910000091,
                "ops": 1.760385001833093,
                "total": 2.840287775000064,
                "iterations": 1
            }
        },
        {
            "group": null,
            "name": "test_05_modulation",
            "fullname": "tests/benchmarks/test_benchmarks.py::test_05_modulation",
            "params": null,
            "param": null,
            "extra_info": {},
            "options": {
                "disable_gc": false,
                "timer": "perf_counter",
                "min_rounds": 5,
                "max_time": 1.0,
                "min_time": 5e-06,
                "warmup": false
            },
            "stats": {
                "min": 0.1221055179999837,
                "max": 0.5702426960000082,
                "mean": 0.1880760818749927,
                "stddev": 0.15479202896729116,
                "rounds": 8,
                "median": 0.13436803499999428,
                "iqr": 0.023900908500010587,
                "q1": 0.12393063849998498,
                "q3": 0.14783154699999557,
                "iqr_outliers": 1,
                "stddev_outliers": 1,
                "outliers": "1;1",
                "ld15iqr": 0.1221055179999837,
                "hd15iqr": 0.5702426960000082,
                "ops": 5.316997196191398,
                "total": 1.5046086549999416,
                "iterations": 1
            }
        },
        {
            "group": null,
            "name": "test_06_radiation_pressure",
            "fullname": "tests/benchmarks/test_benchmarks.py::test_06_radiation_pressure",
            "params": null,
            "param": null,
            "extra_info": {},
            "options": {
                "disable_gc": false,
                "timer": "perf_counter",
                "min_rounds": 5,
                "max_time": 1.0,
                "min_time": 5e-06,
                "warmup": false
            },
            "stats": {
                "min": 0.25129283699999405,
                "max": 0.26610202899999535,
                "mean": 0.25894274259999295,
                "stddev": 0.0061194960028456485,
                "rounds": 5,
                "median": 0.26083602899998937,
                "iqr": 0.0100172994999852,
                "q1": 0.25334676525000077,
                "q3": 0.26336406474998597,
                "iqr_outliers": 0,
                "stddev_outliers": 2,
                "outliers": "2;0",
                "ld15iqr": 0.25129283699999405,
                "hd15iqr": 0.26610202899999535,
                "ops": 3.8618576058907754,
                "total": 1.2947137129999646,
                "iterations": 1
            }
        },
        {
            "group": null,
            "name": "test_07_homodyne",
            "fullname": "tests/benchmarks/test_benchmarks.py::test_07_homodyne",
            "params": null,
            "param": null,
            "extra_info": {},
            "options": {
                "disable_gc": false,
                "timer": "perf_counter",
                "min_rounds": 5,
                "max_time": 1.0,
                "min_time": 5e-06,
                "warmup": false
            },
            "stats": {
                "min": 0.08263503300000252,
                "max": 0.6404360660000066,
                "mean": 0.13891105636363674,
                "stddev": 0.16639674907245108,
                "rounds": 11,
                "median": 0.08935689300000149,
                "iqr": 0.009553344249972895,
                "q1": 0.08443287225001228,
                "q3": 0.09398621649998518,
                "iqr_outliers": 1,
                "stddev_outliers": 1,
                "outliers": "1;1",
                "ld15iqr": 0.08263503300000252,
                "hd15iqr": 0.6404360660000066,
                "ops": 7.198851021492726,
                "total": 1.528021620000004,
                "iterations": 1
            }
        },
        {
            "group": null,
            "name": "test_08_optical_spring",
            "fullname": "tests/benchmarks/test_benchmarks.py::test_08_optical_spring",
            "params": null,
            "param": null,
            "extra_info": {},
            "options": {
                "disable_gc": false,
                "timer": "perf_counter",
                "min_rounds": 5,
                "max_time": 1.0,
                "min_time": 5e-06,
                "warmup": false
            },
            "stats": {
                "min": 0.2302177249999886,
                "max": 0.23613155599997526,
                "mean": 0.23333767479999779,
                "stddev": 0.00224030449358747,
                "rounds": 5,
                "median": 0.23342534400001114,
                "iqr": 0.003155473499987238,
                "q1": 0.23180857925000709,
                "q3": 0.23496405274999432,
                "iqr_outliers": 0,
                "stddev_outliers": 2,
                "outliers": "2;0",
                "ld15iqr": 0.2302177249999886,
                "hd15iqr": 0.23613155599997526,
                "ops": 4.285634545973497,
                "total": 1.166688373999989,
                "iterations": 1
            }
        },
        {
            "group": null,
            "name": "test_09_aligo_sensitivity",
            "fullname": "tests/benchmarks/test_benchmarks.py::test_09_aligo_sensitivity",
            "params": null,
            "param": null,
            "extra_info": {},
            "options": {
                "disable_gc": false,
                "timer": "perf_counter",
                "min_rounds": 5,
                "max_time": 1.0,
                "min_time": 5e-06,
                "warmup": false
            },
            "stats": {
                "min": 0.25622139799997967,
                "max": 0.9092737060000218,
                "mean": 0.3907478223999988,
                "stddev": 0.2898923150558489,
                "rounds": 5,
                "median": 0.2636941499999921,
                "iqr": 0.16912672850001798,
                "q1": 0.2578297204999913,
                "q3": 0.4269564490000093,
                "iqr_outliers": 1,
                "stddev_outliers": 1,
                "outliers": "1;1",
                "ld15iqr": 0.25622139799997967,
                "hd15iqr": 0.9092737060000218,
                "ops": 2.5591953241298553,
                "total": 1.9537391119999938,
                "iterations": 1
            }
        },
        {
            "group": null,
            "name": "test_10_shifted_beam",
            "fullname": "tests/benchmarks/test_benchmarks.py::test_10_shifted_beam",
            "params": null,
            "param": null,
            "extra_info": {},
            "options": {
                "disable_gc": false,
                "timer": "perf_counter",
                "min_rounds": 5,
                "max_time": 1.0,
                "min_time": 5e-06,
                "warmup": false
            },
            "stats": {
                "min": 0.7281967590000136,
                "max": 1.5003300149999745,
                "mean": 0.8886088629999961,
                "stddev": 0.3420581802070211,
                "rounds": 5,
                "median": 0.7359476700000016,
                "iqr": 0.20725063874996863,
                "q1": 0.7294042290000107,
                "q3": 0.9366548677499793,
                "iqr_outliers": 1,
                "stddev_outliers": 1,
                "outliers": "1;1",
                "ld15iqr": 0.7281967590000136,
                "hd15iqr": 1.5003300149999745,
                "ops": 1.125354519449582,
                "total": 4.44304431499998,
                "iterations": 1
            }
        },
        {
            "group": null,
            "name": "test_angular_radiation_pressure",
            "fullname": "tests/benchmarks/test_benchmarks.py::test_angular_radiation_pressure",
            "params": null,
            "param": null,
            "extra_info": {},
            "options": {
                "disable_gc": false,
                "timer": "perf_counter",
                "min_rounds": 5,
                "max_time": 1.0,
                "min_time": 5e-06,
                "warmup": false
            },
            "stats": {
                "min": 0.29412727299998664,
                "max": 0.31418982699997855,
                "mean": 0.30435627359999556,
                "stddev": 0.007847451020593265,
                "rounds": 5,
                "median": 0.30656984600000214,
                "iqr": 0.011592247499997654,
                "q1": 0.2978289220000008,
                "q3": 0.3094211694999984,
                "iqr_outliers": 0,
                "stddev_outliers": 2,
                "outliers": "2;0",
                "ld15iqr": 0.29412727299998664,
                "hd15iqr": 0.31418982699997855,
                "ops": 3.2856230895843592,
                "total": 1.5217813679999779,
                "iterations": 1
            }
        },
        {
            "group": null,
            "name": "test_cavity_eigenmodes",
            "fullname": "tests/benchmarks/test_benchmarks.py::test_cavity_eigenmodes",
            "params": null,
            "param": null,
            "extra_info": {},
            "options": {
                "disable_gc": false,
                "timer": "perf_counter",
                "min_rounds": 5,
                "max_time": 1.0,
                "min_time": 5e-06,
                "warmup": false
            },
            "stats": {
                "min": 0.2792402110000012,
                "max": 1.267210059000007,
                "mean": 0.47977904560000867,
                "stddev": 0.44019986100390635,
                "rounds": 5,
                "median": 0.2848269530000209,
                "iqr": 0.2523392277499994,
                "q1": 0.27999342175000663,
                "q3": 0.532332649500006,
                "iqr_outliers": 1,
                "stddev_outliers": 1,
                "outliers": "1;1",
                "ld15iqr": 0.2792402110000012,
                "hd15iqr": 1.267210059000007,
                "ops": 2.0842927784588974,
                "total": 2.3988952280000433,
                "iterations": 1
            }
        },
        {
            "group": null,
            "name": "test_coupled_cavity_commands",
            "fullname": "tests/benchmarks/test_benchmarks.py::test_coupled_cavity_commands",
            "params": null,
            "param": null,
            "extra_info": {},
            "options": {
                "disable_gc": false,
                "timer": "perf_counter",
                "min_rounds": 5,
                "max_time": 1.0,
                "min_time": 5e-06,
                "warmup": false
            },
            "stats": {
                "min": 4.363843353000021,
                "max": 5.751609610000003,
                "mean": 4.886460377000003,
                "stddev": 0.676055202923588,
                "rounds": 5,
                "median": 4.428422721999993,
                "iqr": 1.1617340207500035,
                "q1": 4.391724435,
                "q3": 5.553458455750004,
                "iqr_outliers": 0,
                "stddev_outliers": 1,
                "outliers": "1;0",
                "ld15iqr": 4.363843353000021,
                "hd15iqr": 5.751609610000003,
                "ops": 0.20464711117005735,
                "total": 24.432301885000015,
                "iterations": 1
            }
        },
        {
            "group": null,
            "name": "test_frequency_dependant_squeezing",
            "fullname": "tests/benchmarks/test_benchmarks.py::test_frequency_dependant_squeezing",
            "params": null,
            "param": null,
            "extra_info": {},
            "options": {
                "disable_gc": false,
                "timer": "perf_counter",
                "min_rounds": 5,
                "max_time": 1.0,
                "min_time": 5e-06,
                "warmup": false
            },
            "stats": {
                "min": 1.5531953410000199,
                "max": 2.9632933180000123,
                "mean": 1.8444790236000017,
                "stddev": 0.6255132635918368,
                "rounds": 5,
                "median": 1.567615791999998,
                "iqr": 0.36771942000002156,
                "q1": 1.5575603724999851,
                "q3": 1.9252797925000067,
                "iqr_outliers": 1,
                "stddev_outliers": 1,
                "outliers": "1;1",
                "ld15iqr": 1.5531953410000199,
                "hd15iqr": 2.9632933180000123,
                "ops": 0.5421585104547454,
                "total": 9.222395118000009,
                "iterations": 1
            }
        },
        {
            "group": null,
            "name": "test_lock_actions",
            "fullname": "tests/benchmarks/test_benchmarks.py::test_lock_actions",
            "params": null,
            "param": null,
            "extra_info": {},
            "options": {
                "disable_gc": false,
                "timer": "perf_counter",
                "min_rounds": 5,
                "max_time": 1.0,
                "min_time": 5e-06,
                "warmup": false
            },
            "stats": {
                "min": 3.178564530999978,
                "max": 4.5503257239999755,
                "mean": 3.4732115689999885,
                "stddev": 0.6025782957841636,
                "rounds": 5,
                "median": 3.1984131050000144,
                "iqr": 0.37702536600000514,
                "q1": 3.1921315307499825,
                "q3": 3.5691568967499876,
                "iqr_outliers": 1,
                "stddev_outliers": 1,
                "outliers": "1;1",
                "ld15iqr": 3.178564530999978,
                "hd15iqr": 4.5503257239999755,
                "ops": 0.2879179629958221,
                "total": 17.366057844999943,
                "iterations": 1
            }
        }
    ],
    "datetime": "2024-09-05T09:44:08.063007",
    "version": "4.0.0"
}