{
    "machine_info": {
        "node": "runner-j1aldqxs-project-39604133-concurrent-0",
        "processor": "",
        "machine": "x86_64",
        "python_compiler": "GCC 12.2.0",
        "python_implementation": "CPython",
        "python_implementation_version": "3.12.3",
        "python_version": "3.12.3",
        "python_build": [
            "main",
            "Apr 10 2024 14:35:18"
        ],
        "release": "5.4.109+",
        "system": "Linux",
        "cpu": {
            "python_version": "3.12.3.final.0 (64 bit)",
            "cpuinfo_version": [
                9,
                0,
                0
            ],
            "cpuinfo_version_string": "9.0.0",
            "arch": "X86_64",
            "bits": 64,
            "count": 2,
            "arch_string_raw": "x86_64",
            "vendor_id_raw": "AuthenticAMD",
            "brand_raw": "AMD EPYC 7B13",
            "hz_advertised_friendly": "2.4500 GHz",
            "hz_actual_friendly": "2.4500 GHz",
            "hz_advertised": [
                2450000000,
                0
            ],
            "hz_actual": [
                2450000000,
                0
            ],
            "model": 1,
            "family": 25,
            "flags": [
                "3dnowext",
                "3dnowprefetch",
                "abm",
                "adx",
                "aes",
                "apic",
                "arat",
                "avx",
                "avx2",
                "bmi1",
                "bmi2",
                "clflush",
                "clflushopt",
                "clwb",
                "clzero",
                "cmov",
                "cmp_legacy",
                "constant_tsc",
                "cpuid",
                "cr8_legacy",
                "cx16",
                "cx8",
                "de",
                "erms",
                "extd_apicid",
                "f16c",
                "fma",
                "fpu",
                "fsgsbase",
                "fxsr",
                "fxsr_opt",
                "ht",
                "hypervisor",
                "ibpb",
                "ibrs",
                "invpcid",
                "invpcid_single",
                "lahf_lm",
                "lm",
                "mca",
                "mce",
                "misalignsse",
                "mmx",
                "mmxext",
                "movbe",
                "msr",
                "mtrr",
                "nonstop_tsc",
                "nopl",
                "npt",
                "nrip_save",
                "nx",
                "osvw",
                "osxsave",
                "pae",
                "pat",
                "pcid",
                "pclmulqdq",
                "pdpe1gb",
                "pge",
                "pni",
                "popcnt",
                "pse",
                "pse36",
                "rdpid",
                "rdrand",
                "rdrnd",
                "rdseed",
                "rdtscp",
                "rep_good",
                "sep",
                "sha",
                "sha_ni",
                "smap",
                "smep",
                "ssbd",
                "sse",
                "sse2",
                "sse4_1",
                "sse4_2",
                "sse4a",
                "ssse3",
                "stibp",
                "syscall",
                "topoext",
                "tsc",
                "tsc_adjust",
                "tsc_known_freq",
                "umip",
                "vaes",
                "vme",
                "vmmcall",
                "vpclmulqdq",
                "x2apic",
                "xgetbv1",
                "xsave",
                "xsavec",
                "xsaveerptr",
                "xsaveopt"
            ],
            "l3_cache_size": 524288,
            "l2_cache_size": 524288,
            "l1_data_cache_size": 32768,
            "l1_instruction_cache_size": 32768,
            "l2_cache_line_size": 512,
            "l2_cache_associativity": 6
        }
    },
    "commit_info": {
        "id": "c9526e8308ec9fec8a21d1e9e20964b94eae2bae",
        "time": "2024-04-22T18:46:15-05:00",
        "author_time": "2024-04-22T18:46:15-05:00",
        "dirty": false,
        "project": "finesse3",
        "branch": "(detached head)"
    },
    "benchmarks": [
        {
            "group": null,
            "name": "test_01_simple_cav",
            "fullname": "tests/benchmarks/test_benchmarks.py::test_01_simple_cav",
            "params": null,
            "param": null,
            "extra_info": {},
            "options": {
                "disable_gc": false,
                "timer": "perf_counter",
                "min_rounds": 5,
                "max_time": 1.0,
                "min_time": 5e-06,
                "warmup": false
            },
            "stats": {
                "min": 0.3569844719999935,
                "max": 0.5243611119999798,
                "mean": 0.39460219359999654,
                "stddev": 0.07259973215913211,
                "rounds": 5,
                "median": 0.36363470899999584,
                "iqr": 0.04244220774998553,
                "q1": 0.361958597250009,
                "q3": 0.40440080499999453,
                "iqr_outliers": 1,
                "stddev_outliers": 1,
                "outliers": "1;1",
                "ld15iqr": 0.3569844719999935,
                "hd15iqr": 0.5243611119999798,
                "ops": 2.534197772386658,
                "total": 1.9730109679999828,
                "iterations": 1
            }
        },
        {
            "group": null,
            "name": "test_02_pdh_lock",
            "fullname": "tests/benchmarks/test_benchmarks.py::test_02_pdh_lock",
            "params": null,
            "param": null,
            "extra_info": {},
            "options": {
                "disable_gc": false,
                "timer": "perf_counter",
                "min_rounds": 5,
                "max_time": 1.0,
                "min_time": 5e-06,
                "warmup": false
            },
            "stats": {
                "min": 1.3009626840000124,
                "max": 1.5718814960000032,
                "mean": 1.361315369800002,
                "stddev": 0.11780220666340205,
                "rounds": 5,
                "median": 1.3117697079999857,
                "iqr": 0.07056108275000383,
                "q1": 1.3070610915000032,
                "q3": 1.377622174250007,
                "iqr_outliers": 1,
                "stddev_outliers": 1,
                "outliers": "1;1",
                "ld15iqr": 1.3009626840000124,
                "hd15iqr": 1.5718814960000032,
                "ops": 0.7345836403411176,
                "total": 6.80657684900001,
                "iterations": 1
            }
        },
        {
            "group": null,
            "name": "test_03_near_unstable",
            "fullname": "tests/benchmarks/test_benchmarks.py::test_03_near_unstable",
            "params": null,
            "param": null,
            "extra_info": {},
            "options": {
                "disable_gc": false,
                "timer": "perf_counter",
                "min_rounds": 5,
                "max_time": 1.0,
                "min_time": 5e-06,
                "warmup": false
            },
            "stats": {
                "min": 1.6900000048281072e-06,
                "max": 0.00010009999999738284,
                "mean": 2.51260878037743e-06,
                "stddev": 1.0860370919825534e-06,
                "rounds": 57538,
                "median": 2.599999987751289e-06,
                "iqr": 1.3999999737279722e-06,
                "q1": 1.780000019380168e-06,
                "q3": 3.17999999310814e-06,
                "iqr_outliers": 332,
                "stddev_outliers": 504,
                "outliers": "504;332",
                "ld15iqr": 1.6900000048281072e-06,
                "hd15iqr": 5.319999985431423e-06,
                "ops": 397992.71888629865,
                "total": 0.14457048400535655,
                "iterations": 1
            }
        },
        {
            "group": null,
            "name": "test_04_geometrical_params",
            "fullname": "tests/benchmarks/test_benchmarks.py::test_04_geometrical_params",
            "params": null,
            "param": null,
            "extra_info": {},
            "options": {
                "disable_gc": false,
                "timer": "perf_counter",
                "min_rounds": 5,
                "max_time": 1.0,
                "min_time": 5e-06,
                "warmup": false
            },
            "stats": {
                "min": 0.5044413710000129,
                "max": 0.8522816220000209,
                "mean": 0.5745090014000084,
                "stddev": 0.15528067103717766,
                "rounds": 5,
                "median": 0.5056146510000019,
                "iqr": 0.08779335850001502,
                "q1": 0.5045214559999991,
                "q3": 0.5923148145000141,
                "iqr_outliers": 1,
                "stddev_outliers": 1,
                "outliers": "1;1",
                "ld15iqr": 0.5044413710000129,
                "hd15iqr": 0.8522816220000209,
                "ops": 1.7406167659046627,
                "total": 2.872545007000042,
                "iterations": 1
            }
        },
        {
            "group": null,
            "name": "test_05_modulation",
            "fullname": "tests/benchmarks/test_benchmarks.py::test_05_modulation",
            "params": null,
            "param": null,
            "extra_info": {},
            "options": {
                "disable_gc": false,
                "timer": "perf_counter",
                "min_rounds": 5,
                "max_time": 1.0,
                "min_time": 5e-06,
                "warmup": false
            },
            "stats": {
                "min": 0.16917845700001521,
                "max": 0.5780118879999918,
                "mean": 0.22299708562499987,
                "stddev": 0.14345644611773703,
                "rounds": 8,
                "median": 0.17287426500000436,
                "iqr": 0.001874857000032648,
                "q1": 0.17182202399997948,
                "q3": 0.17369688100001213,
                "iqr_outliers": 1,
                "stddev_outliers": 1,
                "outliers": "1;1",
                "ld15iqr": 0.16917845700001521,
                "hd15iqr": 0.5780118879999918,
                "ops": 4.484363538641204,
                "total": 1.783976684999999,
                "iterations": 1
            }
        },
        {
            "group": null,
            "name": "test_06_radiation_pressure",
            "fullname": "tests/benchmarks/test_benchmarks.py::test_06_radiation_pressure",
            "params": null,
            "param": null,
            "extra_info": {},
            "options": {
                "disable_gc": false,
                "timer": "perf_counter",
                "min_rounds": 5,
                "max_time": 1.0,
                "min_time": 5e-06,
                "warmup": false
            },
            "stats": {
                "min": 0.23551837000002251,
                "max": 0.23953902200000243,
                "mean": 0.23774289320000436,
                "stddev": 0.0017255102055243918,
                "rounds": 5,
                "median": 0.2377175109999996,
                "iqr": 0.003026370249990862,
                "q1": 0.23634632500000663,
                "q3": 0.2393726952499975,
                "iqr_outliers": 0,
                "stddev_outliers": 2,
                "outliers": "2;0",
                "ld15iqr": 0.23551837000002251,
                "hd15iqr": 0.23953902200000243,
                "ops": 4.206224575380837,
                "total": 1.1887144660000217,
                "iterations": 1
            }
        },
        {
            "group": null,
            "name": "test_07_homodyne",
            "fullname": "tests/benchmarks/test_benchmarks.py::test_07_homodyne",
            "params": null,
            "param": null,
            "extra_info": {},
            "options": {
                "disable_gc": false,
                "timer": "perf_counter",
                "min_rounds": 5,
                "max_time": 1.0,
                "min_time": 5e-06,
                "warmup": false
            },
            "stats": {
                "min": 0.1113345210000034,
                "max": 0.11909527599999592,
                "mean": 0.11390898749999678,
                "stddev": 0.0022879746554199075,
                "rounds": 10,
                "median": 0.11348418200000765,
                "iqr": 0.0024760210000067673,
                "q1": 0.11247384199998578,
                "q3": 0.11494986299999255,
                "iqr_outliers": 1,
                "stddev_outliers": 3,
                "outliers": "3;1",
                "ld15iqr": 0.1113345210000034,
                "hd15iqr": 0.11909527599999592,
                "ops": 8.778938536347084,
                "total": 1.1390898749999678,
                "iterations": 1
            }
        },
        {
            "group": null,
            "name": "test_08_optical_spring",
            "fullname": "tests/benchmarks/test_benchmarks.py::test_08_optical_spring",
            "params": null,
            "param": null,
            "extra_info": {},
            "options": {
                "disable_gc": false,
                "timer": "perf_counter",
                "min_rounds": 5,
                "max_time": 1.0,
                "min_time": 5e-06,
                "warmup": false
            },
            "stats": {
                "min": 0.28904671399999415,
                "max": 0.293488477000011,
                "mean": 0.29111408139999073,
                "stddev": 0.0016573847593220018,
                "rounds": 5,
                "median": 0.29102266599997506,
                "iqr": 0.0021943572500049413,
                "q1": 0.28997442649998817,
                "q3": 0.2921687837499931,
                "iqr_outliers": 0,
                "stddev_outliers": 2,
                "outliers": "2;0",
                "ld15iqr": 0.28904671399999415,
                "hd15iqr": 0.293488477000011,
                "ops": 3.4350794547310137,
                "total": 1.4555704069999535,
                "iterations": 1
            }
        },
        {
            "group": null,
            "name": "test_09_aligo_sensitivity",
            "fullname": "tests/benchmarks/test_benchmarks.py::test_09_aligo_sensitivity",
            "params": null,
            "param": null,
            "extra_info": {},
            "options": {
                "disable_gc": false,
                "timer": "perf_counter",
                "min_rounds": 5,
                "max_time": 1.0,
                "min_time": 5e-06,
                "warmup": false
            },
            "stats": {
                "min": 0.31001961800001254,
                "max": 0.9023981039999853,
                "mean": 0.4308119541999929,
                "stddev": 0.2636354298356893,
                "rounds": 5,
                "median": 0.31434629999998265,
                "iqr": 0.15164150124998343,
                "q1": 0.310967370500002,
                "q3": 0.46260887174998544,
                "iqr_outliers": 1,
                "stddev_outliers": 1,
                "outliers": "1;1",
                "ld15iqr": 0.31001961800001254,
                "hd15iqr": 0.9023981039999853,
                "ops": 2.3211983563849223,
                "total": 2.1540597709999645,
                "iterations": 1
            }
        },
        {
            "group": null,
            "name": "test_10_shifted_beam",
            "fullname": "tests/benchmarks/test_benchmarks.py::test_10_shifted_beam",
            "params": null,
            "param": null,
            "extra_info": {},
            "options": {
                "disable_gc": false,
                "timer": "perf_counter",
                "min_rounds": 5,
                "max_time": 1.0,
                "min_time": 5e-06,
                "warmup": false
            },
            "stats": {
                "min": 0.712637113999989,
                "max": 0.717260686000003,
                "mean": 0.7153122193999991,
                "stddev": 0.0019318296650771255,
                "rounds": 5,
                "median": 0.7158694160000039,
                "iqr": 0.0031823727500039922,
                "q1": 0.7136937439999969,
                "q3": 0.7168761167500008,
                "iqr_outliers": 0,
                "stddev_outliers": 2,
                "outliers": "2;0",
                "ld15iqr": 0.712637113999989,
                "hd15iqr": 0.717260686000003,
                "ops": 1.3979909372145156,
                "total": 3.5765610969999955,
                "iterations": 1
            }
        },
        {
            "group": null,
            "name": "test_angular_radiation_pressure",
            "fullname": "tests/benchmarks/test_benchmarks.py::test_angular_radiation_pressure",
            "params": null,
            "param": null,
            "extra_info": {},
            "options": {
                "disable_gc": false,
                "timer": "perf_counter",
                "min_rounds": 5,
                "max_time": 1.0,
                "min_time": 5e-06,
                "warmup": false
            },
            "stats": {
                "min": 0.3355512339999791,
                "max": 0.34520166999999446,
                "mean": 0.3396907165999892,
                "stddev": 0.0035972508349891535,
                "rounds": 5,
                "median": 0.3388372959999799,
                "iqr": 0.004366187249978282,
                "q1": 0.3374847880000047,
                "q3": 0.341850975249983,
                "iqr_outliers": 0,
                "stddev_outliers": 2,
                "outliers": "2;0",
                "ld15iqr": 0.3355512339999791,
                "hd15iqr": 0.34520166999999446,
                "ops": 2.9438543684947787,
                "total": 1.6984535829999459,
                "iterations": 1
            }
        },
        {
            "group": null,
            "name": "test_cavity_eigenmodes",
            "fullname": "tests/benchmarks/test_benchmarks.py::test_cavity_eigenmodes",
            "params": null,
            "param": null,
            "extra_info": {},
            "options": {
                "disable_gc": false,
                "timer": "perf_counter",
                "min_rounds": 5,
                "max_time": 1.0,
                "min_time": 5e-06,
                "warmup": false
            },
            "stats": {
                "min": 0.25690330400001926,
                "max": 0.2745135149999953,
                "mean": 0.26247975119999867,
                "stddev": 0.007205400233234179,
                "rounds": 5,
                "median": 0.2593549449999841,
                "iqr": 0.008703880749990844,
                "q1": 0.25768528400000434,
                "q3": 0.2663891647499952,
                "iqr_outliers": 0,
                "stddev_outliers": 1,
                "outliers": "1;0",
                "ld15iqr": 0.25690330400001926,
                "hd15iqr": 0.2745135149999953,
                "ops": 3.8098176923294993,
                "total": 1.3123987559999932,
                "iterations": 1
            }
        },
        {
            "group": null,
            "name": "test_coupled_cavity_commands",
            "fullname": "tests/benchmarks/test_benchmarks.py::test_coupled_cavity_commands",
            "params": null,
            "param": null,
            "extra_info": {},
            "options": {
                "disable_gc": false,
                "timer": "perf_counter",
                "min_rounds": 5,
                "max_time": 1.0,
                "min_time": 5e-06,
                "warmup": false
            },
            "stats": {
                "min": 4.252944826000004,
                "max": 5.429903700000011,
                "mean": 4.7122773624000045,
                "stddev": 0.5834639426412412,
                "rounds": 5,
                "median": 4.343363378000021,
                "iqr": 1.039372029500008,
                "q1": 4.266360641499993,
                "q3": 5.305732671000001,
                "iqr_outliers": 0,
                "stddev_outliers": 1,
                "outliers": "1;0",
                "ld15iqr": 4.252944826000004,
                "hd15iqr": 5.429903700000011,
                "ops": 0.21221161724883936,
                "total": 23.561386812000023,
                "iterations": 1
            }
        },
        {
            "group": null,
            "name": "test_frequency_dependant_squeezing",
            "fullname": "tests/benchmarks/test_benchmarks.py::test_frequency_dependant_squeezing",
            "params": null,
            "param": null,
            "extra_info": {},
            "options": {
                "disable_gc": false,
                "timer": "perf_counter",
                "min_rounds": 5,
                "max_time": 1.0,
                "min_time": 5e-06,
                "warmup": false
            },
            "stats": {
                "min": 1.4891768839999884,
                "max": 2.773961130999993,
                "mean": 1.7732033661999935,
                "stddev": 0.5600223312171745,
                "rounds": 5,
                "median": 1.5350817609999865,
                "iqr": 0.35601075049999764,
                "q1": 1.5053107722499988,
                "q3": 1.8613215227499964,
                "iqr_outliers": 1,
                "stddev_outliers": 1,
                "outliers": "1;1",
                "ld15iqr": 1.4891768839999884,
                "hd15iqr": 2.773961130999993,
                "ops": 0.5639511062642623,
                "total": 8.866016830999968,
                "iterations": 1
            }
        },
        {
            "group": null,
            "name": "test_lock_actions",
            "fullname": "tests/benchmarks/test_benchmarks.py::test_lock_actions",
            "params": null,
            "param": null,
            "extra_info": {},
            "options": {
                "disable_gc": false,
                "timer": "perf_counter",
                "min_rounds": 5,
                "max_time": 1.0,
                "min_time": 5e-06,
                "warmup": false
            },
            "stats": {
                "min": 4.853418102999996,
                "max": 5.118584510999995,
                "mean": 4.964300917399998,
                "stddev": 0.09983803135886561,
                "rounds": 5,
                "median": 4.958366017000003,
                "iqr": 0.12472459399999991,
                "q1": 4.893314013249999,
                "q3": 5.0180386072499985,
                "iqr_outliers": 0,
                "stddev_outliers": 2,
                "outliers": "2;0",
                "ld15iqr": 4.853418102999996,
                "hd15iqr": 5.118584510999995,
                "ops": 0.20143823201671257,
                "total": 24.821504586999993,
                "iterations": 1
            }
        }
    ],
    "datetime": "2024-04-22T23:59:19.699296",
    "version": "4.0.0"
}