{
    "machine_info": {
        "node": "runner--azerasq-project-39604133-concurrent-0",
        "processor": "",
        "machine": "x86_64",
        "python_compiler": "GCC 12.2.0",
        "python_implementation": "CPython",
        "python_implementation_version": "3.12.6",
        "python_version": "3.12.6",
        "python_build": [
            "main",
            "Sep 27 2024 06:10:24"
        ],
        "release": "5.15.154+",
        "system": "Linux",
        "cpu": {
            "python_version": "3.12.6.final.0 (64 bit)",
            "cpuinfo_version": [
                9,
                0,
                0
            ],
            "cpuinfo_version_string": "9.0.0",
            "arch": "X86_64",
            "bits": 64,
            "count": 2,
            "arch_string_raw": "x86_64",
            "vendor_id_raw": "AuthenticAMD",
            "brand_raw": "AMD EPYC 7B13",
            "hz_advertised_friendly": "2.4500 GHz",
            "hz_actual_friendly": "2.4500 GHz",
            "hz_advertised": [
                2449998000,
                0
            ],
            "hz_actual": [
                2449998000,
                0
            ],
            "model": 1,
            "family": 25,
            "flags": [
                "3dnowext",
                "3dnowprefetch",
                "abm",
                "adx",
                "aes",
                "apic",
                "arat",
                "avx",
                "avx2",
                "bmi1",
                "bmi2",
                "clflush",
                "clflushopt",
                "clwb",
                "clzero",
                "cmov",
                "cmp_legacy",
                "constant_tsc",
                "cpuid",
                "cr8_legacy",
                "cx16",
                "cx8",
                "de",
                "erms",
                "extd_apicid",
                "f16c",
                "fma",
                "fpu",
                "fsgsbase",
                "fsrm",
                "fxsr",
                "fxsr_opt",
                "ht",
                "hypervisor",
                "ibpb",
                "ibrs",
                "invpcid",
                "invpcid_single",
                "lahf_lm",
                "lm",
                "mca",
                "mce",
                "misalignsse",
                "mmx",
                "mmxext",
                "movbe",
                "msr",
                "mtrr",
                "nonstop_tsc",
                "nopl",
                "npt",
                "nrip_save",
                "nx",
                "osvw",
                "osxsave",
                "pae",
                "pat",
                "pcid",
                "pclmulqdq",
                "pdpe1gb",
                "pge",
                "pni",
                "popcnt",
                "pse",
                "pse36",
                "rdpid",
                "rdrand",
                "rdrnd",
                "rdseed",
                "rdtscp",
                "rep_good",
                "sep",
                "sha",
                "sha_ni",
                "smap",
                "smep",
                "ssbd",
                "sse",
                "sse2",
                "sse4_1",
                "sse4_2",
                "sse4a",
                "ssse3",
                "stibp",
                "syscall",
                "topoext",
                "tsc",
                "tsc_adjust",
                "tsc_known_freq",
                "umip",
                "vaes",
                "vme",
                "vmmcall",
                "vpclmulqdq",
                "x2apic",
                "xgetbv1",
                "xsave",
                "xsavec",
                "xsaveerptr",
                "xsaveopt"
            ],
            "l3_cache_size": 524288,
            "l2_cache_size": 524288,
            "l1_data_cache_size": 32768,
            "l1_instruction_cache_size": 32768,
            "l2_cache_line_size": 512,
            "l2_cache_associativity": 6
        }
    },
    "commit_info": {
        "id": "c00abc11e2d2646bcd91fe2b9283a34e77e5a0a6",
        "time": "2024-09-27T06:42:16+00:00",
        "author_time": "2024-09-27T06:42:16+00:00",
        "dirty": false,
        "project": "finesse3",
        "branch": "(detached head)"
    },
    "benchmarks": [
        {
            "group": null,
            "name": "test_01_simple_cav",
            "fullname": "tests/benchmarks/test_benchmarks.py::test_01_simple_cav",
            "params": null,
            "param": null,
            "extra_info": {},
            "options": {
                "disable_gc": false,
                "timer": "perf_counter",
                "min_rounds": 5,
                "max_time": 1.0,
                "min_time": 5e-06,
                "warmup": false
            },
            "stats": {
                "min": 0.2991520599999973,
                "max": 0.49439302000000396,
                "mean": 0.343337495199998,
                "stddev": 0.08462708686936378,
                "rounds": 5,
                "median": 0.30460083299999496,
                "iqr": 0.05669345774999712,
                "q1": 0.30279949224999925,
                "q3": 0.35949294999999637,
                "iqr_outliers": 1,
                "stddev_outliers": 1,
                "outliers": "1;1",
                "ld15iqr": 0.2991520599999973,
                "hd15iqr": 0.49439302000000396,
                "ops": 2.9125860530248486,
                "total": 1.71668747599999,
                "iterations": 1
            }
        },
        {
            "group": null,
            "name": "test_02_pdh_lock",
            "fullname": "tests/benchmarks/test_benchmarks.py::test_02_pdh_lock",
            "params": null,
            "param": null,
            "extra_info": {},
            "options": {
                "disable_gc": false,
                "timer": "perf_counter",
                "min_rounds": 5,
                "max_time": 1.0,
                "min_time": 5e-06,
                "warmup": false
            },
            "stats": {
                "min": 1.3604010269999947,
                "max": 1.8131496700000014,
                "mean": 1.462895931999998,
                "stddev": 0.19630129359416307,
                "rounds": 5,
                "median": 1.3816779320000023,
                "iqr": 0.1366566940000169,
                "q1": 1.3630846267499876,
                "q3": 1.4997413207500045,
                "iqr_outliers": 1,
                "stddev_outliers": 1,
                "outliers": "1;1",
                "ld15iqr": 1.3604010269999947,
                "hd15iqr": 1.8131496700000014,
                "ops": 0.6835756242980663,
                "total": 7.314479659999989,
                "iterations": 1
            }
        },
        {
            "group": null,
            "name": "test_03_near_unstable",
            "fullname": "tests/benchmarks/test_benchmarks.py::test_03_near_unstable",
            "params": null,
            "param": null,
            "extra_info": {},
            "options": {
                "disable_gc": false,
                "timer": "perf_counter",
                "min_rounds": 5,
                "max_time": 1.0,
                "min_time": 5e-06,
                "warmup": false
            },
            "stats": {
                "min": 2.2999999771400326e-06,
                "max": 6.975100001227474e-05,
                "mean": 2.4643770132865373e-06,
                "stddev": 7.000495611739999e-07,
                "rounds": 51099,
                "median": 2.3899999916920933e-06,
                "iqr": 4.000000330961484e-08,
                "q1": 2.3700000042481406e-06,
                "q3": 2.4100000075577555e-06,
                "iqr_outliers": 3833,
                "stddev_outliers": 989,
                "outliers": "989;3833",
                "ld15iqr": 2.310000013494573e-06,
                "hd15iqr": 2.4700000267330324e-06,
                "ops": 405782.06768224237,
                "total": 0.12592720100192878,
                "iterations": 1
            }
        },
        {
            "group": null,
            "name": "test_04_geometrical_params",
            "fullname": "tests/benchmarks/test_benchmarks.py::test_04_geometrical_params",
            "params": null,
            "param": null,
            "extra_info": {},
            "options": {
                "disable_gc": false,
                "timer": "perf_counter",
                "min_rounds": 5,
                "max_time": 1.0,
                "min_time": 5e-06,
                "warmup": false
            },
            "stats": {
                "min": 0.5230667289999928,
                "max": 0.9238557969999874,
                "mean": 0.6247328910000022,
                "stddev": 0.16842402004508863,
                "rounds": 5,
                "median": 0.5601809040000205,
                "iqr": 0.1273900057500157,
                "q1": 0.5358806972499934,
                "q3": 0.6632707030000091,
                "iqr_outliers": 1,
                "stddev_outliers": 1,
                "outliers": "1;1",
                "ld15iqr": 0.5230667289999928,
                "hd15iqr": 0.9238557969999874,
                "ops": 1.6006840914031475,
                "total": 3.1236644550000108,
                "iterations": 1
            }
        },
        {
            "group": null,
            "name": "test_05_modulation",
            "fullname": "tests/benchmarks/test_benchmarks.py::test_05_modulation",
            "params": null,
            "param": null,
            "extra_info": {},
            "options": {
                "disable_gc": false,
                "timer": "perf_counter",
                "min_rounds": 5,
                "max_time": 1.0,
                "min_time": 5e-06,
                "warmup": false
            },
            "stats": {
                "min": 0.13743237199997793,
                "max": 0.14395270299999652,
                "mean": 0.14024380071428158,
                "stddev": 0.002015454031836645,
                "rounds": 7,
                "median": 0.14006553499999086,
                "iqr": 0.0017472907500106771,
                "q1": 0.13926684349999618,
                "q3": 0.14101413425000686,
                "iqr_outliers": 1,
                "stddev_outliers": 2,
                "outliers": "2;1",
                "ld15iqr": 0.13743237199997793,
                "hd15iqr": 0.14395270299999652,
                "ops": 7.130439954613738,
                "total": 0.981706604999971,
                "iterations": 1
            }
        },
        {
            "group": null,
            "name": "test_06_radiation_pressure",
            "fullname": "tests/benchmarks/test_benchmarks.py::test_06_radiation_pressure",
            "params": null,
            "param": null,
            "extra_info": {},
            "options": {
                "disable_gc": false,
                "timer": "perf_counter",
                "min_rounds": 5,
                "max_time": 1.0,
                "min_time": 5e-06,
                "warmup": false
            },
            "stats": {
                "min": 0.28159204499999646,
                "max": 0.8430193400000121,
                "mean": 0.396337948799993,
                "stddev": 0.24971459624507836,
                "rounds": 5,
                "median": 0.2862672709999856,
                "iqr": 0.14388734824999716,
                "q1": 0.28268690699999155,
                "q3": 0.4265742552499887,
                "iqr_outliers": 1,
                "stddev_outliers": 1,
                "outliers": "1;1",
                "ld15iqr": 0.28159204499999646,
                "hd15iqr": 0.8430193400000121,
                "ops": 2.5230992970209813,
                "total": 1.981689743999965,
                "iterations": 1
            }
        },
        {
            "group": null,
            "name": "test_07_homodyne",
            "fullname": "tests/benchmarks/test_benchmarks.py::test_07_homodyne",
            "params": null,
            "param": null,
            "extra_info": {},
            "options": {
                "disable_gc": false,
                "timer": "perf_counter",
                "min_rounds": 5,
                "max_time": 1.0,
                "min_time": 5e-06,
                "warmup": false
            },
            "stats": {
                "min": 0.09627429200000392,
                "max": 0.10800170800001752,
                "mean": 0.10010475530000348,
                "stddev": 0.003966792011910257,
                "rounds": 10,
                "median": 0.09851670449999972,
                "iqr": 0.006329040999986546,
                "q1": 0.09682999000000336,
                "q3": 0.10315903099998991,
                "iqr_outliers": 0,
                "stddev_outliers": 1,
                "outliers": "1;0",
                "ld15iqr": 0.09627429200000392,
                "hd15iqr": 0.10800170800001752,
                "ops": 9.989535432189056,
                "total": 1.001047553000035,
                "iterations": 1
            }
        },
        {
            "group": null,
            "name": "test_08_optical_spring",
            "fullname": "tests/benchmarks/test_benchmarks.py::test_08_optical_spring",
            "params": null,
            "param": null,
            "extra_info": {},
            "options": {
                "disable_gc": false,
                "timer": "perf_counter",
                "min_rounds": 5,
                "max_time": 1.0,
                "min_time": 5e-06,
                "warmup": false
            },
            "stats": {
                "min": 0.2536863960000062,
                "max": 0.8655418740000016,
                "mean": 0.3815418875999967,
                "stddev": 0.2706116240516177,
                "rounds": 5,
                "median": 0.2603133469999932,
                "iqr": 0.1588195297499979,
                "q1": 0.25855670174999545,
                "q3": 0.41737623149999337,
                "iqr_outliers": 1,
                "stddev_outliers": 1,
                "outliers": "1;1",
                "ld15iqr": 0.2536863960000062,
                "hd15iqr": 0.8655418740000016,
                "ops": 2.620944206913361,
                "total": 1.9077094379999835,
                "iterations": 1
            }
        },
        {
            "group": null,
            "name": "test_09_aligo_sensitivity",
            "fullname": "tests/benchmarks/test_benchmarks.py::test_09_aligo_sensitivity",
            "params": null,
            "param": null,
            "extra_info": {},
            "options": {
                "disable_gc": false,
                "timer": "perf_counter",
                "min_rounds": 5,
                "max_time": 1.0,
                "min_time": 5e-06,
                "warmup": false
            },
            "stats": {
                "min": 0.2893378330000189,
                "max": 0.2965255019999802,
                "mean": 0.2922985400000016,
                "stddev": 0.002815648290310627,
                "rounds": 5,
                "median": 0.29144055600002616,
                "iqr": 0.003985845499975937,
                "q1": 0.29031079750000544,
                "q3": 0.2942966429999814,
                "iqr_outliers": 0,
                "stddev_outliers": 2,
                "outliers": "2;0",
                "ld15iqr": 0.2893378330000189,
                "hd15iqr": 0.2965255019999802,
                "ops": 3.421159749891308,
                "total": 1.461492700000008,
                "iterations": 1
            }
        },
        {
            "group": null,
            "name": "test_10_shifted_beam",
            "fullname": "tests/benchmarks/test_benchmarks.py::test_10_shifted_beam",
            "params": null,
            "param": null,
            "extra_info": {},
            "options": {
                "disable_gc": false,
                "timer": "perf_counter",
                "min_rounds": 5,
                "max_time": 1.0,
                "min_time": 5e-06,
                "warmup": false
            },
            "stats": {
                "min": 0.7979446600000131,
                "max": 0.8196049279999897,
                "mean": 0.8077109622000023,
                "stddev": 0.009411602946018255,
                "rounds": 5,
                "median": 0.8107250629999783,
                "iqr": 0.015761932000003753,
                "q1": 0.7981677925000099,
                "q3": 0.8139297245000137,
                "iqr_outliers": 0,
                "stddev_outliers": 3,
                "outliers": "3;0",
                "ld15iqr": 0.7979446600000131,
                "hd15iqr": 0.8196049279999897,
                "ops": 1.2380666436372865,
                "total": 4.038554811000012,
                "iterations": 1
            }
        },
        {
            "group": null,
            "name": "test_angular_radiation_pressure",
            "fullname": "tests/benchmarks/test_benchmarks.py::test_angular_radiation_pressure",
            "params": null,
            "param": null,
            "extra_info": {},
            "options": {
                "disable_gc": false,
                "timer": "perf_counter",
                "min_rounds": 5,
                "max_time": 1.0,
                "min_time": 5e-06,
                "warmup": false
            },
            "stats": {
                "min": 0.3382948309999847,
                "max": 0.34221193999999855,
                "mean": 0.34045713679999495,
                "stddev": 0.0019027919954505254,
                "rounds": 5,
                "median": 0.3412564619999898,
                "iqr": 0.0035799255000128483,
                "q1": 0.3384693027499921,
                "q3": 0.34204922825000494,
                "iqr_outliers": 0,
                "stddev_outliers": 2,
                "outliers": "2;0",
                "ld15iqr": 0.3382948309999847,
                "hd15iqr": 0.34221193999999855,
                "ops": 2.9372273097258064,
                "total": 1.7022856839999747,
                "iterations": 1
            }
        },
        {
            "group": null,
            "name": "test_cavity_eigenmodes",
            "fullname": "tests/benchmarks/test_benchmarks.py::test_cavity_eigenmodes",
            "params": null,
            "param": null,
            "extra_info": {},
            "options": {
                "disable_gc": false,
                "timer": "perf_counter",
                "min_rounds": 5,
                "max_time": 1.0,
                "min_time": 5e-06,
                "warmup": false
            },
            "stats": {
                "min": 0.2891017229999875,
                "max": 0.30246531400001686,
                "mean": 0.29482173459999783,
                "stddev": 0.004839895240522135,
                "rounds": 5,
                "median": 0.2940226389999907,
                "iqr": 0.004543114000014725,
                "q1": 0.292368946499991,
                "q3": 0.29691206050000574,
                "iqr_outliers": 0,
                "stddev_outliers": 2,
                "outliers": "2;0",
                "ld15iqr": 0.2891017229999875,
                "hd15iqr": 0.30246531400001686,
                "ops": 3.3918801860275307,
                "total": 1.4741086729999893,
                "iterations": 1
            }
        },
        {
            "group": null,
            "name": "test_coupled_cavity_commands",
            "fullname": "tests/benchmarks/test_benchmarks.py::test_coupled_cavity_commands",
            "params": null,
            "param": null,
            "extra_info": {},
            "options": {
                "disable_gc": false,
                "timer": "perf_counter",
                "min_rounds": 5,
                "max_time": 1.0,
                "min_time": 5e-06,
                "warmup": false
            },
            "stats": {
                "min": 6.091893777999985,
                "max": 7.327353772999999,
                "mean": 6.435164961599997,
                "stddev": 0.5043794307131632,
                "rounds": 5,
                "median": 6.231340936999999,
                "iqr": 0.36366561925001406,
                "q1": 6.192536754249993,
                "q3": 6.556202373500007,
                "iqr_outliers": 1,
                "stddev_outliers": 1,
                "outliers": "1;1",
                "ld15iqr": 6.091893777999985,
                "hd15iqr": 7.327353772999999,
                "ops": 0.15539617181023538,
                "total": 32.17582480799999,
                "iterations": 1
            }
        },
        {
            "group": null,
            "name": "test_frequency_dependant_squeezing",
            "fullname": "tests/benchmarks/test_benchmarks.py::test_frequency_dependant_squeezing",
            "params": null,
            "param": null,
            "extra_info": {},
            "options": {
                "disable_gc": false,
                "timer": "perf_counter",
                "min_rounds": 5,
                "max_time": 1.0,
                "min_time": 5e-06,
                "warmup": false
            },
            "stats": {
                "min": 1.6865391899999906,
                "max": 1.7407865819999984,
                "mean": 1.7109414387999948,
                "stddev": 0.022666672199446524,
                "rounds": 5,
                "median": 1.701407549999999,
                "iqr": 0.036547766999994735,
                "q1": 1.694882039999996,
                "q3": 1.7314298069999907,
                "iqr_outliers": 0,
                "stddev_outliers": 2,
                "outliers": "2;0",
                "ld15iqr": 1.6865391899999906,
                "hd15iqr": 1.7407865819999984,
                "ops": 0.5844735403108661,
                "total": 8.554707193999974,
                "iterations": 1
            }
        },
        {
            "group": null,
            "name": "test_lock_actions",
            "fullname": "tests/benchmarks/test_benchmarks.py::test_lock_actions",
            "params": null,
            "param": null,
            "extra_info": {},
            "options": {
                "disable_gc": false,
                "timer": "perf_counter",
                "min_rounds": 5,
                "max_time": 1.0,
                "min_time": 5e-06,
                "warmup": false
            },
            "stats": {
                "min": 3.1750773900000127,
                "max": 3.226025303,
                "mean": 3.1914716085999997,
                "stddev": 0.02173844315029745,
                "rounds": 5,
                "median": 3.178986729999991,
                "iqr": 0.029692244749988106,
                "q1": 3.1767674467500058,
                "q3": 3.206459691499994,
                "iqr_outliers": 0,
                "stddev_outliers": 1,
                "outliers": "1;0",
                "ld15iqr": 3.1750773900000127,
                "hd15iqr": 3.226025303,
                "ops": 0.3133350763031444,
                "total": 15.957358043,
                "iterations": 1
            }
        }
    ],
    "datetime": "2024-09-30T07:09:16.650126",
    "version": "4.0.0"
}