{
    "machine_info": {
        "node": "runner--azerasq-project-39604133-concurrent-0",
        "processor": "",
        "machine": "x86_64",
        "python_compiler": "GCC 12.2.0",
        "python_implementation": "CPython",
        "python_implementation_version": "3.12.1",
        "python_version": "3.12.1",
        "python_build": [
            "main",
            "Jan 17 2024 06:18:08"
        ],
        "release": "5.4.109+",
        "system": "Linux",
        "cpu": {
            "python_version": "3.12.1.final.0 (64 bit)",
            "cpuinfo_version": [
                9,
                0,
                0
            ],
            "cpuinfo_version_string": "9.0.0",
            "arch": "X86_64",
            "bits": 64,
            "count": 2,
            "arch_string_raw": "x86_64",
            "vendor_id_raw": "AuthenticAMD",
            "brand_raw": "AMD EPYC 7B12",
            "hz_advertised_friendly": "2.2500 GHz",
            "hz_actual_friendly": "2.2500 GHz",
            "hz_advertised": [
                2249998000,
                0
            ],
            "hz_actual": [
                2249998000,
                0
            ],
            "model": 49,
            "family": 23,
            "flags": [
                "3dnowext",
                "3dnowprefetch",
                "abm",
                "adx",
                "aes",
                "apic",
                "arat",
                "avx",
                "avx2",
                "bmi1",
                "bmi2",
                "clflush",
                "clflushopt",
                "clwb",
                "clzero",
                "cmov",
                "cmp_legacy",
                "constant_tsc",
                "cpuid",
                "cr8_legacy",
                "cx16",
                "cx8",
                "de",
                "extd_apicid",
                "f16c",
                "fma",
                "fpu",
                "fsgsbase",
                "fxsr",
                "fxsr_opt",
                "ht",
                "hypervisor",
                "ibpb",
                "ibrs",
                "lahf_lm",
                "lm",
                "mca",
                "mce",
                "misalignsse",
                "mmx",
                "mmxext",
                "movbe",
                "msr",
                "mtrr",
                "nonstop_tsc",
                "nopl",
                "npt",
                "nrip_save",
                "nx",
                "osvw",
                "osxsave",
                "pae",
                "pat",
                "pclmulqdq",
                "pdpe1gb",
                "pge",
                "pni",
                "popcnt",
                "pse",
                "pse36",
                "rdpid",
                "rdrand",
                "rdrnd",
                "rdseed",
                "rdtscp",
                "rep_good",
                "sep",
                "sha",
                "sha_ni",
                "smap",
                "smep",
                "ssbd",
                "sse",
                "sse2",
                "sse4_1",
                "sse4_2",
                "sse4a",
                "ssse3",
                "stibp",
                "syscall",
                "topoext",
                "tsc",
                "tsc_adjust",
                "tsc_known_freq",
                "umip",
                "vme",
                "vmmcall",
                "x2apic",
                "xgetbv1",
                "xsave",
                "xsavec",
                "xsaveerptr",
                "xsaveopt"
            ],
            "l3_cache_size": 524288,
            "l2_cache_size": 524288,
            "l1_data_cache_size": 32768,
            "l1_instruction_cache_size": 32768,
            "l2_cache_line_size": 512,
            "l2_cache_associativity": 6
        }
    },
    "commit_info": {
        "id": "19e249cba5424442408345acbdfba3c867fa546c",
        "time": "2024-01-17T14:08:09+01:00",
        "author_time": "2024-01-17T14:08:09+01:00",
        "dirty": false,
        "project": "finesse3",
        "branch": "(detached head)"
    },
    "benchmarks": [
        {
            "group": null,
            "name": "test_01_simple_cav",
            "fullname": "tests/benchmarks/test_benchmarks.py::test_01_simple_cav",
            "params": null,
            "param": null,
            "extra_info": {},
            "options": {
                "disable_gc": false,
                "timer": "perf_counter",
                "min_rounds": 5,
                "max_time": 1.0,
                "min_time": 5e-06,
                "warmup": false
            },
            "stats": {
                "min": 0.37005457899999783,
                "max": 0.5416291629999961,
                "mean": 0.4065838159999998,
                "stddev": 0.07551826459292389,
                "rounds": 5,
                "median": 0.37296693100000766,
                "iqr": 0.045106485749997205,
                "q1": 0.37200787749999975,
                "q3": 0.41711436324999696,
                "iqr_outliers": 1,
                "stddev_outliers": 1,
                "outliers": "1;1",
                "ld15iqr": 0.37005457899999783,
                "hd15iqr": 0.5416291629999961,
                "ops": 2.4595174737599503,
                "total": 2.032919079999999,
                "iterations": 1
            }
        },
        {
            "group": null,
            "name": "test_02_pdh_lock",
            "fullname": "tests/benchmarks/test_benchmarks.py::test_02_pdh_lock",
            "params": null,
            "param": null,
            "extra_info": {},
            "options": {
                "disable_gc": false,
                "timer": "perf_counter",
                "min_rounds": 5,
                "max_time": 1.0,
                "min_time": 5e-06,
                "warmup": false
            },
            "stats": {
                "min": 1.3090790990000016,
                "max": 1.5757727750000043,
                "mean": 1.3761806056000068,
                "stddev": 0.11312952726912567,
                "rounds": 5,
                "median": 1.332897628000012,
                "iqr": 0.10023274349999411,
                "q1": 1.3091726847500098,
                "q3": 1.409405428250004,
                "iqr_outliers": 1,
                "stddev_outliers": 1,
                "outliers": "1;1",
                "ld15iqr": 1.3090790990000016,
                "hd15iqr": 1.5757727750000043,
                "ops": 0.726648810432847,
                "total": 6.880903028000034,
                "iterations": 1
            }
        },
        {
            "group": null,
            "name": "test_03_near_unstable",
            "fullname": "tests/benchmarks/test_benchmarks.py::test_03_near_unstable",
            "params": null,
            "param": null,
            "extra_info": {},
            "options": {
                "disable_gc": false,
                "timer": "perf_counter",
                "min_rounds": 5,
                "max_time": 1.0,
                "min_time": 5e-06,
                "warmup": false
            },
            "stats": {
                "min": 1.7490000061570754e-06,
                "max": 0.00012126100000386941,
                "mean": 2.6806227562348155e-06,
                "stddev": 1.2225062997381191e-06,
                "rounds": 46686,
                "median": 3.1399999897985253e-06,
                "iqr": 1.3500000193289452e-06,
                "q1": 1.839999981712026e-06,
                "q3": 3.1900000010409713e-06,
                "iqr_outliers": 290,
                "stddev_outliers": 353,
                "outliers": "353;290",
                "ld15iqr": 1.7490000061570754e-06,
                "hd15iqr": 5.39100000196413e-06,
                "ops": 373047.6426323386,
                "total": 0.1251475539975786,
                "iterations": 1
            }
        },
        {
            "group": null,
            "name": "test_04_geometrical_params",
            "fullname": "tests/benchmarks/test_benchmarks.py::test_04_geometrical_params",
            "params": null,
            "param": null,
            "extra_info": {},
            "options": {
                "disable_gc": false,
                "timer": "perf_counter",
                "min_rounds": 5,
                "max_time": 1.0,
                "min_time": 5e-06,
                "warmup": false
            },
            "stats": {
                "min": 0.5218236479999803,
                "max": 0.8930958509999982,
                "mean": 0.5986542825999948,
                "stddev": 0.1646186181864259,
                "rounds": 5,
                "median": 0.526807811999987,
                "iqr": 0.09661567275001914,
                "q1": 0.5228861392499908,
                "q3": 0.61950181200001,
                "iqr_outliers": 1,
                "stddev_outliers": 1,
                "outliers": "1;1",
                "ld15iqr": 0.5218236479999803,
                "hd15iqr": 0.8930958509999982,
                "ops": 1.6704131734545262,
                "total": 2.993271412999974,
                "iterations": 1
            }
        },
        {
            "group": null,
            "name": "test_05_modulation",
            "fullname": "tests/benchmarks/test_benchmarks.py::test_05_modulation",
            "params": null,
            "param": null,
            "extra_info": {},
            "options": {
                "disable_gc": false,
                "timer": "perf_counter",
                "min_rounds": 5,
                "max_time": 1.0,
                "min_time": 5e-06,
                "warmup": false
            },
            "stats": {
                "min": 0.17151624299998502,
                "max": 0.6155601460000071,
                "mean": 0.2312627782499952,
                "stddev": 0.1552939243051261,
                "rounds": 8,
                "median": 0.1775001930000002,
                "iqr": 0.001521116500015296,
                "q1": 0.17624580449998462,
                "q3": 0.1777669209999999,
                "iqr_outliers": 2,
                "stddev_outliers": 1,
                "outliers": "1;2",
                "ld15iqr": 0.17549959599998033,
                "hd15iqr": 0.6155601460000071,
                "ops": 4.324085387052643,
                "total": 1.8501022259999615,
                "iterations": 1
            }
        },
        {
            "group": null,
            "name": "test_06_radiation_pressure",
            "fullname": "tests/benchmarks/test_benchmarks.py::test_06_radiation_pressure",
            "params": null,
            "param": null,
            "extra_info": {},
            "options": {
                "disable_gc": false,
                "timer": "perf_counter",
                "min_rounds": 5,
                "max_time": 1.0,
                "min_time": 5e-06,
                "warmup": false
            },
            "stats": {
                "min": 0.23744965899999215,
                "max": 0.2528397469999959,
                "mean": 0.246104273200001,
                "stddev": 0.005939689218569129,
                "rounds": 5,
                "median": 0.247250245999993,
                "iqr": 0.008499763000010319,
                "q1": 0.2419044370000023,
                "q3": 0.2504042000000126,
                "iqr_outliers": 0,
                "stddev_outliers": 2,
                "outliers": "2;0",
                "ld15iqr": 0.23744965899999215,
                "hd15iqr": 0.2528397469999959,
                "ops": 4.063318312182789,
                "total": 1.230521366000005,
                "iterations": 1
            }
        },
        {
            "group": null,
            "name": "test_07_homodyne",
            "fullname": "tests/benchmarks/test_benchmarks.py::test_07_homodyne",
            "params": null,
            "param": null,
            "extra_info": {},
            "options": {
                "disable_gc": false,
                "timer": "perf_counter",
                "min_rounds": 5,
                "max_time": 1.0,
                "min_time": 5e-06,
                "warmup": false
            },
            "stats": {
                "min": 0.11277022800001646,
                "max": 0.11804003399998919,
                "mean": 0.11583286511111623,
                "stddev": 0.0015874534799598483,
                "rounds": 9,
                "median": 0.11629783800000837,
                "iqr": 0.0016848939999931645,
                "q1": 0.1150327982500059,
                "q3": 0.11671769224999906,
                "iqr_outliers": 0,
                "stddev_outliers": 2,
                "outliers": "2;0",
                "ld15iqr": 0.11277022800001646,
                "hd15iqr": 0.11804003399998919,
                "ops": 8.63312842206501,
                "total": 1.042495786000046,
                "iterations": 1
            }
        },
        {
            "group": null,
            "name": "test_08_optical_spring",
            "fullname": "tests/benchmarks/test_benchmarks.py::test_08_optical_spring",
            "params": null,
            "param": null,
            "extra_info": {},
            "options": {
                "disable_gc": false,
                "timer": "perf_counter",
                "min_rounds": 5,
                "max_time": 1.0,
                "min_time": 5e-06,
                "warmup": false
            },
            "stats": {
                "min": 0.30430992600000195,
                "max": 0.8609473379999883,
                "mean": 0.41631210779999606,
                "stddev": 0.24856101444682624,
                "rounds": 5,
                "median": 0.30483367700000485,
                "iqr": 0.14106026550000195,
                "q1": 0.30442812449999224,
                "q3": 0.4454883899999942,
                "iqr_outliers": 1,
                "stddev_outliers": 1,
                "outliers": "1;1",
                "ld15iqr": 0.30430992600000195,
                "hd15iqr": 0.8609473379999883,
                "ops": 2.402043998394633,
                "total": 2.0815605389999803,
                "iterations": 1
            }
        },
        {
            "group": null,
            "name": "test_09_aligo_sensitivity",
            "fullname": "tests/benchmarks/test_benchmarks.py::test_09_aligo_sensitivity",
            "params": null,
            "param": null,
            "extra_info": {},
            "options": {
                "disable_gc": false,
                "timer": "perf_counter",
                "min_rounds": 5,
                "max_time": 1.0,
                "min_time": 5e-06,
                "warmup": false
            },
            "stats": {
                "min": 0.3266552739999895,
                "max": 1.0385424039999975,
                "mean": 0.4698623736000059,
                "stddev": 0.31790255528939393,
                "rounds": 5,
                "median": 0.32794987900001615,
                "iqr": 0.1787002282499941,
                "q1": 0.32736121225001114,
                "q3": 0.5060614405000052,
                "iqr_outliers": 1,
                "stddev_outliers": 1,
                "outliers": "1;1",
                "ld15iqr": 0.3266552739999895,
                "hd15iqr": 1.0385424039999975,
                "ops": 2.1282827827607678,
                "total": 2.3493118680000293,
                "iterations": 1
            }
        },
        {
            "group": null,
            "name": "test_10_shifted_beam",
            "fullname": "tests/benchmarks/test_benchmarks.py::test_10_shifted_beam",
            "params": null,
            "param": null,
            "extra_info": {},
            "options": {
                "disable_gc": false,
                "timer": "perf_counter",
                "min_rounds": 5,
                "max_time": 1.0,
                "min_time": 5e-06,
                "warmup": false
            },
            "stats": {
                "min": 0.7303103739999983,
                "max": 0.7420859220000011,
                "mean": 0.7364251793999983,
                "stddev": 0.0049623326472215835,
                "rounds": 5,
                "median": 0.7357769660000031,
                "iqr": 0.00856002425001634,
                "q1": 0.7325017629999877,
                "q3": 0.741061787250004,
                "iqr_outliers": 0,
                "stddev_outliers": 2,
                "outliers": "2;0",
                "ld15iqr": 0.7303103739999983,
                "hd15iqr": 0.7420859220000011,
                "ops": 1.3579112012638528,
                "total": 3.6821258969999917,
                "iterations": 1
            }
        },
        {
            "group": null,
            "name": "test_angular_radiation_pressure",
            "fullname": "tests/benchmarks/test_benchmarks.py::test_angular_radiation_pressure",
            "params": null,
            "param": null,
            "extra_info": {},
            "options": {
                "disable_gc": false,
                "timer": "perf_counter",
                "min_rounds": 5,
                "max_time": 1.0,
                "min_time": 5e-06,
                "warmup": false
            },
            "stats": {
                "min": 0.3376338860000203,
                "max": 0.3521205499999951,
                "mean": 0.34529799119999327,
                "stddev": 0.0056691175190160545,
                "rounds": 5,
                "median": 0.34424897699997814,
                "iqr": 0.008410193249979159,
                "q1": 0.3416966615000021,
                "q3": 0.35010685474998127,
                "iqr_outliers": 0,
                "stddev_outliers": 2,
                "outliers": "2;0",
                "ld15iqr": 0.3376338860000203,
                "hd15iqr": 0.3521205499999951,
                "ops": 2.896049283474718,
                "total": 1.7264899559999662,
                "iterations": 1
            }
        },
        {
            "group": null,
            "name": "test_cavity_eigenmodes",
            "fullname": "tests/benchmarks/test_benchmarks.py::test_cavity_eigenmodes",
            "params": null,
            "param": null,
            "extra_info": {},
            "options": {
                "disable_gc": false,
                "timer": "perf_counter",
                "min_rounds": 5,
                "max_time": 1.0,
                "min_time": 5e-06,
                "warmup": false
            },
            "stats": {
                "min": 0.2755235060000132,
                "max": 0.2876028369999801,
                "mean": 0.28309776240000134,
                "stddev": 0.005041051864859956,
                "rounds": 5,
                "median": 0.2845178780000026,
                "iqr": 0.007834729999984802,
                "q1": 0.2794151495000108,
                "q3": 0.2872498794999956,
                "iqr_outliers": 0,
                "stddev_outliers": 1,
                "outliers": "1;0",
                "ld15iqr": 0.2755235060000132,
                "hd15iqr": 0.2876028369999801,
                "ops": 3.532348654126965,
                "total": 1.4154888120000066,
                "iterations": 1
            }
        },
        {
            "group": null,
            "name": "test_coupled_cavity_commands",
            "fullname": "tests/benchmarks/test_benchmarks.py::test_coupled_cavity_commands",
            "params": null,
            "param": null,
            "extra_info": {},
            "options": {
                "disable_gc": false,
                "timer": "perf_counter",
                "min_rounds": 5,
                "max_time": 1.0,
                "min_time": 5e-06,
                "warmup": false
            },
            "stats": {
                "min": 4.4406387319999965,
                "max": 5.891411392000009,
                "mean": 4.985943644400004,
                "stddev": 0.6935618301993557,
                "rounds": 5,
                "median": 4.523101808999996,
                "iqr": 1.175596784750006,
                "q1": 4.481670231500004,
                "q3": 5.65726701625001,
                "iqr_outliers": 0,
                "stddev_outliers": 1,
                "outliers": "1;0",
                "ld15iqr": 4.4406387319999965,
                "hd15iqr": 5.891411392000009,
                "ops": 0.2005638393292224,
                "total": 24.92971822200002,
                "iterations": 1
            }
        },
        {
            "group": null,
            "name": "test_frequency_dependant_squeezing",
            "fullname": "tests/benchmarks/test_benchmarks.py::test_frequency_dependant_squeezing",
            "params": null,
            "param": null,
            "extra_info": {},
            "options": {
                "disable_gc": false,
                "timer": "perf_counter",
                "min_rounds": 5,
                "max_time": 1.0,
                "min_time": 5e-06,
                "warmup": false
            },
            "stats": {
                "min": 1.5073655429999917,
                "max": 3.081702841000009,
                "mean": 1.8687016859999972,
                "stddev": 0.6791646260861555,
                "rounds": 5,
                "median": 1.590415226999994,
                "iqr": 0.43179623574998516,
                "q1": 1.544244737250004,
                "q3": 1.9760409729999893,
                "iqr_outliers": 1,
                "stddev_outliers": 1,
                "outliers": "1;1",
                "ld15iqr": 1.5073655429999917,
                "hd15iqr": 3.081702841000009,
                "ops": 0.5351308919405564,
                "total": 9.343508429999986,
                "iterations": 1
            }
        },
        {
            "group": null,
            "name": "test_lock_actions",
            "fullname": "tests/benchmarks/test_benchmarks.py::test_lock_actions",
            "params": null,
            "param": null,
            "extra_info": {},
            "options": {
                "disable_gc": false,
                "timer": "perf_counter",
                "min_rounds": 5,
                "max_time": 1.0,
                "min_time": 5e-06,
                "warmup": false
            },
            "stats": {
                "min": 5.257719261000005,
                "max": 5.418774454000015,
                "mean": 5.3556219398,
                "stddev": 0.06422185525595739,
                "rounds": 5,
                "median": 5.385566506999993,
                "iqr": 0.08789190699999949,
                "q1": 5.309134314749997,
                "q3": 5.3970262217499965,
                "iqr_outliers": 0,
                "stddev_outliers": 1,
                "outliers": "1;0",
                "ld15iqr": 5.257719261000005,
                "hd15iqr": 5.418774454000015,
                "ops": 0.1867196772364675,
                "total": 26.778109698999998,
                "iterations": 1
            }
        }
    ],
    "datetime": "2024-01-17T13:14:46.135273",
    "version": "4.0.0"
}