{
    "machine_info": {
        "node": "runner-ykxhnyexq-project-39604133-concurrent-0",
        "processor": "",
        "machine": "x86_64",
        "python_compiler": "GCC 12.2.0",
        "python_implementation": "CPython",
        "python_implementation_version": "3.12.4",
        "python_version": "3.12.4",
        "python_build": [
            "main",
            "Jul 10 2024 19:07:58"
        ],
        "release": "5.15.154+",
        "system": "Linux",
        "cpu": {
            "python_version": "3.12.4.final.0 (64 bit)",
            "cpuinfo_version": [
                9,
                0,
                0
            ],
            "cpuinfo_version_string": "9.0.0",
            "arch": "X86_64",
            "bits": 64,
            "count": 2,
            "arch_string_raw": "x86_64",
            "vendor_id_raw": "AuthenticAMD",
            "brand_raw": "AMD EPYC 7B13",
            "hz_advertised_friendly": "2.4500 GHz",
            "hz_actual_friendly": "2.4500 GHz",
            "hz_advertised": [
                2449996000,
                0
            ],
            "hz_actual": [
                2449996000,
                0
            ],
            "model": 1,
            "family": 25,
            "flags": [
                "3dnowext",
                "3dnowprefetch",
                "abm",
                "adx",
                "aes",
                "apic",
                "arat",
                "avx",
                "avx2",
                "bmi1",
                "bmi2",
                "clflush",
                "clflushopt",
                "clwb",
                "clzero",
                "cmov",
                "cmp_legacy",
                "constant_tsc",
                "cpuid",
                "cr8_legacy",
                "cx16",
                "cx8",
                "de",
                "erms",
                "extd_apicid",
                "f16c",
                "fma",
                "fpu",
                "fsgsbase",
                "fsrm",
                "fxsr",
                "fxsr_opt",
                "ht",
                "hypervisor",
                "ibpb",
                "ibrs",
                "invpcid",
                "invpcid_single",
                "lahf_lm",
                "lm",
                "mca",
                "mce",
                "misalignsse",
                "mmx",
                "mmxext",
                "movbe",
                "msr",
                "mtrr",
                "nonstop_tsc",
                "nopl",
                "npt",
                "nrip_save",
                "nx",
                "osvw",
                "osxsave",
                "pae",
                "pat",
                "pcid",
                "pclmulqdq",
                "pdpe1gb",
                "pge",
                "pni",
                "popcnt",
                "pse",
                "pse36",
                "rdpid",
                "rdrand",
                "rdrnd",
                "rdseed",
                "rdtscp",
                "rep_good",
                "sep",
                "sha",
                "sha_ni",
                "smap",
                "smep",
                "ssbd",
                "sse",
                "sse2",
                "sse4_1",
                "sse4_2",
                "sse4a",
                "ssse3",
                "stibp",
                "syscall",
                "topoext",
                "tsc",
                "tsc_adjust",
                "tsc_known_freq",
                "umip",
                "vaes",
                "vme",
                "vmmcall",
                "vpclmulqdq",
                "x2apic",
                "xgetbv1",
                "xsave",
                "xsavec",
                "xsaveerptr",
                "xsaveopt"
            ],
            "l3_cache_size": 524288,
            "l2_cache_size": 524288,
            "l1_data_cache_size": 32768,
            "l1_instruction_cache_size": 32768,
            "l2_cache_line_size": 512,
            "l2_cache_associativity": 6
        }
    },
    "commit_info": {
        "id": "70fc2f88a3ac88a344b9ffbf04b1c66d25e740da",
        "time": "2024-07-19T06:32:29-04:00",
        "author_time": "2024-07-19T06:32:29-04:00",
        "dirty": false,
        "project": "finesse3",
        "branch": "(detached head)"
    },
    "benchmarks": [
        {
            "group": null,
            "name": "test_01_simple_cav",
            "fullname": "tests/benchmarks/test_benchmarks.py::test_01_simple_cav",
            "params": null,
            "param": null,
            "extra_info": {},
            "options": {
                "disable_gc": false,
                "timer": "perf_counter",
                "min_rounds": 5,
                "max_time": 1.0,
                "min_time": 5e-06,
                "warmup": false
            },
            "stats": {
                "min": 0.2751960759999861,
                "max": 0.49988645799999176,
                "mean": 0.3236274347999938,
                "stddev": 0.09861895328156803,
                "rounds": 5,
                "median": 0.2796904859999927,
                "iqr": 0.06293678549997139,
                "q1": 0.276678481750011,
                "q3": 0.33961526724998237,
                "iqr_outliers": 1,
                "stddev_outliers": 1,
                "outliers": "1;1",
                "ld15iqr": 0.2751960759999861,
                "hd15iqr": 0.49988645799999176,
                "ops": 3.0899728900240295,
                "total": 1.618137173999969,
                "iterations": 1
            }
        },
        {
            "group": null,
            "name": "test_02_pdh_lock",
            "fullname": "tests/benchmarks/test_benchmarks.py::test_02_pdh_lock",
            "params": null,
            "param": null,
            "extra_info": {},
            "options": {
                "disable_gc": false,
                "timer": "perf_counter",
                "min_rounds": 5,
                "max_time": 1.0,
                "min_time": 5e-06,
                "warmup": false
            },
            "stats": {
                "min": 1.1878895830000147,
                "max": 1.5245247949999907,
                "mean": 1.3154500650000158,
                "stddev": 0.16172859994921504,
                "rounds": 5,
                "median": 1.2080988140000386,
                "iqr": 0.27620149674999084,
                "q1": 1.1972274737500186,
                "q3": 1.4734289705000094,
                "iqr_outliers": 0,
                "stddev_outliers": 1,
                "outliers": "1;0",
                "ld15iqr": 1.1878895830000147,
                "hd15iqr": 1.5245247949999907,
                "ops": 0.7601960930383077,
                "total": 6.57725032500008,
                "iterations": 1
            }
        },
        {
            "group": null,
            "name": "test_03_near_unstable",
            "fullname": "tests/benchmarks/test_benchmarks.py::test_03_near_unstable",
            "params": null,
            "param": null,
            "extra_info": {},
            "options": {
                "disable_gc": false,
                "timer": "perf_counter",
                "min_rounds": 5,
                "max_time": 1.0,
                "min_time": 5e-06,
                "warmup": false
            },
            "stats": {
                "min": 1.7600000319362152e-06,
                "max": 0.00035646899999619563,
                "mean": 2.0291937185645397e-06,
                "stddev": 1.854049754899378e-06,
                "rounds": 48333,
                "median": 1.850000046488276e-06,
                "iqr": 6.999999868639861e-08,
                "q1": 1.8200000226897828e-06,
                "q3": 1.8900000213761814e-06,
                "iqr_outliers": 4420,
                "stddev_outliers": 466,
                "outliers": "466;4420",
                "ld15iqr": 1.7600000319362152e-06,
                "hd15iqr": 1.9999999949504854e-06,
                "ops": 492806.5718177978,
                "total": 0.0980770199993799,
                "iterations": 1
            }
        },
        {
            "group": null,
            "name": "test_04_geometrical_params",
            "fullname": "tests/benchmarks/test_benchmarks.py::test_04_geometrical_params",
            "params": null,
            "param": null,
            "extra_info": {},
            "options": {
                "disable_gc": false,
                "timer": "perf_counter",
                "min_rounds": 5,
                "max_time": 1.0,
                "min_time": 5e-06,
                "warmup": false
            },
            "stats": {
                "min": 0.46459190399997397,
                "max": 0.8175169869999763,
                "mean": 0.5367899046000048,
                "stddev": 0.15693685066589344,
                "rounds": 5,
                "median": 0.46704282400003194,
                "iqr": 0.08956328575001749,
                "q1": 0.46603114650000066,
                "q3": 0.5555944322500181,
                "iqr_outliers": 1,
                "stddev_outliers": 1,
                "outliers": "1;1",
                "ld15iqr": 0.46459190399997397,
                "hd15iqr": 0.8175169869999763,
                "ops": 1.862926242521572,
                "total": 2.683949523000024,
                "iterations": 1
            }
        },
        {
            "group": null,
            "name": "test_05_modulation",
            "fullname": "tests/benchmarks/test_benchmarks.py::test_05_modulation",
            "params": null,
            "param": null,
            "extra_info": {},
            "options": {
                "disable_gc": false,
                "timer": "perf_counter",
                "min_rounds": 5,
                "max_time": 1.0,
                "min_time": 5e-06,
                "warmup": false
            },
            "stats": {
                "min": 0.12082023099998196,
                "max": 0.5503380019999895,
                "mean": 0.17392369322222598,
                "stddev": 0.14127955182952878,
                "rounds": 9,
                "median": 0.12460952300000372,
                "iqr": 0.012689065250015119,
                "q1": 0.12323667949999617,
                "q3": 0.1359257447500113,
                "iqr_outliers": 1,
                "stddev_outliers": 1,
                "outliers": "1;1",
                "ld15iqr": 0.12082023099998196,
                "hd15iqr": 0.5503380019999895,
                "ops": 5.7496479144004775,
                "total": 1.5653132390000337,
                "iterations": 1
            }
        },
        {
            "group": null,
            "name": "test_06_radiation_pressure",
            "fullname": "tests/benchmarks/test_benchmarks.py::test_06_radiation_pressure",
            "params": null,
            "param": null,
            "extra_info": {},
            "options": {
                "disable_gc": false,
                "timer": "perf_counter",
                "min_rounds": 5,
                "max_time": 1.0,
                "min_time": 5e-06,
                "warmup": false
            },
            "stats": {
                "min": 0.25432382400003917,
                "max": 0.2626362350000022,
                "mean": 0.25817334660000596,
                "stddev": 0.00374234047632405,
                "rounds": 5,
                "median": 0.2572608439999726,
                "iqr": 0.006869522749994417,
                "q1": 0.2549274322500139,
                "q3": 0.2617969550000083,
                "iqr_outliers": 0,
                "stddev_outliers": 2,
                "outliers": "2;0",
                "ld15iqr": 0.25432382400003917,
                "hd15iqr": 0.2626362350000022,
                "ops": 3.8733665313225516,
                "total": 1.2908667330000299,
                "iterations": 1
            }
        },
        {
            "group": null,
            "name": "test_07_homodyne",
            "fullname": "tests/benchmarks/test_benchmarks.py::test_07_homodyne",
            "params": null,
            "param": null,
            "extra_info": {},
            "options": {
                "disable_gc": false,
                "timer": "perf_counter",
                "min_rounds": 5,
                "max_time": 1.0,
                "min_time": 5e-06,
                "warmup": false
            },
            "stats": {
                "min": 0.08274006799996414,
                "max": 0.0894491779999953,
                "mean": 0.08577205399999457,
                "stddev": 0.0023948895249621665,
                "rounds": 5,
                "median": 0.08550760800000035,
                "iqr": 0.001987252500001091,
                "q1": 0.08471631049999928,
                "q3": 0.08670356300000037,
                "iqr_outliers": 0,
                "stddev_outliers": 2,
                "outliers": "2;0",
                "ld15iqr": 0.08274006799996414,
                "hd15iqr": 0.0894491779999953,
                "ops": 11.658809056852752,
                "total": 0.42886026999997284,
                "iterations": 1
            }
        },
        {
            "group": null,
            "name": "test_08_optical_spring",
            "fullname": "tests/benchmarks/test_benchmarks.py::test_08_optical_spring",
            "params": null,
            "param": null,
            "extra_info": {},
            "options": {
                "disable_gc": false,
                "timer": "perf_counter",
                "min_rounds": 5,
                "max_time": 1.0,
                "min_time": 5e-06,
                "warmup": false
            },
            "stats": {
                "min": 0.2297053519999963,
                "max": 0.23731689300001335,
                "mean": 0.23192610200001126,
                "stddev": 0.0031110054784301232,
                "rounds": 5,
                "median": 0.23108984200001714,
                "iqr": 0.003111509499987619,
                "q1": 0.22989143450001848,
                "q3": 0.2330029440000061,
                "iqr_outliers": 0,
                "stddev_outliers": 1,
                "outliers": "1;0",
                "ld15iqr": 0.2297053519999963,
                "hd15iqr": 0.23731689300001335,
                "ops": 4.311718221349452,
                "total": 1.1596305100000563,
                "iterations": 1
            }
        },
        {
            "group": null,
            "name": "test_09_aligo_sensitivity",
            "fullname": "tests/benchmarks/test_benchmarks.py::test_09_aligo_sensitivity",
            "params": null,
            "param": null,
            "extra_info": {},
            "options": {
                "disable_gc": false,
                "timer": "perf_counter",
                "min_rounds": 5,
                "max_time": 1.0,
                "min_time": 5e-06,
                "warmup": false
            },
            "stats": {
                "min": 0.2500125640000306,
                "max": 0.8891586580000421,
                "mean": 0.38438043560001917,
                "stddev": 0.2822218817808697,
                "rounds": 5,
                "median": 0.2615088080000305,
                "iqr": 0.1623490409999988,
                "q1": 0.2566801877500069,
                "q3": 0.4190292287500057,
                "iqr_outliers": 1,
                "stddev_outliers": 1,
                "outliers": "1;1",
                "ld15iqr": 0.2500125640000306,
                "hd15iqr": 0.8891586580000421,
                "ops": 2.6015892261503804,
                "total": 1.9219021780000958,
                "iterations": 1
            }
        },
        {
            "group": null,
            "name": "test_10_shifted_beam",
            "fullname": "tests/benchmarks/test_benchmarks.py::test_10_shifted_beam",
            "params": null,
            "param": null,
            "extra_info": {},
            "options": {
                "disable_gc": false,
                "timer": "perf_counter",
                "min_rounds": 5,
                "max_time": 1.0,
                "min_time": 5e-06,
                "warmup": false
            },
            "stats": {
                "min": 0.7138834419999966,
                "max": 0.7250798609999833,
                "mean": 0.7186733895999964,
                "stddev": 0.004956977395103984,
                "rounds": 5,
                "median": 0.7169357020000007,
                "iqr": 0.008730569000064747,
                "q1": 0.7145556069999657,
                "q3": 0.7232861760000304,
                "iqr_outliers": 0,
                "stddev_outliers": 1,
                "outliers": "1;0",
                "ld15iqr": 0.7138834419999966,
                "hd15iqr": 0.7250798609999833,
                "ops": 1.3914526605146547,
                "total": 3.593366947999982,
                "iterations": 1
            }
        },
        {
            "group": null,
            "name": "test_angular_radiation_pressure",
            "fullname": "tests/benchmarks/test_benchmarks.py::test_angular_radiation_pressure",
            "params": null,
            "param": null,
            "extra_info": {},
            "options": {
                "disable_gc": false,
                "timer": "perf_counter",
                "min_rounds": 5,
                "max_time": 1.0,
                "min_time": 5e-06,
                "warmup": false
            },
            "stats": {
                "min": 0.3024085760000048,
                "max": 0.3096674450000023,
                "mean": 0.30558805299999675,
                "stddev": 0.0031282504024782156,
                "rounds": 5,
                "median": 0.30580406399997173,
                "iqr": 0.005446449750053262,
                "q1": 0.3025588452499761,
                "q3": 0.3080052950000294,
                "iqr_outliers": 0,
                "stddev_outliers": 2,
                "outliers": "2;0",
                "ld15iqr": 0.3024085760000048,
                "hd15iqr": 0.3096674450000023,
                "ops": 3.272379237940989,
                "total": 1.5279402649999838,
                "iterations": 1
            }
        },
        {
            "group": null,
            "name": "test_cavity_eigenmodes",
            "fullname": "tests/benchmarks/test_benchmarks.py::test_cavity_eigenmodes",
            "params": null,
            "param": null,
            "extra_info": {},
            "options": {
                "disable_gc": false,
                "timer": "perf_counter",
                "min_rounds": 5,
                "max_time": 1.0,
                "min_time": 5e-06,
                "warmup": false
            },
            "stats": {
                "min": 0.2575327600000037,
                "max": 1.187316882999994,
                "mean": 0.4472529838000014,
                "stddev": 0.4137184485157871,
                "rounds": 5,
                "median": 0.2630675290000113,
                "iqr": 0.2343661874999725,
                "q1": 0.2615535167500127,
                "q3": 0.4959197042499852,
                "iqr_outliers": 1,
                "stddev_outliers": 1,
                "outliers": "1;1",
                "ld15iqr": 0.2575327600000037,
                "hd15iqr": 1.187316882999994,
                "ops": 2.2358710533436508,
                "total": 2.236264919000007,
                "iterations": 1
            }
        },
        {
            "group": null,
            "name": "test_coupled_cavity_commands",
            "fullname": "tests/benchmarks/test_benchmarks.py::test_coupled_cavity_commands",
            "params": null,
            "param": null,
            "extra_info": {},
            "options": {
                "disable_gc": false,
                "timer": "perf_counter",
                "min_rounds": 5,
                "max_time": 1.0,
                "min_time": 5e-06,
                "warmup": false
            },
            "stats": {
                "min": 4.350320616999966,
                "max": 5.768619711000042,
                "mean": 4.8602368232,
                "stddev": 0.6610528323311803,
                "rounds": 5,
                "median": 4.451713907999988,
                "iqr": 1.1014541645000548,
                "q1": 4.363089163749976,
                "q3": 5.464543328250031,
                "iqr_outliers": 0,
                "stddev_outliers": 1,
                "outliers": "1;0",
                "ld15iqr": 4.350320616999966,
                "hd15iqr": 5.768619711000042,
                "ops": 0.205751290806771,
                "total": 24.301184116,
                "iterations": 1
            }
        },
        {
            "group": null,
            "name": "test_frequency_dependant_squeezing",
            "fullname": "tests/benchmarks/test_benchmarks.py::test_frequency_dependant_squeezing",
            "params": null,
            "param": null,
            "extra_info": {},
            "options": {
                "disable_gc": false,
                "timer": "perf_counter",
                "min_rounds": 5,
                "max_time": 1.0,
                "min_time": 5e-06,
                "warmup": false
            },
            "stats": {
                "min": 1.4894195389999823,
                "max": 2.8926763950000236,
                "mean": 1.7773447917999987,
                "stddev": 0.6236144054764985,
                "rounds": 5,
                "median": 1.4924470990000032,
                "iqr": 0.37175126500002875,
                "q1": 1.4914542064999807,
                "q3": 1.8632054715000095,
                "iqr_outliers": 1,
                "stddev_outliers": 1,
                "outliers": "1;1",
                "ld15iqr": 1.4894195389999823,
                "hd15iqr": 2.8926763950000236,
                "ops": 0.5626370328445129,
                "total": 8.886723958999994,
                "iterations": 1
            }
        },
        {
            "group": null,
            "name": "test_lock_actions",
            "fullname": "tests/benchmarks/test_benchmarks.py::test_lock_actions",
            "params": null,
            "param": null,
            "extra_info": {},
            "options": {
                "disable_gc": false,
                "timer": "perf_counter",
                "min_rounds": 5,
                "max_time": 1.0,
                "min_time": 5e-06,
                "warmup": false
            },
            "stats": {
                "min": 3.1112751179999805,
                "max": 4.606677528000034,
                "mean": 3.4227369279999946,
                "stddev": 0.6619680437879575,
                "rounds": 5,
                "median": 3.126768692999974,
                "iqr": 0.3923302867500098,
                "q1": 3.1194401752499914,
                "q3": 3.511770462000001,
                "iqr_outliers": 1,
                "stddev_outliers": 1,
                "outliers": "1;1",
                "ld15iqr": 3.1112751179999805,
                "hd15iqr": 4.606677528000034,
                "ops": 0.29216385046113647,
                "total": 17.113684639999974,
                "iterations": 1
            }
        }
    ],
    "datetime": "2024-07-19T10:43:50.386355",
    "version": "4.0.0"
}