{
    "machine_info": {
        "node": "runner--azerasq-project-39604133-concurrent-0",
        "processor": "",
        "machine": "x86_64",
        "python_compiler": "GCC 12.2.0",
        "python_implementation": "CPython",
        "python_implementation_version": "3.12.3",
        "python_version": "3.12.3",
        "python_build": [
            "main",
            "Apr 10 2024 14:35:18"
        ],
        "release": "5.4.109+",
        "system": "Linux",
        "cpu": {
            "python_version": "3.12.3.final.0 (64 bit)",
            "cpuinfo_version": [
                9,
                0,
                0
            ],
            "cpuinfo_version_string": "9.0.0",
            "arch": "X86_64",
            "bits": 64,
            "count": 2,
            "arch_string_raw": "x86_64",
            "vendor_id_raw": "AuthenticAMD",
            "brand_raw": "AMD EPYC 7B13",
            "hz_advertised_friendly": "2.4500 GHz",
            "hz_actual_friendly": "2.4500 GHz",
            "hz_advertised": [
                2449998000,
                0
            ],
            "hz_actual": [
                2449998000,
                0
            ],
            "model": 1,
            "family": 25,
            "flags": [
                "3dnowext",
                "3dnowprefetch",
                "abm",
                "adx",
                "aes",
                "apic",
                "arat",
                "avx",
                "avx2",
                "bmi1",
                "bmi2",
                "clflush",
                "clflushopt",
                "clwb",
                "clzero",
                "cmov",
                "cmp_legacy",
                "constant_tsc",
                "cpuid",
                "cr8_legacy",
                "cx16",
                "cx8",
                "de",
                "erms",
                "extd_apicid",
                "f16c",
                "fma",
                "fpu",
                "fsgsbase",
                "fxsr",
                "fxsr_opt",
                "ht",
                "hypervisor",
                "ibpb",
                "ibrs",
                "invpcid",
                "invpcid_single",
                "lahf_lm",
                "lm",
                "mca",
                "mce",
                "misalignsse",
                "mmx",
                "mmxext",
                "movbe",
                "msr",
                "mtrr",
                "nonstop_tsc",
                "nopl",
                "npt",
                "nrip_save",
                "nx",
                "osvw",
                "osxsave",
                "pae",
                "pat",
                "pcid",
                "pclmulqdq",
                "pdpe1gb",
                "pge",
                "pni",
                "popcnt",
                "pse",
                "pse36",
                "rdpid",
                "rdrand",
                "rdrnd",
                "rdseed",
                "rdtscp",
                "rep_good",
                "sep",
                "sha",
                "sha_ni",
                "smap",
                "smep",
                "ssbd",
                "sse",
                "sse2",
                "sse4_1",
                "sse4_2",
                "sse4a",
                "ssse3",
                "stibp",
                "syscall",
                "topoext",
                "tsc",
                "tsc_adjust",
                "tsc_known_freq",
                "umip",
                "vaes",
                "vme",
                "vmmcall",
                "vpclmulqdq",
                "x2apic",
                "xgetbv1",
                "xsave",
                "xsavec",
                "xsaveerptr",
                "xsaveopt"
            ],
            "l3_cache_size": 524288,
            "l2_cache_size": 524288,
            "l1_data_cache_size": 32768,
            "l1_instruction_cache_size": 32768,
            "l2_cache_line_size": 512,
            "l2_cache_associativity": 6
        }
    },
    "commit_info": {
        "id": "024a6e2c311386806cf25bfa44c99d1e0d81d8f2",
        "time": "2024-04-24T10:15:05+02:00",
        "author_time": "2024-04-24T10:15:05+02:00",
        "dirty": false,
        "project": "finesse3",
        "branch": "(detached head)"
    },
    "benchmarks": [
        {
            "group": null,
            "name": "test_01_simple_cav",
            "fullname": "tests/benchmarks/test_benchmarks.py::test_01_simple_cav",
            "params": null,
            "param": null,
            "extra_info": {},
            "options": {
                "disable_gc": false,
                "timer": "perf_counter",
                "min_rounds": 5,
                "max_time": 1.0,
                "min_time": 5e-06,
                "warmup": false
            },
            "stats": {
                "min": 0.3682376890000114,
                "max": 0.5835230550000006,
                "mean": 0.4520496946000094,
                "stddev": 0.10054495048247587,
                "rounds": 5,
                "median": 0.3951273399999877,
                "iqr": 0.17402935174997936,
                "q1": 0.37446556300002953,
                "q3": 0.5484949147500089,
                "iqr_outliers": 0,
                "stddev_outliers": 1,
                "outliers": "1;0",
                "ld15iqr": 0.3682376890000114,
                "hd15iqr": 0.5835230550000006,
                "ops": 2.2121461687632324,
                "total": 2.260248473000047,
                "iterations": 1
            }
        },
        {
            "group": null,
            "name": "test_02_pdh_lock",
            "fullname": "tests/benchmarks/test_benchmarks.py::test_02_pdh_lock",
            "params": null,
            "param": null,
            "extra_info": {},
            "options": {
                "disable_gc": false,
                "timer": "perf_counter",
                "min_rounds": 5,
                "max_time": 1.0,
                "min_time": 5e-06,
                "warmup": false
            },
            "stats": {
                "min": 1.3191639059999716,
                "max": 1.5932619120000027,
                "mean": 1.3922292183999958,
                "stddev": 0.11430995226741071,
                "rounds": 5,
                "median": 1.3467448939999827,
                "iqr": 0.10279262250003285,
                "q1": 1.3258976834999885,
                "q3": 1.4286903060000213,
                "iqr_outliers": 1,
                "stddev_outliers": 1,
                "outliers": "1;1",
                "ld15iqr": 1.3191639059999716,
                "hd15iqr": 1.5932619120000027,
                "ops": 0.7182725278163887,
                "total": 6.961146091999979,
                "iterations": 1
            }
        },
        {
            "group": null,
            "name": "test_03_near_unstable",
            "fullname": "tests/benchmarks/test_benchmarks.py::test_03_near_unstable",
            "params": null,
            "param": null,
            "extra_info": {},
            "options": {
                "disable_gc": false,
                "timer": "perf_counter",
                "min_rounds": 5,
                "max_time": 1.0,
                "min_time": 5e-06,
                "warmup": false
            },
            "stats": {
                "min": 1.6689999711161363e-06,
                "max": 0.00016367900002478564,
                "mean": 2.5478226944501785e-06,
                "stddev": 1.3191913276898022e-06,
                "rounds": 47985,
                "median": 3.079999999044958e-06,
                "iqr": 1.4099999816608033e-06,
                "q1": 1.740000016070553e-06,
                "q3": 3.1499999977313564e-06,
                "iqr_outliers": 272,
                "stddev_outliers": 359,
                "outliers": "359;272",
                "ld15iqr": 1.6689999711161363e-06,
                "hd15iqr": 5.310000005920301e-06,
                "ops": 392491.9901915705,
                "total": 0.12225727199319181,
                "iterations": 1
            }
        },
        {
            "group": null,
            "name": "test_04_geometrical_params",
            "fullname": "tests/benchmarks/test_benchmarks.py::test_04_geometrical_params",
            "params": null,
            "param": null,
            "extra_info": {},
            "options": {
                "disable_gc": false,
                "timer": "perf_counter",
                "min_rounds": 5,
                "max_time": 1.0,
                "min_time": 5e-06,
                "warmup": false
            },
            "stats": {
                "min": 0.5051462979999997,
                "max": 0.9056799349999665,
                "mean": 0.5932979875999876,
                "stddev": 0.1747745441433744,
                "rounds": 5,
                "median": 0.5199972149999894,
                "iqr": 0.10891229725002916,
                "q1": 0.5102720642499747,
                "q3": 0.6191843615000039,
                "iqr_outliers": 1,
                "stddev_outliers": 1,
                "outliers": "1;1",
                "ld15iqr": 0.5051462979999997,
                "hd15iqr": 0.9056799349999665,
                "ops": 1.6854936657466268,
                "total": 2.9664899379999383,
                "iterations": 1
            }
        },
        {
            "group": null,
            "name": "test_05_modulation",
            "fullname": "tests/benchmarks/test_benchmarks.py::test_05_modulation",
            "params": null,
            "param": null,
            "extra_info": {},
            "options": {
                "disable_gc": false,
                "timer": "perf_counter",
                "min_rounds": 5,
                "max_time": 1.0,
                "min_time": 5e-06,
                "warmup": false
            },
            "stats": {
                "min": 0.1667937830000028,
                "max": 0.5943571309999811,
                "mean": 0.225408506249984,
                "stddev": 0.14911265685209585,
                "rounds": 8,
                "median": 0.17299552949998542,
                "iqr": 0.005320423499995286,
                "q1": 0.17137130749998164,
                "q3": 0.17669173099997693,
                "iqr_outliers": 1,
                "stddev_outliers": 1,
                "outliers": "1;1",
                "ld15iqr": 0.1667937830000028,
                "hd15iqr": 0.5943571309999811,
                "ops": 4.436389809047284,
                "total": 1.803268049999872,
                "iterations": 1
            }
        },
        {
            "group": null,
            "name": "test_06_radiation_pressure",
            "fullname": "tests/benchmarks/test_benchmarks.py::test_06_radiation_pressure",
            "params": null,
            "param": null,
            "extra_info": {},
            "options": {
                "disable_gc": false,
                "timer": "perf_counter",
                "min_rounds": 5,
                "max_time": 1.0,
                "min_time": 5e-06,
                "warmup": false
            },
            "stats": {
                "min": 0.23912314400001833,
                "max": 0.2970522150000079,
                "mean": 0.25275960740001435,
                "stddev": 0.024816697560106682,
                "rounds": 5,
                "median": 0.24244328600002518,
                "iqr": 0.016127148249964307,
                "q1": 0.2409006177500288,
                "q3": 0.2570277659999931,
                "iqr_outliers": 1,
                "stddev_outliers": 1,
                "outliers": "1;1",
                "ld15iqr": 0.23912314400001833,
                "hd15iqr": 0.2970522150000079,
                "ops": 3.95632834805528,
                "total": 1.2637980370000719,
                "iterations": 1
            }
        },
        {
            "group": null,
            "name": "test_07_homodyne",
            "fullname": "tests/benchmarks/test_benchmarks.py::test_07_homodyne",
            "params": null,
            "param": null,
            "extra_info": {},
            "options": {
                "disable_gc": false,
                "timer": "perf_counter",
                "min_rounds": 5,
                "max_time": 1.0,
                "min_time": 5e-06,
                "warmup": false
            },
            "stats": {
                "min": 0.11081651599999987,
                "max": 0.6885526140000024,
                "mean": 0.17201902929999732,
                "stddev": 0.1815045710585104,
                "rounds": 10,
                "median": 0.1141942540000116,
                "iqr": 0.004046810000033929,
                "q1": 0.11369328999995787,
                "q3": 0.1177400999999918,
                "iqr_outliers": 1,
                "stddev_outliers": 1,
                "outliers": "1;1",
                "ld15iqr": 0.11081651599999987,
                "hd15iqr": 0.6885526140000024,
                "ops": 5.81331033007995,
                "total": 1.7201902929999733,
                "iterations": 1
            }
        },
        {
            "group": null,
            "name": "test_08_optical_spring",
            "fullname": "tests/benchmarks/test_benchmarks.py::test_08_optical_spring",
            "params": null,
            "param": null,
            "extra_info": {},
            "options": {
                "disable_gc": false,
                "timer": "perf_counter",
                "min_rounds": 5,
                "max_time": 1.0,
                "min_time": 5e-06,
                "warmup": false
            },
            "stats": {
                "min": 0.2866699589999939,
                "max": 0.2979274439999813,
                "mean": 0.29342371080000473,
                "stddev": 0.0045846900673080695,
                "rounds": 5,
                "median": 0.2943726569999967,
                "iqr": 0.0071141497500093465,
                "q1": 0.2900732857500117,
                "q3": 0.297187435500021,
                "iqr_outliers": 0,
                "stddev_outliers": 1,
                "outliers": "1;0",
                "ld15iqr": 0.2866699589999939,
                "hd15iqr": 0.2979274439999813,
                "ops": 3.4080408746571678,
                "total": 1.4671185540000238,
                "iterations": 1
            }
        },
        {
            "group": null,
            "name": "test_09_aligo_sensitivity",
            "fullname": "tests/benchmarks/test_benchmarks.py::test_09_aligo_sensitivity",
            "params": null,
            "param": null,
            "extra_info": {},
            "options": {
                "disable_gc": false,
                "timer": "perf_counter",
                "min_rounds": 5,
                "max_time": 1.0,
                "min_time": 5e-06,
                "warmup": false
            },
            "stats": {
                "min": 0.3217637110000169,
                "max": 1.02252747,
                "mean": 0.4694951124000113,
                "stddev": 0.3092591481309122,
                "rounds": 5,
                "median": 0.33822141000001693,
                "iqr": 0.1866771814999879,
                "q1": 0.32405892100001665,
                "q3": 0.5107361025000046,
                "iqr_outliers": 1,
                "stddev_outliers": 1,
                "outliers": "1;1",
                "ld15iqr": 0.3217637110000169,
                "hd15iqr": 1.02252747,
                "ops": 2.1299476258402383,
                "total": 2.3474755620000565,
                "iterations": 1
            }
        },
        {
            "group": null,
            "name": "test_10_shifted_beam",
            "fullname": "tests/benchmarks/test_benchmarks.py::test_10_shifted_beam",
            "params": null,
            "param": null,
            "extra_info": {},
            "options": {
                "disable_gc": false,
                "timer": "perf_counter",
                "min_rounds": 5,
                "max_time": 1.0,
                "min_time": 5e-06,
                "warmup": false
            },
            "stats": {
                "min": 0.7152974379999932,
                "max": 0.7407025959999487,
                "mean": 0.7254393253999979,
                "stddev": 0.010019031941036108,
                "rounds": 5,
                "median": 0.7221794180000529,
                "iqr": 0.014097678750019327,
                "q1": 0.718332605499981,
                "q3": 0.7324302842500003,
                "iqr_outliers": 0,
                "stddev_outliers": 2,
                "outliers": "2;0",
                "ld15iqr": 0.7152974379999932,
                "hd15iqr": 0.7407025959999487,
                "ops": 1.3784750357290225,
                "total": 3.6271966269999893,
                "iterations": 1
            }
        },
        {
            "group": null,
            "name": "test_angular_radiation_pressure",
            "fullname": "tests/benchmarks/test_benchmarks.py::test_angular_radiation_pressure",
            "params": null,
            "param": null,
            "extra_info": {},
            "options": {
                "disable_gc": false,
                "timer": "perf_counter",
                "min_rounds": 5,
                "max_time": 1.0,
                "min_time": 5e-06,
                "warmup": false
            },
            "stats": {
                "min": 0.33507158100002243,
                "max": 0.33983368000002656,
                "mean": 0.337169400200014,
                "stddev": 0.002048105676794388,
                "rounds": 5,
                "median": 0.3367844800000057,
                "iqr": 0.003589369750017113,
                "q1": 0.33537744525000335,
                "q3": 0.33896681500002046,
                "iqr_outliers": 0,
                "stddev_outliers": 2,
                "outliers": "2;0",
                "ld15iqr": 0.33507158100002243,
                "hd15iqr": 0.33983368000002656,
                "ops": 2.9658681938716405,
                "total": 1.6858470010000701,
                "iterations": 1
            }
        },
        {
            "group": null,
            "name": "test_cavity_eigenmodes",
            "fullname": "tests/benchmarks/test_benchmarks.py::test_cavity_eigenmodes",
            "params": null,
            "param": null,
            "extra_info": {},
            "options": {
                "disable_gc": false,
                "timer": "perf_counter",
                "min_rounds": 5,
                "max_time": 1.0,
                "min_time": 5e-06,
                "warmup": false
            },
            "stats": {
                "min": 0.268665704,
                "max": 1.2775700149999807,
                "mean": 0.47622758399999154,
                "stddev": 0.44801123743841575,
                "rounds": 5,
                "median": 0.27469496399999116,
                "iqr": 0.26171487450001507,
                "q1": 0.2724997414999848,
                "q3": 0.5342146159999999,
                "iqr_outliers": 1,
                "stddev_outliers": 1,
                "outliers": "1;1",
                "ld15iqr": 0.268665704,
                "hd15iqr": 1.2775700149999807,
                "ops": 2.0998363673113434,
                "total": 2.381137919999958,
                "iterations": 1
            }
        },
        {
            "group": null,
            "name": "test_coupled_cavity_commands",
            "fullname": "tests/benchmarks/test_benchmarks.py::test_coupled_cavity_commands",
            "params": null,
            "param": null,
            "extra_info": {},
            "options": {
                "disable_gc": false,
                "timer": "perf_counter",
                "min_rounds": 5,
                "max_time": 1.0,
                "min_time": 5e-06,
                "warmup": false
            },
            "stats": {
                "min": 4.576674719999971,
                "max": 6.015348397999901,
                "mean": 5.159959964599977,
                "stddev": 0.7755888753018992,
                "rounds": 5,
                "median": 4.623034837999967,
                "iqr": 1.426086899750075,
                "q1": 4.5802376399999645,
                "q3": 6.0063245397500395,
                "iqr_outliers": 0,
                "stddev_outliers": 2,
                "outliers": "2;0",
                "ld15iqr": 4.576674719999971,
                "hd15iqr": 6.015348397999901,
                "ops": 0.19379995326718089,
                "total": 25.799799822999887,
                "iterations": 1
            }
        },
        {
            "group": null,
            "name": "test_frequency_dependant_squeezing",
            "fullname": "tests/benchmarks/test_benchmarks.py::test_frequency_dependant_squeezing",
            "params": null,
            "param": null,
            "extra_info": {},
            "options": {
                "disable_gc": false,
                "timer": "perf_counter",
                "min_rounds": 5,
                "max_time": 1.0,
                "min_time": 5e-06,
                "warmup": false
            },
            "stats": {
                "min": 1.4930544399999235,
                "max": 3.0159143749999657,
                "mean": 1.819106368000007,
                "stddev": 0.6693041269311054,
                "rounds": 5,
                "median": 1.5203091860000768,
                "iqr": 0.40096626250007716,
                "q1": 1.5129831602499735,
                "q3": 1.9139494227500506,
                "iqr_outliers": 1,
                "stddev_outliers": 1,
                "outliers": "1;1",
                "ld15iqr": 1.4930544399999235,
                "hd15iqr": 3.0159143749999657,
                "ops": 0.5497204658237974,
                "total": 9.095531840000035,
                "iterations": 1
            }
        },
        {
            "group": null,
            "name": "test_lock_actions",
            "fullname": "tests/benchmarks/test_benchmarks.py::test_lock_actions",
            "params": null,
            "param": null,
            "extra_info": {},
            "options": {
                "disable_gc": false,
                "timer": "perf_counter",
                "min_rounds": 5,
                "max_time": 1.0,
                "min_time": 5e-06,
                "warmup": false
            },
            "stats": {
                "min": 4.984636846000058,
                "max": 5.169111573000009,
                "mean": 5.074642076800023,
                "stddev": 0.09065421548127857,
                "rounds": 5,
                "median": 5.059779177999985,
                "iqr": 0.17847763249989157,
                "q1": 4.989860781250087,
                "q3": 5.168338413749979,
                "iqr_outliers": 0,
                "stddev_outliers": 2,
                "outliers": "2;0",
                "ld15iqr": 4.984636846000058,
                "hd15iqr": 5.169111573000009,
                "ops": 0.19705823284990806,
                "total": 25.373210384000117,
                "iterations": 1
            }
        }
    ],
    "datetime": "2024-04-24T08:59:34.984112",
    "version": "4.0.0"
}