{
    "machine_info": {
        "node": "runner-j1aldqxs-project-39604133-concurrent-0",
        "processor": "",
        "machine": "x86_64",
        "python_compiler": "GCC 12.2.0",
        "python_implementation": "CPython",
        "python_implementation_version": "3.12.1",
        "python_version": "3.12.1",
        "python_build": [
            "main",
            "Dec 19 2023 20:14:15"
        ],
        "release": "5.4.109+",
        "system": "Linux",
        "cpu": {
            "python_version": "3.12.1.final.0 (64 bit)",
            "cpuinfo_version": [
                9,
                0,
                0
            ],
            "cpuinfo_version_string": "9.0.0",
            "arch": "X86_64",
            "bits": 64,
            "count": 2,
            "arch_string_raw": "x86_64",
            "vendor_id_raw": "AuthenticAMD",
            "brand_raw": "AMD EPYC 7B12",
            "hz_advertised_friendly": "2.2500 GHz",
            "hz_actual_friendly": "2.2500 GHz",
            "hz_advertised": [
                2249998000,
                0
            ],
            "hz_actual": [
                2249998000,
                0
            ],
            "model": 49,
            "family": 23,
            "flags": [
                "3dnowext",
                "3dnowprefetch",
                "abm",
                "adx",
                "aes",
                "apic",
                "arat",
                "avx",
                "avx2",
                "bmi1",
                "bmi2",
                "clflush",
                "clflushopt",
                "clwb",
                "clzero",
                "cmov",
                "cmp_legacy",
                "constant_tsc",
                "cpuid",
                "cr8_legacy",
                "cx16",
                "cx8",
                "de",
                "extd_apicid",
                "f16c",
                "fma",
                "fpu",
                "fsgsbase",
                "fxsr",
                "fxsr_opt",
                "ht",
                "hypervisor",
                "ibpb",
                "ibrs",
                "lahf_lm",
                "lm",
                "mca",
                "mce",
                "misalignsse",
                "mmx",
                "mmxext",
                "movbe",
                "msr",
                "mtrr",
                "nonstop_tsc",
                "nopl",
                "npt",
                "nrip_save",
                "nx",
                "osvw",
                "osxsave",
                "pae",
                "pat",
                "pclmulqdq",
                "pdpe1gb",
                "pge",
                "pni",
                "popcnt",
                "pse",
                "pse36",
                "rdpid",
                "rdrand",
                "rdrnd",
                "rdseed",
                "rdtscp",
                "rep_good",
                "sep",
                "sha",
                "sha_ni",
                "smap",
                "smep",
                "ssbd",
                "sse",
                "sse2",
                "sse4_1",
                "sse4_2",
                "sse4a",
                "ssse3",
                "stibp",
                "syscall",
                "topoext",
                "tsc",
                "tsc_adjust",
                "tsc_known_freq",
                "umip",
                "vme",
                "vmmcall",
                "xgetbv1",
                "xsave",
                "xsavec",
                "xsaveerptr",
                "xsaveopt"
            ],
            "l3_cache_size": 524288,
            "l2_cache_size": 524288,
            "l1_data_cache_size": 32768,
            "l1_instruction_cache_size": 32768,
            "l2_cache_line_size": 512,
            "l2_cache_associativity": 6
        }
    },
    "commit_info": {
        "id": "ef74a2f099843aad01e21a3623a92e3abfcd66f4",
        "time": "2024-01-04T13:39:49+01:00",
        "author_time": "2024-01-04T13:39:49+01:00",
        "dirty": false,
        "project": "finesse3",
        "branch": "(detached head)"
    },
    "benchmarks": [
        {
            "group": null,
            "name": "test_01_simple_cav",
            "fullname": "tests/benchmarks/test_benchmarks.py::test_01_simple_cav",
            "params": null,
            "param": null,
            "extra_info": {},
            "options": {
                "disable_gc": false,
                "timer": "perf_counter",
                "min_rounds": 5,
                "max_time": 1.0,
                "min_time": 5e-06,
                "warmup": false
            },
            "stats": {
                "min": 0.39276462400000867,
                "max": 0.5778166240000076,
                "mean": 0.46596351540000286,
                "stddev": 0.0916002886300347,
                "rounds": 5,
                "median": 0.4064586009999971,
                "iqr": 0.1621376130000094,
                "q1": 0.3975454974999977,
                "q3": 0.5596831105000071,
                "iqr_outliers": 0,
                "stddev_outliers": 1,
                "outliers": "1;0",
                "ld15iqr": 0.39276462400000867,
                "hd15iqr": 0.5778166240000076,
                "ops": 2.146090770951364,
                "total": 2.3298175770000142,
                "iterations": 1
            }
        },
        {
            "group": null,
            "name": "test_02_pdh_lock",
            "fullname": "tests/benchmarks/test_benchmarks.py::test_02_pdh_lock",
            "params": null,
            "param": null,
            "extra_info": {},
            "options": {
                "disable_gc": false,
                "timer": "perf_counter",
                "min_rounds": 5,
                "max_time": 1.0,
                "min_time": 5e-06,
                "warmup": false
            },
            "stats": {
                "min": 1.3881312280000202,
                "max": 1.6784282540000106,
                "mean": 1.5047631538000075,
                "stddev": 0.13601382111698254,
                "rounds": 5,
                "median": 1.4241872730000011,
                "iqr": 0.23505570400000408,
                "q1": 1.403192963500004,
                "q3": 1.638248667500008,
                "iqr_outliers": 0,
                "stddev_outliers": 1,
                "outliers": "1;0",
                "ld15iqr": 1.3881312280000202,
                "hd15iqr": 1.6784282540000106,
                "ops": 0.664556410405638,
                "total": 7.523815769000038,
                "iterations": 1
            }
        },
        {
            "group": null,
            "name": "test_03_near_unstable",
            "fullname": "tests/benchmarks/test_benchmarks.py::test_03_near_unstable",
            "params": null,
            "param": null,
            "extra_info": {},
            "options": {
                "disable_gc": false,
                "timer": "perf_counter",
                "min_rounds": 5,
                "max_time": 1.0,
                "min_time": 5e-06,
                "warmup": false
            },
            "stats": {
                "min": 1.720000000204891e-06,
                "max": 0.00012306099998227182,
                "mean": 2.815642984801054e-06,
                "stddev": 2.759065825786192e-06,
                "rounds": 43592,
                "median": 3.1300000102874037e-06,
                "iqr": 1.3899999942168506e-06,
                "q1": 1.8000000068241206e-06,
                "q3": 3.1900000010409713e-06,
                "iqr_outliers": 429,
                "stddev_outliers": 422,
                "outliers": "422;429",
                "ld15iqr": 1.720000000204891e-06,
                "hd15iqr": 5.340000001297085e-06,
                "ops": 355158.66372194106,
                "total": 0.12273950899344754,
                "iterations": 1
            }
        },
        {
            "group": null,
            "name": "test_04_geometrical_params",
            "fullname": "tests/benchmarks/test_benchmarks.py::test_04_geometrical_params",
            "params": null,
            "param": null,
            "extra_info": {},
            "options": {
                "disable_gc": false,
                "timer": "perf_counter",
                "min_rounds": 5,
                "max_time": 1.0,
                "min_time": 5e-06,
                "warmup": false
            },
            "stats": {
                "min": 0.5405204850000018,
                "max": 0.900041453,
                "mean": 0.619600301600002,
                "stddev": 0.1569713992676366,
                "rounds": 5,
                "median": 0.554542094999988,
                "iqr": 0.10231226224998835,
                "q1": 0.5425006642500136,
                "q3": 0.644812926500002,
                "iqr_outliers": 1,
                "stddev_outliers": 1,
                "outliers": "1;1",
                "ld15iqr": 0.5405204850000018,
                "hd15iqr": 0.900041453,
                "ops": 1.613943694697512,
                "total": 3.09800150800001,
                "iterations": 1
            }
        },
        {
            "group": null,
            "name": "test_05_modulation",
            "fullname": "tests/benchmarks/test_benchmarks.py::test_05_modulation",
            "params": null,
            "param": null,
            "extra_info": {},
            "options": {
                "disable_gc": false,
                "timer": "perf_counter",
                "min_rounds": 5,
                "max_time": 1.0,
                "min_time": 5e-06,
                "warmup": false
            },
            "stats": {
                "min": 0.17859790099998918,
                "max": 0.20149011699999164,
                "mean": 0.18292526537499398,
                "stddev": 0.007629521134260974,
                "rounds": 8,
                "median": 0.1803524504999956,
                "iqr": 0.0028193340000086664,
                "q1": 0.17924263399999063,
                "q3": 0.1820619679999993,
                "iqr_outliers": 1,
                "stddev_outliers": 1,
                "outliers": "1;1",
                "ld15iqr": 0.17859790099998918,
                "hd15iqr": 0.20149011699999164,
                "ops": 5.466713403148632,
                "total": 1.4634021229999519,
                "iterations": 1
            }
        },
        {
            "group": null,
            "name": "test_06_radiation_pressure",
            "fullname": "tests/benchmarks/test_benchmarks.py::test_06_radiation_pressure",
            "params": null,
            "param": null,
            "extra_info": {},
            "options": {
                "disable_gc": false,
                "timer": "perf_counter",
                "min_rounds": 5,
                "max_time": 1.0,
                "min_time": 5e-06,
                "warmup": false
            },
            "stats": {
                "min": 0.2442007340000032,
                "max": 0.764860801999987,
                "mean": 0.35164213479999373,
                "stddev": 0.23100975270893864,
                "rounds": 5,
                "median": 0.24974711299998376,
                "iqr": 0.13170992925000746,
                "q1": 0.2475534867499931,
                "q3": 0.3792634160000006,
                "iqr_outliers": 1,
                "stddev_outliers": 1,
                "outliers": "1;1",
                "ld15iqr": 0.2442007340000032,
                "hd15iqr": 0.764860801999987,
                "ops": 2.8438002760072476,
                "total": 1.7582106739999688,
                "iterations": 1
            }
        },
        {
            "group": null,
            "name": "test_07_homodyne",
            "fullname": "tests/benchmarks/test_benchmarks.py::test_07_homodyne",
            "params": null,
            "param": null,
            "extra_info": {},
            "options": {
                "disable_gc": false,
                "timer": "perf_counter",
                "min_rounds": 5,
                "max_time": 1.0,
                "min_time": 5e-06,
                "warmup": false
            },
            "stats": {
                "min": 0.1159340899999961,
                "max": 0.12099959200000399,
                "mean": 0.11831676090000087,
                "stddev": 0.001526383123405517,
                "rounds": 10,
                "median": 0.11833105649999709,
                "iqr": 0.0023490279999975883,
                "q1": 0.11698523900000168,
                "q3": 0.11933426699999927,
                "iqr_outliers": 0,
                "stddev_outliers": 3,
                "outliers": "3;0",
                "ld15iqr": 0.1159340899999961,
                "hd15iqr": 0.12099959200000399,
                "ops": 8.451887901539001,
                "total": 1.1831676090000087,
                "iterations": 1
            }
        },
        {
            "group": null,
            "name": "test_08_optical_spring",
            "fullname": "tests/benchmarks/test_benchmarks.py::test_08_optical_spring",
            "params": null,
            "param": null,
            "extra_info": {},
            "options": {
                "disable_gc": false,
                "timer": "perf_counter",
                "min_rounds": 5,
                "max_time": 1.0,
                "min_time": 5e-06,
                "warmup": false
            },
            "stats": {
                "min": 0.3042251319999991,
                "max": 0.31473523200000386,
                "mean": 0.3099967286000037,
                "stddev": 0.0038668044287691493,
                "rounds": 5,
                "median": 0.30988011100001245,
                "iqr": 0.0045744785000110255,
                "q1": 0.3080114942499961,
                "q3": 0.3125859727500071,
                "iqr_outliers": 0,
                "stddev_outliers": 2,
                "outliers": "2;0",
                "ld15iqr": 0.3042251319999991,
                "hd15iqr": 0.31473523200000386,
                "ops": 3.225840493595415,
                "total": 1.5499836430000187,
                "iterations": 1
            }
        },
        {
            "group": null,
            "name": "test_09_aligo_sensitivity",
            "fullname": "tests/benchmarks/test_benchmarks.py::test_09_aligo_sensitivity",
            "params": null,
            "param": null,
            "extra_info": {},
            "options": {
                "disable_gc": false,
                "timer": "perf_counter",
                "min_rounds": 5,
                "max_time": 1.0,
                "min_time": 5e-06,
                "warmup": false
            },
            "stats": {
                "min": 0.33464721299998246,
                "max": 0.3519467070000246,
                "mean": 0.3408394250000015,
                "stddev": 0.006791144799816375,
                "rounds": 5,
                "median": 0.34018349699999817,
                "iqr": 0.008187628500010646,
                "q1": 0.3357628162499964,
                "q3": 0.343950444750007,
                "iqr_outliers": 0,
                "stddev_outliers": 1,
                "outliers": "1;0",
                "ld15iqr": 0.33464721299998246,
                "hd15iqr": 0.3519467070000246,
                "ops": 2.933932892299638,
                "total": 1.7041971250000074,
                "iterations": 1
            }
        },
        {
            "group": null,
            "name": "test_10_shifted_beam",
            "fullname": "tests/benchmarks/test_benchmarks.py::test_10_shifted_beam",
            "params": null,
            "param": null,
            "extra_info": {},
            "options": {
                "disable_gc": false,
                "timer": "perf_counter",
                "min_rounds": 5,
                "max_time": 1.0,
                "min_time": 5e-06,
                "warmup": false
            },
            "stats": {
                "min": 0.7777879970000185,
                "max": 1.5762727739999889,
                "mean": 0.9467601688000002,
                "stddev": 0.3519963604494256,
                "rounds": 5,
                "median": 0.7950757460000091,
                "iqr": 0.20809681599998697,
                "q1": 0.7844583110000016,
                "q3": 0.9925551269999886,
                "iqr_outliers": 1,
                "stddev_outliers": 1,
                "outliers": "1;1",
                "ld15iqr": 0.7777879970000185,
                "hd15iqr": 1.5762727739999889,
                "ops": 1.0562337041148238,
                "total": 4.733800844000001,
                "iterations": 1
            }
        },
        {
            "group": null,
            "name": "test_angular_radiation_pressure",
            "fullname": "tests/benchmarks/test_benchmarks.py::test_angular_radiation_pressure",
            "params": null,
            "param": null,
            "extra_info": {},
            "options": {
                "disable_gc": false,
                "timer": "perf_counter",
                "min_rounds": 5,
                "max_time": 1.0,
                "min_time": 5e-06,
                "warmup": false
            },
            "stats": {
                "min": 0.34260670400001914,
                "max": 0.35112617199999363,
                "mean": 0.34765149999999495,
                "stddev": 0.0034193562316975007,
                "rounds": 5,
                "median": 0.3485919219999971,
                "iqr": 0.00516009349998825,
                "q1": 0.3451113259999943,
                "q3": 0.35027141949998253,
                "iqr_outliers": 0,
                "stddev_outliers": 2,
                "outliers": "2;0",
                "ld15iqr": 0.34260670400001914,
                "hd15iqr": 0.35112617199999363,
                "ops": 2.876443795007398,
                "total": 1.7382574999999747,
                "iterations": 1
            }
        },
        {
            "group": null,
            "name": "test_cavity_eigenmodes",
            "fullname": "tests/benchmarks/test_benchmarks.py::test_cavity_eigenmodes",
            "params": null,
            "param": null,
            "extra_info": {},
            "options": {
                "disable_gc": false,
                "timer": "perf_counter",
                "min_rounds": 5,
                "max_time": 1.0,
                "min_time": 5e-06,
                "warmup": false
            },
            "stats": {
                "min": 0.2866081509999958,
                "max": 1.22599206000001,
                "mean": 0.4830209669999988,
                "stddev": 0.4155829634802996,
                "rounds": 5,
                "median": 0.2919164529999989,
                "iqr": 0.259903941499978,
                "q1": 0.2880936197500077,
                "q3": 0.5479975612499857,
                "iqr_outliers": 1,
                "stddev_outliers": 1,
                "outliers": "1;1",
                "ld15iqr": 0.2866081509999958,
                "hd15iqr": 1.22599206000001,
                "ops": 2.070303502994731,
                "total": 2.415104834999994,
                "iterations": 1
            }
        },
        {
            "group": null,
            "name": "test_coupled_cavity_commands",
            "fullname": "tests/benchmarks/test_benchmarks.py::test_coupled_cavity_commands",
            "params": null,
            "param": null,
            "extra_info": {},
            "options": {
                "disable_gc": false,
                "timer": "perf_counter",
                "min_rounds": 5,
                "max_time": 1.0,
                "min_time": 5e-06,
                "warmup": false
            },
            "stats": {
                "min": 4.5008674780000035,
                "max": 6.140091901000005,
                "mean": 5.094318013000003,
                "stddev": 0.7950823580467286,
                "rounds": 5,
                "median": 4.532449493000001,
                "iqr": 1.3351377090000014,
                "q1": 4.524369015250002,
                "q3": 5.859506724250004,
                "iqr_outliers": 0,
                "stddev_outliers": 1,
                "outliers": "1;0",
                "ld15iqr": 4.5008674780000035,
                "hd15iqr": 6.140091901000005,
                "ops": 0.1962971289676335,
                "total": 25.471590065000015,
                "iterations": 1
            }
        },
        {
            "group": null,
            "name": "test_frequency_dependant_squeezing",
            "fullname": "tests/benchmarks/test_benchmarks.py::test_frequency_dependant_squeezing",
            "params": null,
            "param": null,
            "extra_info": {},
            "options": {
                "disable_gc": false,
                "timer": "perf_counter",
                "min_rounds": 5,
                "max_time": 1.0,
                "min_time": 5e-06,
                "warmup": false
            },
            "stats": {
                "min": 1.589843392000006,
                "max": 1.6564621879999777,
                "mean": 1.6255256791999955,
                "stddev": 0.026824189238921686,
                "rounds": 5,
                "median": 1.6199685729999942,
                "iqr": 0.041841730749993644,
                "q1": 1.607875173250001,
                "q3": 1.6497169039999946,
                "iqr_outliers": 0,
                "stddev_outliers": 2,
                "outliers": "2;0",
                "ld15iqr": 1.589843392000006,
                "hd15iqr": 1.6564621879999777,
                "ops": 0.6151856059832603,
                "total": 8.127628395999977,
                "iterations": 1
            }
        },
        {
            "group": null,
            "name": "test_lock_actions",
            "fullname": "tests/benchmarks/test_benchmarks.py::test_lock_actions",
            "params": null,
            "param": null,
            "extra_info": {},
            "options": {
                "disable_gc": false,
                "timer": "perf_counter",
                "min_rounds": 5,
                "max_time": 1.0,
                "min_time": 5e-06,
                "warmup": false
            },
            "stats": {
                "min": 5.241705477000011,
                "max": 6.030981063000013,
                "mean": 5.525858592599997,
                "stddev": 0.3051339612434349,
                "rounds": 5,
                "median": 5.493979548999988,
                "iqr": 0.33819672000001333,
                "q1": 5.313472535249986,
                "q3": 5.651669255249999,
                "iqr_outliers": 0,
                "stddev_outliers": 1,
                "outliers": "1;0",
                "ld15iqr": 5.241705477000011,
                "hd15iqr": 6.030981063000013,
                "ops": 0.18096735253760546,
                "total": 27.629292962999983,
                "iterations": 1
            }
        }
    ],
    "datetime": "2024-01-04T12:52:26.909666",
    "version": "4.0.0"
}