{
    "machine_info": {
        "node": "runner-xs6vzpvo-project-39604133-concurrent-0",
        "processor": "",
        "machine": "x86_64",
        "python_compiler": "GCC 12.2.0",
        "python_implementation": "CPython",
        "python_implementation_version": "3.12.5",
        "python_version": "3.12.5",
        "python_build": [
            "main",
            "Aug 13 2024 02:19:05"
        ],
        "release": "5.15.154+",
        "system": "Linux",
        "cpu": {
            "python_version": "3.12.5.final.0 (64 bit)",
            "cpuinfo_version": [
                9,
                0,
                0
            ],
            "cpuinfo_version_string": "9.0.0",
            "arch": "X86_64",
            "bits": 64,
            "count": 2,
            "arch_string_raw": "x86_64",
            "vendor_id_raw": "AuthenticAMD",
            "brand_raw": "AMD EPYC 7B13",
            "hz_advertised_friendly": "2.4500 GHz",
            "hz_actual_friendly": "2.4500 GHz",
            "hz_advertised": [
                2449998000,
                0
            ],
            "hz_actual": [
                2449998000,
                0
            ],
            "model": 1,
            "family": 25,
            "flags": [
                "3dnowext",
                "3dnowprefetch",
                "abm",
                "adx",
                "aes",
                "apic",
                "arat",
                "avx",
                "avx2",
                "bmi1",
                "bmi2",
                "clflush",
                "clflushopt",
                "clwb",
                "clzero",
                "cmov",
                "cmp_legacy",
                "constant_tsc",
                "cpuid",
                "cr8_legacy",
                "cx16",
                "cx8",
                "de",
                "erms",
                "extd_apicid",
                "f16c",
                "fma",
                "fpu",
                "fsgsbase",
                "fsrm",
                "fxsr",
                "fxsr_opt",
                "ht",
                "hypervisor",
                "ibpb",
                "ibrs",
                "invpcid",
                "invpcid_single",
                "lahf_lm",
                "lm",
                "mca",
                "mce",
                "misalignsse",
                "mmx",
                "mmxext",
                "movbe",
                "msr",
                "mtrr",
                "nonstop_tsc",
                "nopl",
                "npt",
                "nrip_save",
                "nx",
                "osvw",
                "osxsave",
                "pae",
                "pat",
                "pcid",
                "pclmulqdq",
                "pdpe1gb",
                "pge",
                "pni",
                "popcnt",
                "pse",
                "pse36",
                "rdpid",
                "rdrand",
                "rdrnd",
                "rdseed",
                "rdtscp",
                "rep_good",
                "sep",
                "sha",
                "sha_ni",
                "smap",
                "smep",
                "ssbd",
                "sse",
                "sse2",
                "sse4_1",
                "sse4_2",
                "sse4a",
                "ssse3",
                "stibp",
                "syscall",
                "topoext",
                "tsc",
                "tsc_adjust",
                "tsc_known_freq",
                "umip",
                "vaes",
                "vme",
                "vmmcall",
                "vpclmulqdq",
                "x2apic",
                "xgetbv1",
                "xsave",
                "xsavec",
                "xsaveerptr",
                "xsaveopt"
            ],
            "l3_cache_size": 524288,
            "l2_cache_size": 524288,
            "l1_data_cache_size": 32768,
            "l1_instruction_cache_size": 32768,
            "l2_cache_line_size": 512,
            "l2_cache_associativity": 6
        }
    },
    "commit_info": {
        "id": "679c99c3a143422d68bdf93cfbac5bf5ce037a56",
        "time": "2024-08-22T23:36:04+09:00",
        "author_time": "2024-08-22T23:36:04+09:00",
        "dirty": false,
        "project": "finesse3",
        "branch": "(detached head)"
    },
    "benchmarks": [
        {
            "group": null,
            "name": "test_01_simple_cav",
            "fullname": "tests/benchmarks/test_benchmarks.py::test_01_simple_cav",
            "params": null,
            "param": null,
            "extra_info": {},
            "options": {
                "disable_gc": false,
                "timer": "perf_counter",
                "min_rounds": 5,
                "max_time": 1.0,
                "min_time": 5e-06,
                "warmup": false
            },
            "stats": {
                "min": 0.27177496799998835,
                "max": 0.5020571210000071,
                "mean": 0.3200521833999915,
                "stddev": 0.10175868910112082,
                "rounds": 5,
                "median": 0.275864968999997,
                "iqr": 0.05890174400001058,
                "q1": 0.27373958624998096,
                "q3": 0.33264133024999154,
                "iqr_outliers": 1,
                "stddev_outliers": 1,
                "outliers": "1;1",
                "ld15iqr": 0.27177496799998835,
                "hd15iqr": 0.5020571210000071,
                "ops": 3.1244904795735464,
                "total": 1.6002609169999573,
                "iterations": 1
            }
        },
        {
            "group": null,
            "name": "test_02_pdh_lock",
            "fullname": "tests/benchmarks/test_benchmarks.py::test_02_pdh_lock",
            "params": null,
            "param": null,
            "extra_info": {},
            "options": {
                "disable_gc": false,
                "timer": "perf_counter",
                "min_rounds": 5,
                "max_time": 1.0,
                "min_time": 5e-06,
                "warmup": false
            },
            "stats": {
                "min": 1.2028234519999899,
                "max": 1.5114429029999883,
                "mean": 1.3310186965999946,
                "stddev": 0.15979359261261739,
                "rounds": 5,
                "median": 1.2221732900000006,
                "iqr": 0.2884872977500095,
                "q1": 1.2145348347499905,
                "q3": 1.5030221325,
                "iqr_outliers": 0,
                "stddev_outliers": 2,
                "outliers": "2;0",
                "ld15iqr": 1.2028234519999899,
                "hd15iqr": 1.5114429029999883,
                "ops": 0.7513042473065469,
                "total": 6.655093482999973,
                "iterations": 1
            }
        },
        {
            "group": null,
            "name": "test_03_near_unstable",
            "fullname": "tests/benchmarks/test_benchmarks.py::test_03_near_unstable",
            "params": null,
            "param": null,
            "extra_info": {},
            "options": {
                "disable_gc": false,
                "timer": "perf_counter",
                "min_rounds": 5,
                "max_time": 1.0,
                "min_time": 5e-06,
                "warmup": false
            },
            "stats": {
                "min": 1.8300000022009044e-06,
                "max": 2.6950000005854235e-05,
                "mean": 1.9561551034350487e-06,
                "stddev": 5.122535502654491e-07,
                "rounds": 52494,
                "median": 1.910000008820134e-06,
                "iqr": 4.000000330961484e-08,
                "q1": 1.8999999724655936e-06,
                "q3": 1.9399999757752084e-06,
                "iqr_outliers": 1942,
                "stddev_outliers": 600,
                "outliers": "600;1942",
                "ld15iqr": 1.839999981712026e-06,
                "hd15iqr": 1.9999999949504854e-06,
                "ops": 511206.90697991144,
                "total": 0.10268640599971945,
                "iterations": 1
            }
        },
        {
            "group": null,
            "name": "test_04_geometrical_params",
            "fullname": "tests/benchmarks/test_benchmarks.py::test_04_geometrical_params",
            "params": null,
            "param": null,
            "extra_info": {},
            "options": {
                "disable_gc": false,
                "timer": "perf_counter",
                "min_rounds": 5,
                "max_time": 1.0,
                "min_time": 5e-06,
                "warmup": false
            },
            "stats": {
                "min": 0.4677386760000104,
                "max": 0.8688537950000068,
                "mean": 0.5539974150000091,
                "stddev": 0.17613563321781606,
                "rounds": 5,
                "median": 0.4817906579999942,
                "iqr": 0.10958996374999685,
                "q1": 0.4691305567500166,
                "q3": 0.5787205205000134,
                "iqr_outliers": 1,
                "stddev_outliers": 1,
                "outliers": "1;1",
                "ld15iqr": 0.4677386760000104,
                "hd15iqr": 0.8688537950000068,
                "ops": 1.8050625741637865,
                "total": 2.7699870750000457,
                "iterations": 1
            }
        },
        {
            "group": null,
            "name": "test_05_modulation",
            "fullname": "tests/benchmarks/test_benchmarks.py::test_05_modulation",
            "params": null,
            "param": null,
            "extra_info": {},
            "options": {
                "disable_gc": false,
                "timer": "perf_counter",
                "min_rounds": 5,
                "max_time": 1.0,
                "min_time": 5e-06,
                "warmup": false
            },
            "stats": {
                "min": 0.1242763879999984,
                "max": 0.5764417710000203,
                "mean": 0.1863692720000003,
                "stddev": 0.15776600044511926,
                "rounds": 8,
                "median": 0.1310339834999894,
                "iqr": 0.014652048000002083,
                "q1": 0.12471598850000021,
                "q3": 0.1393680365000023,
                "iqr_outliers": 1,
                "stddev_outliers": 1,
                "outliers": "1;1",
                "ld15iqr": 0.1242763879999984,
                "hd15iqr": 0.5764417710000203,
                "ops": 5.3656914000286395,
                "total": 1.4909541760000025,
                "iterations": 1
            }
        },
        {
            "group": null,
            "name": "test_06_radiation_pressure",
            "fullname": "tests/benchmarks/test_benchmarks.py::test_06_radiation_pressure",
            "params": null,
            "param": null,
            "extra_info": {},
            "options": {
                "disable_gc": false,
                "timer": "perf_counter",
                "min_rounds": 5,
                "max_time": 1.0,
                "min_time": 5e-06,
                "warmup": false
            },
            "stats": {
                "min": 0.2448204419999911,
                "max": 0.25291108900000836,
                "mean": 0.24890579380000305,
                "stddev": 0.0029039201691411064,
                "rounds": 5,
                "median": 0.24890785600001664,
                "iqr": 0.003080919250002978,
                "q1": 0.2473845749999981,
                "q3": 0.2504654942500011,
                "iqr_outliers": 0,
                "stddev_outliers": 2,
                "outliers": "2;0",
                "ld15iqr": 0.2448204419999911,
                "hd15iqr": 0.25291108900000836,
                "ops": 4.01758426243587,
                "total": 1.2445289690000152,
                "iterations": 1
            }
        },
        {
            "group": null,
            "name": "test_07_homodyne",
            "fullname": "tests/benchmarks/test_benchmarks.py::test_07_homodyne",
            "params": null,
            "param": null,
            "extra_info": {},
            "options": {
                "disable_gc": false,
                "timer": "perf_counter",
                "min_rounds": 5,
                "max_time": 1.0,
                "min_time": 5e-06,
                "warmup": false
            },
            "stats": {
                "min": 0.08294894200000158,
                "max": 0.09091606900000215,
                "mean": 0.08715456408333704,
                "stddev": 0.002581703655295073,
                "rounds": 12,
                "median": 0.08803835650000735,
                "iqr": 0.0038771479999866187,
                "q1": 0.08514251900001568,
                "q3": 0.0890196670000023,
                "iqr_outliers": 0,
                "stddev_outliers": 3,
                "outliers": "3;0",
                "ld15iqr": 0.08294894200000158,
                "hd15iqr": 0.09091606900000215,
                "ops": 11.473868414324256,
                "total": 1.0458547690000444,
                "iterations": 1
            }
        },
        {
            "group": null,
            "name": "test_08_optical_spring",
            "fullname": "tests/benchmarks/test_benchmarks.py::test_08_optical_spring",
            "params": null,
            "param": null,
            "extra_info": {},
            "options": {
                "disable_gc": false,
                "timer": "perf_counter",
                "min_rounds": 5,
                "max_time": 1.0,
                "min_time": 5e-06,
                "warmup": false
            },
            "stats": {
                "min": 0.23154235100000164,
                "max": 0.24972169699998403,
                "mean": 0.2394393137999998,
                "stddev": 0.007212732549513355,
                "rounds": 5,
                "median": 0.2376027059999899,
                "iqr": 0.010951161750014649,
                "q1": 0.2340561057499997,
                "q3": 0.24500726750001434,
                "iqr_outliers": 0,
                "stddev_outliers": 2,
                "outliers": "2;0",
                "ld15iqr": 0.23154235100000164,
                "hd15iqr": 0.24972169699998403,
                "ops": 4.176423596148816,
                "total": 1.197196568999999,
                "iterations": 1
            }
        },
        {
            "group": null,
            "name": "test_09_aligo_sensitivity",
            "fullname": "tests/benchmarks/test_benchmarks.py::test_09_aligo_sensitivity",
            "params": null,
            "param": null,
            "extra_info": {},
            "options": {
                "disable_gc": false,
                "timer": "perf_counter",
                "min_rounds": 5,
                "max_time": 1.0,
                "min_time": 5e-06,
                "warmup": false
            },
            "stats": {
                "min": 0.25697480300001985,
                "max": 0.26506219000000897,
                "mean": 0.2607571984000117,
                "stddev": 0.0028934723271693335,
                "rounds": 5,
                "median": 0.2604784560000155,
                "iqr": 0.002802589999973293,
                "q1": 0.2593297827500223,
                "q3": 0.26213237274999557,
                "iqr_outliers": 0,
                "stddev_outliers": 2,
                "outliers": "2;0",
                "ld15iqr": 0.25697480300001985,
                "hd15iqr": 0.26506219000000897,
                "ops": 3.834985212818405,
                "total": 1.3037859920000585,
                "iterations": 1
            }
        },
        {
            "group": null,
            "name": "test_10_shifted_beam",
            "fullname": "tests/benchmarks/test_benchmarks.py::test_10_shifted_beam",
            "params": null,
            "param": null,
            "extra_info": {},
            "options": {
                "disable_gc": false,
                "timer": "perf_counter",
                "min_rounds": 5,
                "max_time": 1.0,
                "min_time": 5e-06,
                "warmup": false
            },
            "stats": {
                "min": 0.7298863640000093,
                "max": 1.4751399209999931,
                "mean": 0.8849548764000019,
                "stddev": 0.3299951298997748,
                "rounds": 5,
                "median": 0.7361774489999959,
                "iqr": 0.19652817174999626,
                "q1": 0.7337031927500064,
                "q3": 0.9302313645000027,
                "iqr_outliers": 1,
                "stddev_outliers": 1,
                "outliers": "1;1",
                "ld15iqr": 0.7298863640000093,
                "hd15iqr": 1.4751399209999931,
                "ops": 1.1300011183259444,
                "total": 4.42477438200001,
                "iterations": 1
            }
        },
        {
            "group": null,
            "name": "test_angular_radiation_pressure",
            "fullname": "tests/benchmarks/test_benchmarks.py::test_angular_radiation_pressure",
            "params": null,
            "param": null,
            "extra_info": {},
            "options": {
                "disable_gc": false,
                "timer": "perf_counter",
                "min_rounds": 5,
                "max_time": 1.0,
                "min_time": 5e-06,
                "warmup": false
            },
            "stats": {
                "min": 0.29994436100000144,
                "max": 0.3023069330000112,
                "mean": 0.3008139591999964,
                "stddev": 0.0008896763277965763,
                "rounds": 5,
                "median": 0.3005349799999806,
                "iqr": 0.00081259799998179,
                "q1": 0.3003564335000064,
                "q3": 0.3011690314999882,
                "iqr_outliers": 0,
                "stddev_outliers": 1,
                "outliers": "1;0",
                "ld15iqr": 0.29994436100000144,
                "hd15iqr": 0.3023069330000112,
                "ops": 3.324313813958179,
                "total": 1.5040697959999818,
                "iterations": 1
            }
        },
        {
            "group": null,
            "name": "test_cavity_eigenmodes",
            "fullname": "tests/benchmarks/test_benchmarks.py::test_cavity_eigenmodes",
            "params": null,
            "param": null,
            "extra_info": {},
            "options": {
                "disable_gc": false,
                "timer": "perf_counter",
                "min_rounds": 5,
                "max_time": 1.0,
                "min_time": 5e-06,
                "warmup": false
            },
            "stats": {
                "min": 0.27317208700000606,
                "max": 1.2107102509999947,
                "mean": 0.4647363775999963,
                "stddev": 0.41702901016835014,
                "rounds": 5,
                "median": 0.27980863400000544,
                "iqr": 0.23938192299998917,
                "q1": 0.2757909242499963,
                "q3": 0.5151728472499855,
                "iqr_outliers": 1,
                "stddev_outliers": 1,
                "outliers": "1;1",
                "ld15iqr": 0.27317208700000606,
                "hd15iqr": 1.2107102509999947,
                "ops": 2.151757530073772,
                "total": 2.3236818879999817,
                "iterations": 1
            }
        },
        {
            "group": null,
            "name": "test_coupled_cavity_commands",
            "fullname": "tests/benchmarks/test_benchmarks.py::test_coupled_cavity_commands",
            "params": null,
            "param": null,
            "extra_info": {},
            "options": {
                "disable_gc": false,
                "timer": "perf_counter",
                "min_rounds": 5,
                "max_time": 1.0,
                "min_time": 5e-06,
                "warmup": false
            },
            "stats": {
                "min": 4.423338431000019,
                "max": 5.569752625999996,
                "mean": 4.943022057600001,
                "stddev": 0.5691033128737246,
                "rounds": 5,
                "median": 4.708497208000011,
                "iqr": 1.0870505715000078,
                "q1": 4.46068185499999,
                "q3": 5.547732426499998,
                "iqr_outliers": 0,
                "stddev_outliers": 2,
                "outliers": "2;0",
                "ld15iqr": 4.423338431000019,
                "hd15iqr": 5.569752625999996,
                "ops": 0.20230538895987302,
                "total": 24.715110288000005,
                "iterations": 1
            }
        },
        {
            "group": null,
            "name": "test_frequency_dependant_squeezing",
            "fullname": "tests/benchmarks/test_benchmarks.py::test_frequency_dependant_squeezing",
            "params": null,
            "param": null,
            "extra_info": {},
            "options": {
                "disable_gc": false,
                "timer": "perf_counter",
                "min_rounds": 5,
                "max_time": 1.0,
                "min_time": 5e-06,
                "warmup": false
            },
            "stats": {
                "min": 1.4598955310000008,
                "max": 2.8422804470000074,
                "mean": 1.7535721042000034,
                "stddev": 0.6089798817059878,
                "rounds": 5,
                "median": 1.4850280459999965,
                "iqr": 0.3820871572500124,
                "q1": 1.4644746049999995,
                "q3": 1.846561762250012,
                "iqr_outliers": 1,
                "stddev_outliers": 1,
                "outliers": "1;1",
                "ld15iqr": 1.4598955310000008,
                "hd15iqr": 2.8422804470000074,
                "ops": 0.5702645460685004,
                "total": 8.767860521000017,
                "iterations": 1
            }
        },
        {
            "group": null,
            "name": "test_lock_actions",
            "fullname": "tests/benchmarks/test_benchmarks.py::test_lock_actions",
            "params": null,
            "param": null,
            "extra_info": {},
            "options": {
                "disable_gc": false,
                "timer": "perf_counter",
                "min_rounds": 5,
                "max_time": 1.0,
                "min_time": 5e-06,
                "warmup": false
            },
            "stats": {
                "min": 3.102235744000012,
                "max": 4.631841030000004,
                "mean": 3.4427892040000017,
                "stddev": 0.6651837298273274,
                "rounds": 5,
                "median": 3.162019891,
                "iqr": 0.39109147175002335,
                "q1": 3.1404073689999876,
                "q3": 3.531498840750011,
                "iqr_outliers": 1,
                "stddev_outliers": 1,
                "outliers": "1;1",
                "ld15iqr": 3.102235744000012,
                "hd15iqr": 4.631841030000004,
                "ops": 0.290462163305889,
                "total": 17.21394602000001,
                "iterations": 1
            }
        }
    ],
    "datetime": "2024-08-22T14:42:56.280049",
    "version": "4.0.0"
}