<svg enable-background="new" height="136.11" width="414.39" xmlns="http://www.w3.org/2000/svg" xmlns:xlink="http://www.w3.org/1999/xlink">
	<radialGradient id="a" cx="9.59" cy="8.25" gradientTransform="matrix(2.71 0 0 2.66 492.84 344.71)" gradientUnits="userSpaceOnUse" r="6.75" xlink:href="#g"/>
	<radialGradient id="b" cx="9.59" cy="8.25" gradientTransform="matrix(2.71 0 0 2.66 492.84 419.29)" gradientUnits="userSpaceOnUse" r="6.75" xlink:href="#g"/>
	<radialGradient id="c" cx="9.59" cy="8.25" gradientTransform="matrix(2.71 0 0 2.66 492.84 382)" gradientUnits="userSpaceOnUse" r="6.75" xlink:href="#g"/>
	<linearGradient id="d" gradientUnits="userSpaceOnUse" x1="302.84" x2="302.84" y1="378.93" y2="361.17">
		<stop offset="0" stop-color="#fff"/>
		<stop offset=".2501" stop-color="#ff9"/>
		<stop offset=".428" stop-color="#ffff58"/>
		<stop offset=".5112" stop-color="#ffff3e"/>
		<stop offset=".581" stop-color="#ffff53"/>
		<stop offset=".7253" stop-color="#ffff89"/>
		<stop offset=".9301" stop-color="#ffffe0"/>
		<stop offset="1" stop-color="#fff"/>
	</linearGradient>
	<linearGradient id="e" gradientTransform="matrix(-1 0 0 -1 241.7 395.18)" gradientUnits="userSpaceOnUse" x1="0" x2="0" y1="33.35" y2="12.75">
		<stop offset="0" stop-color="#fff"/>
		<stop offset=".0051" stop-color="#fefcfc"/>
		<stop offset=".1497" stop-color="#e6a4a4"/>
		<stop offset=".277" stop-color="#d35e5e"/>
		<stop offset=".3823" stop-color="#c62b2b"/>
		<stop offset=".4615" stop-color="#bd0c0c"/>
		<stop offset=".5056" stop-color="#ba0000"/>
		<stop offset=".7077" stop-color="#d86e6e"/>
		<stop offset=".9099" stop-color="#f4d6d6"/>
		<stop offset="1" stop-color="#fff"/>
	</linearGradient>
	<marker id="f" orient="auto" overflow="visible" refX="0" refY="0">
		<path d="m8.72 4.03-10.93-4.01 10.93-4.02c-1.75 2.37-1.74 5.62 0 8.03z" fill="#f00" fill-rule="evenodd" stroke="#f00" stroke-linejoin="round" stroke-width=".63" transform="scale(-.6)"/>
	</marker>
	<radialGradient id="g" cx="9.59" cy="8.25" gradientTransform="matrix(2.71 0 0 2.66 692.37 1472.27)" gradientUnits="userSpaceOnUse" r="6.75">
		<stop offset="0" stop-color="#a0fea9"/>
		<stop offset=".68540001" stop-color="#007fba"/>
	</radialGradient>
	<radialGradient id="h" cx="318.81" cy="433.02" gradientUnits="userSpaceOnUse" r="14.55">
		<stop offset=".0056" stop-color="#a0a0a0"/>
		<stop offset=".2268" stop-color="#a3a3a3"/>
		<stop offset=".3952" stop-color="#adadad"/>
		<stop offset=".5462" stop-color="#bdbdbd"/>
		<stop offset=".6869" stop-color="#d4d4d4"/>
		<stop offset=".8195" stop-color="#f1f1f1"/>
		<stop offset=".8708" stop-color="#fff"/>
		<stop offset=".8855" stop-color="#fafafa"/>
		<stop offset=".9032" stop-color="#ebebec"/>
		<stop offset=".9227" stop-color="#d3d2d4"/>
		<stop offset=".9433" stop-color="#b2b0b3"/>
		<stop offset=".9648" stop-color="#878489"/>
		<stop offset=".9867" stop-color="#534f56"/>
		<stop offset="1" stop-color="#302b33"/>
	</radialGradient>
	<g transform="translate(-180.01 -322.44)">
		<path d="m476.05 376.02s-4.5 11-3.8 16.65c.62 5.08 2.89 10.56 6.94 13.68 4.2 3.23 8.66 3.13 15.55 3.31 6.89.19 20.14 0 20.14 0" style="fill:none;stroke:#f00;stroke-width:2;stroke-linecap:round;stroke-miterlimit:5;stroke-dasharray:8 8"/>
		<path d="m509.63 398.21h2.84v22.68h-2.84z" stroke="#000" stroke-width=".75"/>
		<circle cx="318.81" cy="433.02" fill="url(#h)" r="14.17" stroke="#000" stroke-width=".75"/>
		<path d="m309.6 433.73c.18-1.11 2.04-7.09 5.11-7.09s5.12 11.34 8.19 11.34 5.01-5.97 5.12-7.09" fill="none" stroke="#000" stroke-width="1.5"/>
		<path d="m221.48 372.12h279.83" fill="none" marker-end="url(#f)" stroke="#f00" stroke-linecap="round" stroke-width="2"/>
		<path d="m241.32 394.8h-56.69v-12.76h56.69z" fill="#302b33"/>
		<path d="m241.32 362.21h-56.69v-12.76h56.69z" fill="#302b33"/>
		<g stroke="#000" stroke-width=".75">
			<path d="m241.32 382.05h-56.69v-19.84h56.69z" fill="url(#e)"/>
			<path d="m184.63 391.97h-4.25v-39.69h4.25z"/>
			<path d="m241.32 394.8h-56.69v-45.35h56.69z" fill="none"/>
			<path d="m303.22 361.54h31.18v17.01h-31.18z" fill="url(#d)"/>
			<g fill="#8a644a">
				<path d="m303.22 354.46h31.18v4.25h-31.18z"/>
				<path d="m303.22 381.39h31.18v4.25h-31.18z"/>
			</g>
		</g>
		<text font-family="Arial" x="188.88" y="333.89"><tspan font-family="Arial" font-size="16" x="188.88" y="333.89">Laser</tspan></text>
		<text font-family="Arial" x="437.87" y="335.32"><tspan font-size="18" x="437.87" y="335.32">amplitude detectors</tspan></text>
		<text font-family="Arial" x="301.44" y="334.09"><tspan font-size="16" x="301.44" y="334.09">EOM</tspan></text>
		<path d="m475.47 375.14-9.88 15.55c-4.3 6.76-8.85 11.34-10.74 18.09-2.32 8.27-4.99 18.56-.31 25.75 5.43 8.36 17.7 9.81 27.46 11.82 8.92 1.83 27.32 0 27.32 0" style="fill:none;stroke:#f00;stroke-width:2;stroke-linecap:round;stroke-miterlimit:5;stroke-dasharray:8 8"/>
		<path d="m481.35 372.31c0 2.29-1.85 4.14-4.14 4.14s-4.14-1.85-4.14-4.14 1.85-4.15 4.14-4.15c2.26 0 4.11 1.82 4.14 4.08l-4.14.07z" fill="#f00"/>
		<g stroke="#000">
			<path d="m318.81 418.66c0-32.04 0-32.04 0-32.04" fill="none" opacity=".84" stroke-width="2"/>
			<path d="m515.3 362.33c-.99 0-1.94.15-2.84.42v19.01c.9.27 1.85.42 2.84.42 5.48 0 9.92-4.45 9.92-9.93s-4.44-9.92-9.92-9.92z" fill="url(#a)" stroke-width=".75"/>
			<path d="m509.63 360.92h2.84v22.68h-2.84z" stroke-width=".75"/>
			<path d="m515.3 436.91c-.99 0-1.94.15-2.84.42v19.01c.9.27 1.85.42 2.84.42 5.48 0 9.92-4.45 9.92-9.93s-4.44-9.92-9.92-9.92z" fill="url(#b)" stroke-width=".75"/>
			<path d="m509.63 435.5h2.84v22.68h-2.84z" stroke-width=".75"/>
			<path d="m515.3 399.62c-.99 0-1.94.15-2.84.42v19.01c.9.27 1.85.42 2.84.42 5.48 0 9.92-4.45 9.92-9.93s-4.44-9.92-9.92-9.92z" fill="url(#c)" stroke-width=".75"/>
		</g>
	</g>
</svg>
