com/universitario/projetoEscola/api/exceptionhandler/ApiExceptionHandler.class
com/universitario/projetoEscola/domain/repository/ProfessorRepository.class
com/universitario/projetoEscola/api/exceptionhandler/Problema.class
com/universitario/projetoEscola/domain/exception/NegocioException.class
com/universitario/projetoEscola/ProjetoEscolaApplication.class
com/universitario/projetoEscola/api/exceptionhandler/Problema$Campo.class
com/universitario/projetoEscola/domain/model/Professor.class
com/universitario/projetoEscola/domain/service/CatalogoProfessorService.class
com/universitario/projetoEscola/api/controller/ProfessorController.class
