{
    "title": "contamination score",
    "type": "object",
    "level": "recommended",
    "properties": {
        "contamination score": {
            "description": "The contamination score is based on the fraction of single-copy genes that are observed more than once in a query genome. Contamination score is one of 3 attributes which in combination reflect the standard quality of a MAG, see here for more information: https://ena-docs.readthedocs.io/en/latest/faq_metagenomes.html. If contamination \u2265 10% then please submit as a binned assembly. In SAGs, contamination score is mandatory for prokaryotes and optional for eukaryotes.",
            "type": "string",
            "pattern": "^(\\d|[1-9]\\d|\\d\\.\\d{1,2}|[1-9]\\d\\.\\d{1,2}|100)$"
        },
        "unit": {
            "type": "string",
            "enum": [
                "%"
            ]
        }
    }
}