{
    "title": "host infra-specific name",
    "type": "object",
    "level": "optional",
    "properties": {
        "host infra-specific name": {
            "description": "taxonomic information about the host below subspecies level",
            "type": "string"
        }
    }
}