{
    "title": "room dimensions",
    "type": "object",
    "level": "optional",
    "properties": {
        "room dimensions": {
            "description": "The length, width and height of sampling room",
            "type": "string"
        }
    }
}