{
    "title": "relationship to oxygen",
    "type": "object",
    "level": "optional",
    "properties": {
        "relationship to oxygen": {
            "description": "Is this organism an aerobe, anaerobe? Please note that aerobic and anaerobic are valid descriptors for microbial environments",
            "type": "string",
            "enum": [
                "aerobe",
                "anaerobe",
                "facultative",
                "microaerophilic",
                "microanaerobe",
                "obligate aerobe",
                "obligate anaerobe"
            ]
        }
    }
}