{
    "title": "window vertical position",
    "type": "object",
    "level": "optional",
    "properties": {
        "window vertical position": {
            "description": "The vertical position of the window on the wall",
            "type": "string"
        },
        "unit": {
            "type": "string",
            "enum": [
                "\u00b0C"
            ]
        }
    }
}