{
    "title": "technical sample replicate",
    "type": "object",
    "level": "optional",
    "properties": {
        "technical sample replicate": {
            "description": "Repeated measurements of the same sample that show independent measures of the noise associated with the equipment and the protocols.",
            "type": "string"
        }
    }
}