{
    "title": "water content method",
    "type": "object",
    "level": "optional",
    "properties": {
        "water content method": {
            "description": "reference or method used in determining the water content of soil",
            "type": "string"
        }
    }
}