{
    "title": "observed biotic relationship",
    "type": "object",
    "level": "optional",
    "properties": {
        "observed biotic relationship": {
            "description": "Description of relationship(s) between the subject organism and other organism(s) it is associated with. E.g., parasite on species X; mutualist with species Y. The target organism is the subject of the relationship, and the other organism(s) is the object.",
            "type": "string",
            "enum": [
                "commensal",
                "free living",
                "mutualism",
                "parasite",
                "symbiont"
            ]
        }
    }
}