{
    "title": "sample volume or weight for DNA extraction",
    "type": "object",
    "level": "optional",
    "properties": {
        "sample volume or weight for DNA extraction": {
            "description": "Volume (ml) or mass (g) of total collected sample processed for DNA extraction. Note: total sample collected should be entered under the term 'sample size'.",
            "type": "string",
            "pattern": "(0|((0\\.)|([1-9][0-9]*\\.?))[0-9]*)([Ee][+-]?[0-9]+)?"
        },
        "unit": {
            "type": "string",
            "enum": [
                "g",
                "mL",
                "mg",
                "ng"
            ]
        }
    }
}