{
    "title": "host disease status",
    "type": "object",
    "level": "optional",
    "properties": {
        "host disease status": {
            "description": "list of diseases with which the host has been diagnosed; can include multiple diagnoses. The value of the field depends on host; for humans the terms should be chosen from DO (Disease Ontology) at http://www.disease-ontology.org, other hosts are free text",
            "type": "string"
        }
    }
}