{
    "title": "sample collection device",
    "type": "object",
    "level": "optional",
    "properties": {
        "sample collection device": {
            "description": "The device used to collect an environmental sample. It is recommended to use terms listed under environmental sampling device (http://purl.obolibrary.org/obo/ENVO) and/or terms listed under specimen collection device (http://purl.obolibrary.org/obo/GENEPIO_0002094).",
            "type": "string"
        }
    }
}