{
    "title": "engrafted tumor collection site",
    "type": "object",
    "level": "recommended",
    "properties": {
        "engrafted tumor collection site": {
            "description": "If the sample origin is \u201cengrafted tumor\u201d, please indicate the collection site from which the engrafted tumor sample was extracted (e.g. Liver). Please use terminology from NCIT ontology: https://www.ebi.ac.uk/ols/ontologies/ncit. If unknown please select NCIT term: \u201cNot Available\u201d ( http://purl.obolibrary.org/obo/NCIT_C126101)\u201d. If the sample origin is \u201cpatient tumor\u201d please do not use this attribute.",
            "type": "string"
        }
    }
}