{
    "title": "total organic carbon method",
    "type": "object",
    "level": "optional",
    "properties": {
        "total organic carbon method": {
            "description": "Reference or method used in determining total organic carbon",
            "type": "string"
        }
    }
}