{
    "title": "size fraction selected",
    "type": "object",
    "level": "optional",
    "properties": {
        "size fraction selected": {
            "description": "Filtering pore size used in sample preparation e.g. 0-0.22 micrometer",
            "type": "string"
        }
    }
}