{
    "title": "project name",
    "type": "object",
    "level": "mandatory",
    "properties": {
        "project name": {
            "description": "Name of the project within which the sequencing was organized",
            "type": "string"
        }
    },
    "required": [
        "project name"
    ]
}