{
    "title": "biotic regimen",
    "type": "object",
    "level": "optional",
    "properties": {
        "biotic regimen": {
            "description": "information about treatment involving use of biotic factors, such as bacteria, viruses or fungi",
            "type": "string"
        }
    }
}