{
    "title": "multiplex identifiers",
    "type": "object",
    "level": "optional",
    "properties": {
        "multiplex identifiers": {
            "description": "Molecular barcodes, called Multiplex Identifiers (MIDs), that are used to specifically tag unique samples in a sequencing run. Sequence should be reported in uppercase letters",
            "type": "string"
        }
    }
}