{
    "title": "profile position",
    "type": "object",
    "level": "recommended",
    "properties": {
        "profile position": {
            "description": "cross-sectional position in the hillslope where sample was collected.sample area position in relation to surrounding areas",
            "type": "string",
            "enum": [
                "backslope",
                "footslope",
                "shoulder",
                "summit",
                "toeslope"
            ]
        }
    }
}