{
    "title": "genetic modification",
    "type": "object",
    "level": "optional",
    "properties": {
        "genetic modification": {
            "description": "A genetic modification of the genome of an organism which may occur naturally by spontaneous mutation, or be introduced by some experimental means. Examples of genetic modification include specification of a transgene or the gene knocked-out or details of transient transfection.",
            "type": "string"
        }
    }
}