{
    "title": "sample storage duration",
    "type": "object",
    "level": "optional",
    "properties": {
        "sample storage duration": {
            "description": "Duration for which the sample was stored. Indicate the duration for which the sample was stored written in ISO 8601 format.",
            "type": "string"
        }
    }
}