{
    "title": "humidity regimen",
    "type": "object",
    "level": "optional",
    "properties": {
        "humidity regimen": {
            "description": "information about treatment involving an exposure to varying degree of humidity; information about treatment involving use of growth hormones; should include amount of humidity administered, treatment duration, interval and total experimental duration; can include multiple regimens",
            "type": "string"
        }
    }
}