{
    "title": "host family relationship",
    "type": "object",
    "level": "optional",
    "properties": {
        "host family relationship": {
            "description": "Familial relationships to other hosts in the same study; can include multiple relationships",
            "type": "string"
        }
    }
}