{
    "title": "mean seasonal humidity",
    "type": "object",
    "level": "optional",
    "properties": {
        "mean seasonal humidity": {
            "description": "Average humidity of the region throughout the growing season.",
            "type": "string",
            "pattern": "(0|((0\\.)|([1-9][0-9]*\\.?))[0-9]*)([Ee][+-]?[0-9]+)?"
        },
        "unit": {
            "type": "string",
            "enum": [
                "%",
                "g/m3"
            ]
        }
    }
}