{
    "title": "WGA amplification approach",
    "type": "object",
    "level": "mandatory",
    "properties": {
        "WGA amplification approach": {
            "description": "Method used to amplify genomic DNA in preparation for sequencing",
            "type": "string",
            "enum": [
                "mda based",
                "pcr based"
            ]
        }
    },
    "required": [
        "WGA amplification approach"
    ]
}