{
    "title": "cell_type",
    "type": "object",
    "level": "optional",
    "properties": {
        "cell_type": {
            "description": "cell type from which the sample was obtained",
            "type": "string"
        }
    }
}