{
    "title": "isolation source host-associated",
    "type": "object",
    "level": "recommended",
    "properties": {
        "isolation source host-associated": {
            "description": "Name of host tissue or organ sampled for analysis.",
            "type": "string",
            "example": null
        }
    }
}