{
    "title": "Library name",
    "description": "A unique identifier assigned to the sequencing library for reference and tracking purposes.",
    "type": "object",
    "level": "optional",
    "properties": {
        "library_name": {
            "type": "string"
        }
    }
}
