{
    "title": "host taxid",
    "type": "object",
    "level": "mandatory",
    "properties": {
        "host taxid": {
            "description": "NCBI taxon id of the host, e.g. 9606",
            "type": "string",
            "pattern": "[+-]?[0-9]+"
        }
    },
    "required": [
        "host taxid"
    ]
}