{
    "title": "nucleic acid extraction",
    "type": "object",
    "level": "optional",
    "properties": {
        "nucleic acid extraction": {
            "description": "A link to a literature reference, electronic resource or a standard operating procedure (SOP), that describes the material separation to recover the nucleic acid fraction from a sample",
            "type": "string"
        }
    }
}