{
    "title": "intended consumer",
    "type": "object",
    "level": "optional",
    "properties": {
        "intended consumer": {
            "description": "Food consumer type, human or animal, for which the food product is produced and marketed. This field accepts terms listed under food consumer group (http://purl.obolibrary.org/obo/FOODON_03510136) or NCBI taxid.",
            "type": "string"
        },
        "unit": {
            "type": "string",
            "enum": [
                "m2"
            ]
        }
    }
}