{
    "title": "food product origin geographic location",
    "type": "object",
    "level": "optional",
    "properties": {
        "food product origin geographic location": {
            "description": "A reference to a place on the Earth, by its name or by its geographical location that describes the origin of the food commodity, either in terms of its cultivation or production. This field accepts terms listed under geographic location (http://purl.obolibrary.org/obo/GAZ_00000448).",
            "type": "string"
        },
        "unit": {
            "type": "string",
            "enum": [
                "m"
            ]
        }
    }
}