{
    "title": "treatment date",
    "type": "object",
    "level": "recommended",
    "properties": {
        "treatment date": {
            "description": "The date of the treatment applied.",
            "type": "string",
            "format": "date"
        }
    }
}