{
    "title": "farm watering water source",
    "type": "object",
    "level": "optional",
    "properties": {
        "farm watering water source": {
            "description": "Source of water used on the farm for irrigation of crops or watering of livestock.",
            "type": "string"
        }
    }
}