{
    "title": "host prediction approach",
    "type": "object",
    "level": "optional",
    "properties": {
        "host prediction approach": {
            "description": "Tool or approach used for host prediction",
            "type": "string",
            "enum": [
                "CRISPR spacer match",
                "co-occurrence",
                "combination",
                "host sequence similarity",
                "kmer similarity",
                "other",
                "provirus"
            ]
        }
    }
}