{
    "title": "dietary claim or use",
    "type": "object",
    "level": "optional",
    "properties": {
        "dietary claim or use": {
            "description": "These descriptors are used either for foods intended for special dietary use as defined in 21 CFR 105 or for foods that have special characteristics indicated in the name or labeling. This field accepts terms listed under dietary claim or use (http://purl.obolibrary.org/obo/FOODON_03510023). Multiple terms can be separated by one or more pipes, but please consider limiting this list to the most prominent dietary claim or use.",
            "type": "string"
        }
    }
}