{
    "title": "history/flooding",
    "type": "object",
    "level": "recommended",
    "properties": {
        "history/flooding": {
            "description": "historical and/or physical evidence of flooding",
            "type": "string"
        }
    }
}