{
    "title": "host behaviour",
    "type": "object",
    "level": "recommended",
    "properties": {
        "host behaviour": {
            "description": "Natural behaviour of the host.",
            "type": "string",
            "enum": [
                "captive-wild (e.g. at zoo)",
                "domestic",
                "other",
                "wild"
            ]
        }
    }
}