{
    "title": "host diet",
    "type": "object",
    "level": "optional",
    "properties": {
        "host diet": {
            "description": "type of diet depending on the host, for animals omnivore, herbivore etc., for humans high-fat, Mediterranean etc.; can include multiple diet types",
            "type": "string"
        }
    }
}