{
    "title": "ecotype",
    "type": "object",
    "level": "optional",
    "properties": {
        "ecotype": {
            "description": "a population within a given species displaying genetically based, phenotypic traits that reflect adaptation to a local habitat.",
            "type": "string"
        }
    }
}