{
    "title": "meaning of cut off value",
    "type": "object",
    "level": "optional",
    "properties": {
        "meaning of cut off value": {
            "description": "Description helping to explain what the cut off value means.",
            "type": "string"
        }
    }
}