{
    "title": "local environmental context",
    "type": "object",
    "level": "mandatory",
    "properties": {
        "local environmental context": {
            "description": "Report the entity or entities which are in the sample or specimen\u2019s local vicinity and which you believe have significant causal influences on your sample or specimen. We recommend using EnvO terms which are of smaller spatial grain than your entry for \"broad-scale environmental context\". Terms, such as anatomical sites, from other OBO Library ontologies which interoperate with EnvO (e.g. UBERON) are accepted in this field. EnvO documentation about how to use the field: https://github.com/EnvironmentOntology/envo/wiki/Using-ENVO-with-MIxS.",
            "type": "string"
        }
    },
    "required": [
        "local environmental context"
    ]
}