{
    "title": "salt regimen",
    "type": "object",
    "level": "optional",
    "properties": {
        "salt regimen": {
            "description": "information about treatment involving use of salts as supplement to liquid and soil growth media; should include the name of salt, amount administered, treatment duration, interval and total experimental duration; can include multiple salt regimens",
            "type": "string"
        }
    }
}