{
    "title": "last time swept/mopped/vacuumed",
    "type": "object",
    "level": "optional",
    "properties": {
        "last time swept/mopped/vacuumed": {
            "description": "The last time the floor was cleaned (swept, mopped, vacuumed)",
            "type": "string",
            "format": "date"
        }
    }
}