{
    "title": "rooting medium solidifier",
    "type": "object",
    "level": "optional",
    "properties": {
        "rooting medium solidifier": {
            "description": "specification of the solidifying agent in the culture rooting medium; e.g. agar",
            "type": "string"
        }
    }
}