{
    "title": "subspecific genetic lineage",
    "type": "object",
    "level": "optional",
    "properties": {
        "subspecific genetic lineage": {
            "description": "Information about the genetic distinctness of the sequenced organism below the subspecies level, e.g., serovar, serotype, biotype, ecotype, or any relevant genetic typing schemes like Group I plasmid. Subspecies should not be recorded in this term, but in the NCBI taxonomy. Supply both the lineage name and the lineage rank separated by a colon, e.g., biovar:abc123.",
            "type": "string"
        }
    }
}