{
    "title": "methane",
    "type": "object",
    "level": "optional",
    "properties": {
        "methane": {
            "description": "methane (gas) amount or concentration at the time of sampling",
            "type": "string",
            "pattern": "(0|((0\\.)|([1-9][0-9]*\\.?))[0-9]*)([Ee][+-]?[0-9]+)?"
        },
        "unit": {
            "type": "string",
            "enum": [
                "\u00b5M/L"
            ]
        }
    }
}