{
    "title": "encoded traits",
    "type": "object",
    "level": "optional",
    "properties": {
        "encoded traits": {
            "description": "Should include key traits like antibiotic resistance or xenobiotic degradation phenotypes for plasmids, converting genes for phage",
            "type": "string"
        }
    }
}