{
    "title": "sample subtype",
    "type": "object",
    "level": "optional",
    "properties": {
        "sample subtype": {
            "description": "Name of sample sub-type. For example if \"sample type\" is \"Produced Water\" then subtype could be \"Oil Phase\" or \"Water Phase\". If \"other\" is specified, please propose entry in \"additional info\" field",
            "type": "string"
        },
        "unit": {
            "type": "string",
            "enum": [
                "m2"
            ]
        }
    }
}