{
    "title": "wind speed",
    "type": "object",
    "level": "optional",
    "properties": {
        "wind speed": {
            "description": "speed of wind measured at the time of sampling",
            "type": "string",
            "pattern": "(0|((0\\.)|([1-9][0-9]*\\.?))[0-9]*)([Ee][+-]?[0-9]+)?"
        },
        "unit": {
            "type": "string",
            "enum": [
                "km/h",
                "m/s"
            ]
        }
    }
}