{
    "title": "total nitrogen concentration",
    "type": "object",
    "level": "optional",
    "properties": {
        "total nitrogen concentration": {
            "description": "Concentration of nitrogen (total). Total nitrogen concentration of water samples, calculated by: total nitrogen = total dissolved nitrogen + particulate nitrogen. Can also be measured without filtering, reported as nitrogen",
            "type": "string",
            "pattern": "(0|((0\\.)|([1-9][0-9]*\\.?))[0-9]*)([Ee][+-]?[0-9]+)?"
        },
        "unit": {
            "type": "string",
            "enum": [
                "\u00b5mol/L"
            ]
        }
    }
}