{
    "title": "sediment type",
    "type": "object",
    "level": "optional",
    "properties": {
        "sediment type": {
            "description": "Information about the sediment type based on major constituents",
            "type": "string"
        }
    }
}