{
    "title": "history/fire",
    "type": "object",
    "level": "optional",
    "properties": {
        "history/fire": {
            "description": "historical and/or physical evidence of fire",
            "type": "string"
        }
    }
}