{
    "title": "Salinity Sensor",
    "type": "object",
    "level": "mandatory",
    "properties": {
        "Salinity Sensor": {
            "description": "Salinity of water at the time of taking the sample. Format: ##.####, SDN:P02:75:PSAL, SDN:P06:46:UGKG for PSU.",
            "type": "string",
            "pattern": "[+-]?(0|((0\\.)|([1-9][0-9]*\\.?))[0-9]*)([Ee][+-]?[0-9]+)?",
            "example": "[+-]?(0|((0\\.)|([1-9][0-9]*\\.?))[0-9]*)([Ee][+-]?[0-9]+)?"
        },
        "unit": {
            "type": "string",
            "enum": [
                "psu"
            ]
        }
    },
    "required": [
        "Salinity Sensor"
    ]
}