{
    "title": "link to climate information",
    "type": "object",
    "level": "optional",
    "properties": {
        "link to climate information": {
            "description": "link to climate resource",
            "type": "string"
        }
    }
}