{
    "title": "pressure",
    "type": "object",
    "level": "optional",
    "properties": {
        "pressure": {
            "description": "pressure to which the sample is subject, in atmospheres",
            "type": "string",
            "pattern": "(0|((0\\.)|([1-9][0-9]*\\.?))[0-9]*)([Ee][+-]?[0-9]+)?"
        },
        "unit": {
            "type": "string",
            "enum": [
                "atm",
                "bar"
            ]
        }
    }
}