{
    "title": "soil_taxonomic/local classification",
    "type": "object",
    "level": "recommended",
    "properties": {
        "soil_taxonomic/local classification": {
            "description": "soil classification based on local soil classification system",
            "type": "string"
        }
    }
}