{
    "title": "occupancy documentation",
    "type": "object",
    "level": "optional",
    "properties": {
        "occupancy documentation": {
            "description": "The type of documentation of occupancy",
            "type": "string"
        },
        "unit": {
            "type": "string",
            "enum": [
                "day",
                "hour",
                "minute",
                "month",
                "week",
                "year"
            ]
        }
    }
}