{
    "title": "isolate",
    "type": "object",
    "level": "mandatory",
    "properties": {
        "isolate": {
            "description": "individual isolate from which the sample was obtained",
            "type": "string"
        }
    },
    "required": [
        "isolate"
    ]
}