{
    "title": "microbial biomass",
    "type": "object",
    "level": "optional",
    "properties": {
        "microbial biomass": {
            "description": "the part of the organic matter in the soil that constitutes living microorganisms smaller than 5-10 \u00b5m. IF you keep this, you would need to have correction factors used for conversion to the final units, which should be mg C (or N)/kg soil).",
            "type": "string",
            "pattern": "(0|((0\\.)|([1-9][0-9]*\\.?))[0-9]*)([Ee][+-]?[0-9]+)?"
        },
        "unit": {
            "type": "string",
            "enum": [
                "g/kg"
            ]
        }
    }
}