{
    "title": "sub_group",
    "type": "object",
    "level": "optional",
    "properties": {
        "sub_group": {
            "description": "name of sub-group of organism from which sample was obtained",
            "type": "string"
        }
    }
}