{
    "title": "host scientific name",
    "type": "object",
    "level": "optional",
    "properties": {
        "host scientific name": {
            "description": "Scientific name of the natural (as opposed to laboratory) host to the organism from which sample was obtained.",
            "type": "string"
        }
    }
}