{
    "title": "sub_type",
    "type": "object",
    "level": "optional",
    "properties": {
        "sub_type": {
            "description": "name of sub-type of organism from which sample was obtained",
            "type": "string"
        }
    }
}