{
    "title": "host occupation",
    "type": "object",
    "level": "optional",
    "properties": {
        "host occupation": {
            "description": "most frequent job performed by subject",
            "type": "string",
            "enum": [
                "01=01 Accounting/Finance",
                "02=02 Advertising/Public Relations",
                "03=03 Arts/Entertainment/Publishing",
                "04=04 Automotive",
                "05=05 Banking/ Mortgage",
                "06=06 Biotech",
                "07=07 Broadcast/Journalism",
                "08=08 Business Development",
                "09=09 Clerical/Administrative",
                "10=10 Construction/Trades",
                "11=11 Consultant",
                "12=12 Customer Services",
                "13=13 Design",
                "14=14 Education",
                "15=15 Engineering",
                "16=16 Entry Level",
                "17=17 Executive",
                "18=18 Food Service",
                "19=19 Government",
                "20=20 Grocery",
                "21=21 Healthcare",
                "22=22 Hospitality",
                "23=23 Human Resources",
                "24=24 Information Technology",
                "25=25 Insurance",
                "26=26 Law/Legal",
                "27=27 Management",
                "28=28 Manufacturing",
                "29=29 Marketing",
                "30=30 Pharmaceutical",
                "31=31 Professional Services",
                "32=32 Purchasing",
                "33=33 Quality Assurance (QA)",
                "34=34 Research",
                "35=35 Restaurant",
                "36=36 Retail",
                "37=37 Sales",
                "38=38 Science",
                "39=39 Security/Law Enforcement",
                "40=40 Shipping/Distribution",
                "41=41 Strategy",
                "42=42 Student",
                "43=43 Telecommunications",
                "44=44 Training",
                "45=45 Transportation",
                "46=46 Warehouse",
                "47=47 Other",
                "99=99 Unknown/Refused"
            ]
        }
    }
}