{
    "title": "food additive",
    "type": "object",
    "level": "optional",
    "properties": {
        "food additive": {
            "description": "A substance or substances added to food to maintain or improve safety and freshness, to improve or maintain nutritional value, or improve taste, texture and appearance. This field accepts terms listed under food additive (http://purl.obolibrary.org/obo/FOODON_03412972). Multiple terms can be separated by one or more pipes, but please consider limiting this list to the top 5 ingredients listed in order as on the food label. See also, https://www.fda.gov/food/food-ingredients-packaging/overview-food-ingredients-additives-colors.",
            "type": "string"
        },
        "unit": {
            "type": "string",
            "enum": [
                "%",
                "g/m3"
            ]
        }
    }
}