{
    "title": "crop yield",
    "type": "object",
    "level": "optional",
    "properties": {
        "crop yield": {
            "description": "Amount of crop produced per unit or area of land.",
            "type": "string"
        }
    }
}