{
    "title": "perturbation",
    "type": "object",
    "level": "optional",
    "properties": {
        "perturbation": {
            "description": "type of perturbation, e.g. chemical administration, physical disturbance, etc., coupled with time that perturbation occurred; can include multiple perturbation types",
            "type": "string"
        }
    }
}