{
    "title": "virus identifier",
    "type": "object",
    "level": "recommended",
    "properties": {
        "virus identifier": {
            "description": "Unique laboratory identifier assigned to the virus by the investigator. Strain name is not sufficient since it might not be unique due to various passsages of the same virus. Format: up to 50 alphanumeric characters",
            "type": "string"
        }
    }
}