{
    "title": "saturates wt%",
    "type": "object",
    "level": "optional",
    "properties": {
        "saturates wt%": {
            "description": "Saturate, Aromatic, Resin and Asphaltene\u00ac\u2020(SARA) is an analysis method that divides\u00ac\u2020crude oil\u00ac\u2020components according to their polarizability and polarity. There are three main methods to obtain SARA results. The most popular one is known as the Iatroscan TLC-FID and is referred to as IP-143 (source: https://en.wikipedia.org/wiki/Saturate,_aromatic,_resin_and_asphaltene)",
            "type": "string",
            "pattern": "(0|((0\\.)|([1-9][0-9]*\\.?))[0-9]*)"
        },
        "unit": {
            "type": "string",
            "enum": [
                "%"
            ]
        }
    }
}