{
    "title": "Event Date/Time End",
    "type": "object",
    "level": "optional",
    "properties": {
        "Event Date/Time End": {
            "description": "Date and time in UTC when the sampling event ended, e.g. each CTD cast, net tow, or bucket collection is a distinct event. Format: yyyy-mm-ddThh:mm:ssZ.",
            "type": "string",
            "pattern": "^[0-9]{4}(-[0-9]{2}(-[0-9]{2}(T[0-9]{2}:[0-9]{2}(:[0-9]{2})?Z?([+-][0-9]{1,2})?)?)?)?$",
            "example": "^[0-9]{4}(-[0-9]{2}(-[0-9]{2}(T[0-9]{2}:[0-9]{2}(:[0-9]{2})?Z?([+-][0-9]{1,2})?)?)?)?$"
        }
    }
}