{
    "title": "bacterial respiration",
    "type": "object",
    "level": "optional",
    "properties": {
        "bacterial respiration": {
            "description": "measurement of bacterial respiration in the water column",
            "type": "string",
            "pattern": "[1-9][0-9]*\\.?[0-9]*([Ee][+-]?[0-9]+)?"
        },
        "unit": {
            "type": "string",
            "enum": [
                "mg/m3/d"
            ]
        }
    }
}