{
    "title": "soil cover",
    "type": "object",
    "level": "recommended",
    "properties": {
        "soil cover": {
            "description": "Description of the material covering the sampled soil. This field accepts terms under ENVO:00010483, environmental material.",
            "type": "string"
        }
    }
}