{
    "title": "alkalinity method",
    "type": "object",
    "level": "optional",
    "properties": {
        "alkalinity method": {
            "description": "Method used for alkalinity measurement",
            "type": "string"
        },
        "unit": {
            "type": "string",
            "enum": [
                "m2"
            ]
        }
    }
}