{
    "title": "rooms that share a wall with sampling room",
    "type": "object",
    "level": "optional",
    "properties": {
        "rooms that share a wall with sampling room": {
            "description": "List of room(s) (room number, room name) sharing a wall with the sampling room",
            "type": "string"
        },
        "unit": {
            "type": "string",
            "enum": [
                "day",
                "hour",
                "minute",
                "month",
                "week",
                "year"
            ]
        }
    }
}