{
    "title": "density",
    "type": "object",
    "level": "optional",
    "properties": {
        "density": {
            "description": "density of sample",
            "type": "string",
            "pattern": "(0|((0\\.)|([1-9][0-9]*\\.?))[0-9]*)([Ee][+-]?[0-9]+)?"
        },
        "unit": {
            "type": "string",
            "enum": [
                "g/m3"
            ]
        }
    }
}