{
    "title": "plant growth medium",
    "type": "object",
    "level": "optional",
    "properties": {
        "plant growth medium": {
            "description": "Specification of the media for growing the plants or tissue cultured samples, e.g. soil, aeroponic, hydroponic, in vitro solid culture medium, in vitro liquid culture medium. Recommended value is a specific value from EO:plant growth medium (follow this link for terms http://purl.obolibrary.org/obo/EO_0007147).",
            "type": "string"
        }
    }
}