{
    "title": "pooled DNA extract total",
    "type": "object",
    "level": "optional",
    "properties": {
        "pooled DNA extract total": {
            "description": "Indicate whether multiple DNA extractions were mixed. If the answer yes, the number of extracts that were pooled should be given. [ENA version of MIxS term: pooling of DNA extracts (if done). ]",
            "type": "string",
            "pattern": "([0-9]*)"
        }
    }
}