{
    "title": "ceiling area",
    "type": "object",
    "level": "optional",
    "properties": {
        "ceiling area": {
            "description": "The area of the ceiling space within the room",
            "type": "string",
            "pattern": "(0|((0\\.)|([1-9][0-9]*\\.?))[0-9]*)"
        },
        "unit": {
            "type": "string",
            "enum": [
                "m2"
            ]
        }
    }
}