{
    "title": "room architectural elements",
    "type": "object",
    "level": "optional",
    "properties": {
        "room architectural elements": {
            "description": "The unique details and component parts that, together, form the architecture of a distinguishable space within a built structure",
            "type": "string"
        }
    }
}