{
    "title": "amount or size of sample collected",
    "type": "object",
    "level": "optional",
    "properties": {
        "amount or size of sample collected": {
            "description": "The total amount or size (volume (ml), mass (g) or area (m2) ) of sample collected.",
            "type": "string",
            "pattern": "(0|((0\\.)|([1-9][0-9]*\\.?))[0-9]*)([Ee][+-]?[0-9]+)?"
        },
        "unit": {
            "type": "string",
            "enum": [
                "L",
                "g",
                "kg",
                "m2",
                "m3"
            ]
        }
    }
}