{
    "title": "fermentation chemical additives",
    "type": "object",
    "level": "optional",
    "properties": {
        "fermentation chemical additives": {
            "description": "Any chemicals that are added to the fermentation process to achieve the desired final product.",
            "type": "string"
        },
        "unit": {
            "type": "string",
            "enum": [
                "Cth",
                "J/K",
                "J/\u00b0C"
            ]
        }
    }
}