{
    "title": "emulsions",
    "type": "object",
    "level": "optional",
    "properties": {
        "emulsions": {
            "description": "amount or concentration of substances such as paints, adhesives, mayonnaise, hair colorants, emulsified oils, etc.; can include multiple emulsion types",
            "type": "string",
            "pattern": "(0|((0\\.)|([1-9][0-9]*\\.?))[0-9]*)([Ee][+-]?[0-9]+)?"
        },
        "unit": {
            "type": "string",
            "enum": [
                "g/L",
                "ng/L",
                "\u00b5g/L"
            ]
        }
    }
}