{
    "title": "sampling time point",
    "type": "object",
    "level": "optional",
    "properties": {
        "sampling time point": {
            "description": "Time point at which a sample or observation is made or taken from a biomaterial as measured from some reference point. Indicate the timepoint written in ISO 8601 format.",
            "type": "string"
        }
    }
}