{
    "title": "library construction method",
    "type": "object",
    "level": "optional",
    "properties": {
        "library construction method": {
            "description": "Library construction method used for clone libraries",
            "type": "string"
        }
    }
}