{
    "title": "mean friction velocity",
    "type": "object",
    "level": "optional",
    "properties": {
        "mean friction velocity": {
            "description": "measurement of mean friction velocity",
            "type": "string",
            "pattern": "(0|((0\\.)|([1-9][0-9]*\\.?))[0-9]*)([Ee][+-]?[0-9]+)?"
        },
        "unit": {
            "type": "string",
            "enum": [
                "m/s"
            ]
        }
    }
}