{
    "title": "environmental medium",
    "type": "object",
    "level": "mandatory",
    "properties": {
        "environmental medium": {
            "description": "Report the environmental material(s) immediately surrounding the sample or specimen at the time of sampling. We recommend using subclasses of 'environmental material' (http://purl.obolibrary.org/obo/ENVO_00010483). EnvO documentation about how to use the field: https://github.com/EnvironmentOntology/envo/wiki/Using-ENVO-with-MIxS . Terms from other OBO ontologies are permissible as long as they reference mass/volume nouns (e.g. air, water, blood) and not discrete, countable entities (e.g. a tree, a leaf, a table top).",
            "type": "string"
        }
    },
    "required": [
        "environmental medium"
    ]
}