{
    "title": "Protocol",
    "type": "object",
    "properties": {
        "title": {
            "type": "string",
            "title": "Title",
            "description": "The title of the protocol."
        },
        "description": {
            "type": "string",
            "title": "Description",
            "description": "A brief description of the protocol."
        },
        "steps": {
            "type": "array",
            "title": "Steps",
            "description": "A list of steps in the protocol.",
            "items": {
                "oneOf": [
                    {
                        "title": "Step",
                        "description": "A step in the protocol",
                        "type": "object",
                        "properties": {
                            "title": {
                                "type": "string",
                                "title": "Step Title",
                                "description": "The title of the step."
                            },
                            "description": {
                                "type": "string",
                                "title": "Step Description",
                                "description": "A detailed description of the step."
                            },
                            "type": {
                                "type": "string",
                                "title": "Step Type",
                                "enum": [
                                    "Experimental",
                                    "Computational"
                                ],
                                "description": "The type of step: Experimental or Computational."
                            },
                            "url": {
                                "type": "string",
                                "format": "uri",
                                "title": "Reference URL",
                                "description": "An optional URL for additional reference like Github/Gitlab repository for code."
                            }
                        },
                        "required": [
                            "title",
                            "type"
                        ],
                        "additionalProperties": false
                    }
                ]
            }
        }
    },
    "required": [
        "title",
        "steps"
    ],
    "additionalProperties": false
}