{
    "title": "aquaculture origin",
    "type": "object",
    "level": "mandatory",
    "properties": {
        "aquaculture origin": {
            "description": "Origin of stock and raised conditions",
            "type": "string",
            "enum": [
                "AOAR - aquacultue origin aquaculture raised",
                "WOAR - wild origin aquaculture raised",
                "WOWR - wild origin wild raised"
            ]
        }
    },
    "required": [
        "aquaculture origin"
    ]
}