{
  "title": "Submission identifier",
  "description": "An identifier from the list of supported types: DOI, Handle, ARK, PURL, ISSN, ISBN, PubMed ID, PubMed Central ID, ADS Bibliographic Code, arXiv, Life Science Identifiers (LSID), EAN-13, ISTC, URNs, or URLs.",
  "type": "string",
  "pattern": "^(doi:10\\.\\d{4,9}/[-._;()/:a-zA-Z0-9]+|10\\.\\d{4,9}/[-._;()/:a-zA-Z0-9]+|hdl:[0-9a-zA-Z/.]+|ark:/\\d{5}/[a-zA-Z0-9]+|https?://.+|urn:[a-zA-Z0-9]+:[a-zA-Z0-9-]+|ISBN(?:-13)?:?\\s*(97[89]\\d{9}(\\d|X))|ISSN\\s*\\d{4}-\\d{3}(\\d|X)|PMC\\d+|PMID\\d+|ADS\\s*\\d{4}\\s*\\d{4}\\w|arXiv:\\d{4}\\.\\d{4,5}(v\\d+)?)$"
}
