{
    "title": "serotype",
    "type": "object",
    "level": "optional",
    "properties": {
        "serotype": {
            "description": "serological variety of a species characterized by its antigenic properties",
            "type": "string"
        }
    }
}