{
    "title": "elevation",
    "type": "object",
    "level": "optional",
    "properties": {
        "elevation": {
            "description": "The elevation of the sampling site as measured by the vertical distance from mean sea level.",
            "type": "string",
            "pattern": "([+-]?(0|((0\\.)|([1-9][0-9]*\\.?))[0-9]*)([Ee][+-]?[0-9]+)?)|((^not collected$)|(^not provided$)|(^restricted access$)|(^missing: control sample$)|(^missing: sample group$)|(^missing: synthetic construct$)|(^missing: lab stock$)|(^missing: third party data$)|(^missing: data agreement established pre-2023$)|(^missing: endangered species$)|(^missing: human-identifiable$)|(^missing$))"
        },
        "unit": {
            "type": "string",
            "enum": [
                "m"
            ]
        }
    }
}