{
    "title": "single cell or viral particle lysis kit protocol",
    "type": "object",
    "level": "optional",
    "properties": {
        "single cell or viral particle lysis kit protocol": {
            "description": "Name of the kit or standard protocol used for cell(s) or particle(s) lysis",
            "type": "string"
        }
    }
}