{
    "title": "host dry mass",
    "type": "object",
    "level": "optional",
    "properties": {
        "host dry mass": {
            "description": "measurement of dry mass",
            "type": "string",
            "pattern": "(0|((0\\.)|([1-9][0-9]*\\.?))[0-9]*)([Ee][+-]?[0-9]+)?"
        },
        "unit": {
            "type": "string",
            "enum": [
                "g",
                "kg",
                "mg"
            ]
        }
    }
}