{
    "title": "elevator count",
    "type": "object",
    "level": "optional",
    "properties": {
        "elevator count": {
            "description": "The number of elevators within the built structure",
            "type": "string",
            "pattern": "[0-9]+"
        }
    }
}