{
    "title": "rooting medium pH",
    "type": "object",
    "level": "optional",
    "properties": {
        "rooting medium pH": {
            "description": "pH measurement of the culture rooting medium; e.g. 5.5",
            "type": "string"
        }
    }
}