{
    "title": "gaseous environment",
    "type": "object",
    "level": "optional",
    "properties": {
        "gaseous environment": {
            "description": "use of conditions with differing gaseous environments; should include the name of gaseous compound, amount administered, treatment duration, interval and total experimental duration; can include multiple gaseous environment regimens",
            "type": "string"
        }
    }
}