{
    "title": "host body site",
    "type": "object",
    "level": "optional",
    "properties": {
        "host body site": {
            "description": "name of body site where the sample was obtained from, such as a specific organ or tissue (tongue, lung etc...). For Foundational Model of Anatomy Ontology (FMA) (v 3.1) terms, please see http://purl.bioontology.org/ontology/FMA",
            "type": "string"
        }
    }
}