{
    "title": "reassembly post binning",
    "type": "object",
    "level": "optional",
    "properties": {
        "reassembly post binning": {
            "description": "Has an assembly been performed on a genome bin extracted from a metagenomic assembly?",
            "type": "string",
            "enum": [
                "No",
                "Yes"
            ]
        },
        "unit": {
            "type": "string",
            "enum": [
                "No",
                "Yes"
            ]
        }
    }
}