{
    "title": "oxygenation status of sample",
    "type": "object",
    "level": "optional",
    "properties": {
        "oxygenation status of sample": {
            "description": "oxygenation status of sample",
            "type": "string",
            "enum": [
                "aerobic",
                "anaerobic"
            ]
        }
    }
}