{
    "title": "mean annual temperature",
    "type": "object",
    "level": "optional",
    "properties": {
        "mean annual temperature": {
            "description": "Mean annual temperature",
            "type": "string",
            "pattern": "[+-]?(0|((0\\.)|([1-9][0-9]*\\.?))[0-9]*)([Ee][+-]?[0-9]+)?"
        },
        "unit": {
            "type": "string",
            "enum": [
                "\u00baC"
            ]
        }
    }
}