{
    "title": "influenza strain unique number",
    "type": "object",
    "level": "optional",
    "properties": {
        "influenza strain unique number": {
            "description": "Unique number of the strain which is reported as a part of the influenza strain name, such as A/chicken/Fujian/411/2002(HxN1). Format: integer number,",
            "type": "string",
            "pattern": "[+-]?[0-9]+",
            "example": "[+-]?[0-9]+"
        }
    }
}