{
    "title": "16s recovered",
    "type": "object",
    "level": "optional",
    "properties": {
        "16s recovered": {
            "description": "Can a 16S gene be recovered from the submitted bin, SAG or MAG?",
            "type": "string",
            "enum": [
                "No",
                "Yes"
            ]
        }
    }
}