{
    "title": "water feature type",
    "type": "object",
    "level": "optional",
    "properties": {
        "water feature type": {
            "description": "The type of water feature present within the building being sampled",
            "type": "string"
        }
    }
}