{
    "title": "photon flux",
    "type": "object",
    "level": "optional",
    "properties": {
        "photon flux": {
            "description": "measurement of photon flux",
            "type": "string",
            "pattern": "(0|((0\\.)|([1-9][0-9]*\\.?))[0-9]*)([Ee][+-]?[0-9]+)?"
        },
        "unit": {
            "type": "string",
            "enum": [
                "\u00b5mol/m2/s"
            ]
        }
    }
}