{
    "title": "animal water delivery method",
    "type": "object",
    "level": "optional",
    "properties": {
        "animal water delivery method": {
            "description": "Description of the equipment or method used to distribute water to livestock. This field accepts termed listed under water delivery equipment (http://opendata.inra.fr/EOL/EOL_0001653). Multiple terms can be separated by pipes.",
            "type": "string"
        }
    }
}