{
    "title": "sub_species",
    "type": "object",
    "level": "optional",
    "properties": {
        "sub_species": {
            "description": "name of sub-species of organism from which sample was obtained",
            "type": "string"
        }
    }
}