{
    "title": "non-mineral nutrient regimen",
    "type": "object",
    "level": "recommended",
    "properties": {
        "non-mineral nutrient regimen": {
            "description": "information about treatment involving the exposure of plant to non-mineral nutrient such as oxygen, hydrogen or carbon; should include the name of non-mineral nutrient, amount administered, treatment duration, interval and total experimental duration; can include multiple non-mineral nutrient regimens",
            "type": "string"
        }
    }
}