{
    "title": "glucosidase activity",
    "type": "object",
    "level": "optional",
    "properties": {
        "glucosidase activity": {
            "description": "measurement of glucosidase activity",
            "type": "string",
            "pattern": "(0|((0\\.)|([1-9][0-9]*\\.?))[0-9]*)([Ee][+-]?[0-9]+)?"
        },
        "unit": {
            "type": "string",
            "enum": [
                "mol/L/h"
            ]
        }
    }
}