{
    "title": "geographic location (region and locality)",
    "type": "object",
    "level": "optional",
    "properties": {
        "geographic location (region and locality)": {
            "description": "The geographical origin of the sample as defined by the specific region name followed by the locality name.",
            "type": "string"
        }
    }
}