{
    "title": "shading device condition",
    "type": "object",
    "level": "optional",
    "properties": {
        "shading device condition": {
            "description": "The physical condition of the shading device at the time of sampling",
            "type": "string"
        },
        "unit": {
            "type": "string",
            "enum": [
                "hour",
                "month",
                "week",
                "year"
            ]
        }
    }
}