{
    "title": "animal housing system",
    "type": "object",
    "level": "optional",
    "properties": {
        "animal housing system": {
            "description": "Description of the housing system of the livestock. This field accepts terms listed under terrestrial management housing system (http://opendata.inra.fr/EOL/EOL_0001605).",
            "type": "string"
        }
    }
}