{
    "title": "ethnicity",
    "type": "object",
    "level": "optional",
    "properties": {
        "ethnicity": {
            "description": "A category of people who identify with each other, usually on the basis of presumed similarities such as a common language, ancestry, history, society, culture, nation or social treatment within their residing area. https://en.wikipedia.org/wiki/List_of_contemporary_ethnic_groups",
            "type": "string"
        }
    }
}