{
    "title": "nucleic acid amplification",
    "type": "object",
    "level": "optional",
    "properties": {
        "nucleic acid amplification": {
            "description": "A link to a literature reference, electronic resource or a standard operating procedure (SOP), that describes the enzymatic amplification (PCR, TMA, NASBA) of specific nucleic acids",
            "type": "string"
        }
    }
}