{
    "title": "host subject id",
    "type": "object",
    "level": "optional",
    "properties": {
        "host subject id": {
            "description": "a unique identifier by which each subject can be referred to, de-identified, e.g. #131",
            "type": "string"
        }
    }
}