{
    "title": "type of symbiosis",
    "type": "object",
    "level": "recommended",
    "properties": {
        "type of symbiosis": {
            "description": "Type of biological interaction established between the symbiotic host organism being sampled and its respective host",
            "type": "string"
        },
        "unit": {
            "type": "string",
            "enum": [
                "\u00b0C"
            ]
        }
    }
}