{
    "title": "relevant standard operating procedures",
    "type": "object",
    "level": "optional",
    "properties": {
        "relevant standard operating procedures": {
            "description": "Standard operating procedures used in assembly and/or annotation of genomes, metagenomes or environmental sequences in the format of a PMID, DOI or URL",
            "type": "string"
        }
    }
}