{
    "title": "host storage container temperature",
    "type": "object",
    "level": "recommended",
    "properties": {
        "host storage container temperature": {
            "description": "temperature at which the host is kept before sampling",
            "type": "string",
            "pattern": "(0|((0\\.)|([1-9][0-9]*\\.?))[0-9]*)([Ee][+-]?[0-9]+)?"
        },
        "unit": {
            "type": "string",
            "enum": [
                "\u00b0C"
            ]
        }
    }
}