{
    "title": "nitrite",
    "type": "object",
    "level": "optional",
    "properties": {
        "nitrite": {
            "description": "concentration of nitrite",
            "type": "string",
            "pattern": "(0|((0\\.)|([1-9][0-9]*\\.?))[0-9]*)([Ee][+-]?[0-9]+)?"
        },
        "unit": {
            "type": "string",
            "enum": [
                "\u00b5mol/L"
            ]
        }
    }
}