{
    "title": "observed coinfecting organisms in host of host",
    "type": "object",
    "level": "optional",
    "properties": {
        "observed coinfecting organisms in host of host": {
            "description": "The taxonomic name of any coinfecting organism observed in a symbiotic relationship with the host of the sampled host organism. e.g. where a sample collected from a host trematode species (A) which was collected from a host_of_host fish (B) that was also infected with a nematode (C), the value here would be (C) the nematode {species name} or {common name}. Multiple co-infecting species may be added in a comma-separated list. For listing symbiotic organisms associated with the host (A) use the term Observed host symbiont.",
            "type": "string"
        },
        "unit": {
            "type": "string",
            "enum": [
                "hour",
                "month",
                "week",
                "year"
            ]
        }
    }
}