{
    "title": "mating_type",
    "type": "object",
    "level": "optional",
    "properties": {
        "mating_type": {
            "description": "mating type of the organism from which the sequence was obtained; mating type is used for prokaryotes, and for eukaryotes that undergo meiosis without sexually dimorphic gametes",
            "type": "string"
        }
    }
}