{
    "title": "metagenomic source",
    "type": "object",
    "level": "mandatory",
    "properties": {
        "metagenomic source": {
            "description": "The metagenomic source of the sample. This value should contain \u201cmetagenome\u201d and be in the taxonomy database e.g. wastewater metagenome or human gut metagenome. Please note \u201cmetagenome\u201d alone will not be accepted. Check here for more details on metagenome taxonomy: https://ena-docs.readthedocs.io/en/latest/faq_taxonomy.html#environmental-taxonomic-classifications",
            "type": "string"
        }
    },
    "required": [
        "metagenomic source"
    ]
}