{
    "title": "mechanical structure",
    "type": "object",
    "level": "optional",
    "properties": {
        "mechanical structure": {
            "description": "mechanical structure: a moving structure",
            "type": "string"
        }
    }
}