{
    "title": "birth control",
    "type": "object",
    "level": "optional",
    "properties": {
        "birth control": {
            "description": "specification of birth control medication used",
            "type": "string"
        }
    }
}