{
    "title": "microbial starter ncbi taxonomy id",
    "type": "object",
    "level": "optional",
    "properties": {
        "microbial starter ncbi taxonomy id": {
            "description": "Please include Genus species and strain ID, if known of microorganisms used in food production. For complex communities, pipes can be used to separate two or more microbes.",
            "type": "string"
        }
    }
}