{
    "title": "16S recovery software",
    "type": "object",
    "level": "optional",
    "properties": {
        "16S recovery software": {
            "description": "Tools used for 16S rRNA gene extraction. Add names and versions of software(s), parameters used",
            "type": "string"
        }
    }
}