{
    "title": "adapters",
    "type": "object",
    "level": "optional",
    "properties": {
        "adapters": {
            "description": "Adapters provide priming sequences for both amplification and sequencing of the sample-library fragments. Both adapters should be reported; in uppercase letters",
            "type": "string"
        }
    }
}