{
    "title": "pcr conditions",
    "type": "object",
    "level": "optional",
    "properties": {
        "pcr conditions": {
            "description": "Description of reaction conditions and components for PCR in the form of 'initial denaturation:94degC_1.5min; annealing=...'",
            "type": "string"
        }
    }
}