{
    "title": "subject exposure duration",
    "type": "object",
    "level": "optional",
    "properties": {
        "subject exposure duration": {
            "description": "Duration of the exposure of the subject to an infected human or animal. If multiple exposures are applicable, please state their duration in the same order in which you reported the exposure in the field 'subject exposure'.",
            "type": "string",
            "example": null
        },
        "unit": {
            "type": "string",
            "enum": [
                "day",
                "month",
                "week",
                "year"
            ]
        }
    }
}