{
    "title": "collector name",
    "type": "object",
    "level": "mandatory",
    "properties": {
        "collector name": {
            "description": "Name of the person who collected the specimen.",
            "example": null
        }
    },
    "required": [
        "collector name"
    ]
}