{
    "title": "sample collection method",
    "type": "object",
    "level": "optional",
    "properties": {
        "sample collection method": {
            "description": "The method employed for collecting the sample. Can be provided in the form of a PMID, DOI, url or text.",
            "type": "string"
        }
    }
}