{
    "title": "Sampling Station",
    "type": "object",
    "level": "mandatory",
    "properties": {
        "Sampling Station": {
            "description": "Refers to the site/station where data/sample collection is performed.",
            "type": "string",
            "example": null
        }
    },
    "required": [
        "Sampling Station"
    ]
}