{
    "title": "library reads sequenced",
    "type": "object",
    "level": "optional",
    "properties": {
        "library reads sequenced": {
            "description": "Total number of clones sequenced from the library",
            "type": "string",
            "pattern": "[+-]?[0-9]+"
        }
    }
}