{
    "title": "diether lipids",
    "type": "object",
    "level": "optional",
    "properties": {
        "diether lipids": {
            "description": "concentration of diether lipids; can include multiple types of diether lipids",
            "type": "string",
            "pattern": "(0|((0\\.)|([1-9][0-9]*\\.?))[0-9]*)([Ee][+-]?[0-9]+)?"
        },
        "unit": {
            "type": "string",
            "enum": [
                "ng/L"
            ]
        }
    }
}