{
    "title": "Communities",
    "description": "List of communities you wish the deposition to appear in. The owner of the community will be notified, and can either accept or reject your request.",
    "level": "optional",
    "type": "array",
    "items": {
        "type": "object",
        "properties": {
            "identifier": {
                "type": "string",
                "description": "Community identifier."
            }
        }
    },
    "example": [
        {
            "identifier": "ecfunded"
        }
    ]
}
