{
    "title": "feature prediction",
    "type": "object",
    "level": "optional",
    "properties": {
        "feature prediction": {
            "description": "Method used to predict UViGs features such as ORFs, integration site, etc. Add names and versions of software(s), parameters used",
            "type": "string"
        }
    }
}