{
    "title": "antiviral treatment duration",
    "type": "object",
    "level": "optional",
    "properties": {
        "antiviral treatment duration": {
            "description": "Duration of antiviral treatment after onset of clinical symptoms in days.Example: 5",
            "type": "string"
        }
    }
}