{
    "title": "host total mass",
    "type": "object",
    "level": "optional",
    "properties": {
        "host total mass": {
            "description": "total mass of the host at collection, the unit depends on host",
            "type": "string",
            "pattern": "(0|((0\\.)|([1-9][0-9]*\\.?))[0-9]*)([Ee][+-]?[0-9]+)?"
        },
        "unit": {
            "type": "string",
            "enum": [
                "g",
                "kg"
            ]
        }
    }
}