{
    "title": "size-fraction lower threshold",
    "type": "object",
    "level": "recommended",
    "properties": {
        "size-fraction lower threshold": {
            "description": "Refers to the mesh/pore size used to retain the sample. Materials smaller than the size threshold are excluded from the sample",
            "type": "string",
            "pattern": "(0|((0\\.)|([1-9][0-9]*\\.?))[0-9]*)"
        },
        "unit": {
            "type": "string",
            "enum": [
                "mm",
                "nm",
                "\u00b5m"
            ]
        }
    }
}