{
    "title": "isolation_source",
    "type": "object",
    "level": "mandatory",
    "properties": {
        "isolation_source": {
            "description": "describes the physical, environmental and/or local geographical source of the biological sample from which the sample was derived",
            "type": "string"
        }
    },
    "required": [
        "isolation_source"
    ]
}