{
    "title": "depth",
    "type": "object",
    "level": "optional",
    "properties": {
        "depth": {
            "description": "The vertical distance below local surface, e.g. for sediment or soil samples depth is measured from sediment or soil surface, respectively. Depth can be reported as an interval for subsurface samples.",
            "type": "string",
            "pattern": "((0|((0\\.)|([1-9][0-9]*\\.?))[0-9]*)([Ee][+-]?[0-9]+)?)|((^not collected$)|(^not provided$)|(^restricted access$)|(^missing: control sample$)|(^missing: sample group$)|(^missing: synthetic construct$)|(^missing: lab stock$)|(^missing: third party data$)|(^missing: data agreement established pre-2023$)|(^missing: endangered species$)|(^missing: human-identifiable$)|(^missing$))"
        },
        "unit": {
            "type": "string",
            "enum": [
                "m",
                "mm"
            ]
        }
    }
}