{
    "title": "wall area",
    "type": "object",
    "level": "optional",
    "properties": {
        "wall area": {
            "description": "The total area of the sampled room's walls",
            "type": "string"
        }
    }
}