{
    "title": "extrachromosomal elements",
    "type": "object",
    "level": "optional",
    "properties": {
        "extrachromosomal elements": {
            "description": "Do plasmids exist of significant phenotypic consequence (e.g. ones that determine virulence or antibiotic resistance). Megaplasmids? Other plasmids (borrelia has 15+ plasmids).",
            "type": "string",
            "pattern": "[+-]?[0-9]+"
        }
    }
}