{
    "title": "surface material",
    "type": "object",
    "level": "optional",
    "properties": {
        "surface material": {
            "description": "surface materials at the point of sampling",
            "type": "string",
            "enum": [
                "adobe",
                "carpet",
                "cinder blocks",
                "concrete",
                "glass",
                "hay bales",
                "metal",
                "paint",
                "plastic",
                "stainless steel",
                "stone",
                "stucco",
                "tile",
                "vinyl",
                "wood"
            ]
        }
    }
}