{
    "title": "host common name",
    "type": "object",
    "level": "optional",
    "properties": {
        "host common name": {
            "description": "common name of the host, e.g. human",
            "type": "string"
        }
    }
}