{
    "title": "sample material",
    "type": "object",
    "level": "mandatory",
    "properties": {
        "sample material": {
            "description": "Sample material from which data deposited was generated, e.g. tissue fragment. If unknown please select \"not provided\".",
            "type": "string",
            "enum": [
                "bone marrow aspirate",
                "cell suspension",
                "malignant effusion",
                "not provided",
                "organoid",
                "peripheral blood",
                "tissue fragment"
            ]
        }
    },
    "required": [
        "sample material"
    ]
}