{
    "title": "food source",
    "type": "object",
    "level": "optional",
    "properties": {
        "food source": {
            "description": "Type of plant or animal from which the food product or its major ingredient is derived or a chemical food source [FDA CFSAN 1995].",
            "type": "string"
        }
    }
}