{
    "title": "microbial starter source",
    "type": "object",
    "level": "optional",
    "properties": {
        "microbial starter source": {
            "description": "The source from which the microbial starter culture was sourced. If commercially supplied, list supplier.",
            "type": "string"
        },
        "unit": {
            "type": "string",
            "enum": [
                "day",
                "hour",
                "minute",
                "month",
                "week",
                "year"
            ]
        }
    }
}