{
    "title": "environment adjacent to site",
    "type": "object",
    "level": "optional",
    "properties": {
        "environment adjacent to site": {
            "description": "Description of the environmental system or features that are adjacent to the sampling site. This field accepts terms under ecosystem (http://purl.obolibrary.org/obo/ENVO_01001110) and human construction (http://purl.obolibrary.org/obo/ENVO_00000070). Multiple terms can be separated by pipes.",
            "type": "string"
        }
    }
}