{
    "title": "host age",
    "type": "object",
    "level": "optional",
    "properties": {
        "host age": {
            "description": "age of host at the time of sampling; relevant scale depends on species and study, e.g. could be seconds for amoebae or centuries for trees",
            "type": "string",
            "pattern": "(0|((0\\.)|([1-9][0-9]*\\.?))[0-9]*)([Ee][+-]?[0-9]+)?"
        },
        "unit": {
            "type": "string",
            "enum": [
                "centuries",
                "days",
                "decades",
                "hours",
                "minutes",
                "months",
                "seconds",
                "weeks",
                "years"
            ]
        }
    }
}