{
    "title": "patient age at collection of tumor",
    "type": "object",
    "level": "mandatory",
    "properties": {
        "patient age at collection of tumor": {
            "description": "Age in years of the patient when the tumor was extracted. Please note this must be a whole number, e.g. 45",
            "type": "string",
            "pattern": "^150|1[0-4][0-9]|[1-9][0-9]|[0-9]|not provided$"
        }
    },
    "required": [
        "patient age at collection of tumor"
    ]
}