{
    "title": "number of replicons",
    "type": "object",
    "level": "recommended",
    "properties": {
        "number of replicons": {
            "description": "Reports the number of replicons in a nuclear genome of eukaryotes, in the genome of a bacterium or archaea or the number of segments in a segmented virus. Always applied to the haploid chromosome count of a eukaryote. Mandatory for MIGS of eukaryotes, bacteria, archaea and segmented virus.",
            "type": "string",
            "pattern": "[+-]?[0-9]+"
        }
    }
}