{
    "title": "specific humidity",
    "type": "object",
    "level": "optional",
    "properties": {
        "specific humidity": {
            "description": "The mass of water vapour in a unit mass of moist air, usually expressed as grams of vapour per kilogram of air, or, in air conditioning, as grains per pound.",
            "type": "string",
            "pattern": "(0|((0\\.)|([1-9][0-9]*\\.?))[0-9]*)"
        },
        "unit": {
            "type": "string",
            "enum": [
                "g/m3"
            ]
        }
    }
}