{
    "title": "completeness approach",
    "type": "object",
    "level": "optional",
    "properties": {
        "completeness approach": {
            "description": "The approach used to determine the completeness of a given bin, SAG or MAG, which would typically make use of a set of conserved marker genes or a closely related reference genome. For UViG completeness, include reference genome or group used, and contig feature suggesting a complete genome",
            "type": "string"
        }
    }
}