{
    "title": "similarity search method",
    "type": "object",
    "level": "optional",
    "properties": {
        "similarity search method": {
            "description": "Tool used to compare ORFs with database, along with version and cutoffs used. Add names and versions of software(s), parameters used",
            "type": "string"
        }
    }
}