{
    "title": "substructure type",
    "type": "object",
    "level": "optional",
    "properties": {
        "substructure type": {
            "description": "the substructure or under building is that largely hidden section of the building which is built off the foundations to the ground floor level",
            "type": "string",
            "enum": [
                "basement",
                "crawlspace",
                "slab on grade"
            ]
        }
    }
}