{
    "title": "total inorganic nitrogen",
    "type": "object",
    "level": "optional",
    "properties": {
        "total inorganic nitrogen": {
            "description": "total inorganic nitrogen content",
            "type": "string",
            "pattern": "(0|((0\\.)|([1-9][0-9]*\\.?))[0-9]*)([Ee][+-]?[0-9]+)?"
        },
        "unit": {
            "type": "string",
            "enum": [
                "\u00b5g/L"
            ]
        }
    }
}