{
    "title": "light regimen",
    "type": "object",
    "level": "optional",
    "properties": {
        "light regimen": {
            "description": "information about treatment involving an exposure to light, this includes both light intensity and quality",
            "type": "string"
        }
    }
}