{
    "title": "growth hormone regimen",
    "type": "object",
    "level": "optional",
    "properties": {
        "growth hormone regimen": {
            "description": "information about treatment involving use of growth hormones; should include the name of growth hormone, amount administered, treatment duration, interval and total experimental duration; can include multiple growth hormone regimens",
            "type": "string"
        }
    }
}