{
    "title": "contamination screening input",
    "type": "object",
    "level": "optional",
    "properties": {
        "contamination screening input": {
            "description": "The type of sequence data used as input",
            "type": "string",
            "enum": [
                "contigs",
                "reads"
            ]
        }
    }
}