{
    "title": "positive control type",
    "type": "object",
    "level": "optional",
    "properties": {
        "positive control type": {
            "description": "The substance, mixture, product, or apparatus used to verify that a process which is part of an investigation delivers a true positive.",
            "type": "string"
        }
    }
}