{
    "title": "relationship",
    "type": "object",
    "level": "optional",
    "properties": {
        "relationship": {
            "description": "indicates if the specimen has a known relationship to another specimen (e.g. parental, child, sibling or other kind of relationship)",
            "type": "string"
        }
    }
}