{
    "title": "particle classification",
    "type": "object",
    "level": "optional",
    "properties": {
        "particle classification": {
            "description": "Particles are classified, based on their size, into six general categories:clay, silt, sand, gravel, cobbles, and boulders; should include amount of particle preceded by the name of the particle type; can include multiple values",
            "type": "string"
        }
    }
}