{
    "title": "food packing medium",
    "type": "object",
    "level": "optional",
    "properties": {
        "food packing medium": {
            "description": "The medium in which the food is packed for preservation and handling or the medium surrounding homemade foods, e.g., peaches cooked in sugar syrup. The packing medium may provide a controlled environment for the food. It may also serve to improve palatability and consumer appeal. This includes edible packing media (e.g. fruit juice), gas other than air (e.g. carbon dioxide), vacuum packed, or packed with aerosol propellant. This field accepts terms under food packing medium (http://purl.obolibrary.org/obo/FOODON_03480020). Multiple terms may apply and can be separated by pipes.",
            "type": "string"
        },
        "unit": {
            "type": "string",
            "enum": [
                "m2"
            ]
        }
    }
}