{
    "type": "object",
    "properties": {
      "firstname": {
        "type": "string",
        "description": "The first name of the person."
      },
      "lastname": {
        "type": "string",
        "description": "The last name of the person."
      },
      "affiliations": {
        "type": "array",
        "title": "Affiliations",
        "description": "Enter the list of affiliations for the person.",
        "items": {
          "type": "object",
          "properties": {
            "affiliations": {
              "type": "string",
              "description": "Enter the affiliation for the person."
            }
          },
          "required": ["affiliations"]
        }
      },
      "orcid": {
        "type": "string",
        "description": "The ORCID identifier of the person.",
        "format": "orcid"
      }
    },
    "required": ["firstname", "lastname"]
  }
  