{
    "title": "host length",
    "type": "object",
    "level": "optional",
    "properties": {
        "host length": {
            "description": "the length of subject",
            "type": "string",
            "pattern": "(0|((0\\.)|([1-9][0-9]*\\.?))[0-9]*)([Ee][+-]?[0-9]+)?"
        },
        "unit": {
            "type": "string",
            "enum": [
                "cm",
                "m",
                "mm"
            ]
        }
    }
}