{
    "title": "trophic level",
    "type": "object",
    "level": "optional",
    "properties": {
        "trophic level": {
            "description": "Trophic levels are the feeding position in a food chain. Microbes can be a range of producers (e.g. chemolithotroph)",
            "type": "string",
            "enum": [
                "autotroph",
                "carboxydotroph",
                "chemoautotroph",
                "chemoheterotroph",
                "chemolithoautotroph",
                "chemolithotroph",
                "chemoorganoheterotroph",
                "chemoorganotroph",
                "chemosynthetic",
                "chemotroph",
                "copiotroph",
                "diazotroph",
                "facultative autotroph",
                "heterotroph",
                "lithoautotroph",
                "lithoheterotroph",
                "lithotroph",
                "methanotroph",
                "methylotroph",
                "mixotroph",
                "obligate chemoautolithotroph",
                "oligotroph",
                "organoheterotroph",
                "organotroph",
                "photoautotroph",
                "photoheterotroph",
                "photolithoautotroph",
                "photolithotroph",
                "photosynthetic",
                "phototroph"
            ]
        }
    }
}