{
    "title": "Subjects",
    "description": "Specify subjects from a taxonomy or controlled vocabulary. Each term must be uniquely identified.",
    "level": "recommended",
    "type": "array",
    "items": {
        "type": "object",
        "properties": {
            "term": {
                "type": "string",
                "description": "Term from taxonomy or controlled vocabulary."
            },
            "identifier": {
                "type": "string",
                "format": "uri",
                "description": "Unique identifier for term."
            },
            "scheme": {
                "type": "string",
                "description": "Persistent identifier scheme for id (automatically detected)."
            }
        },
        "required": [
            "term",
            "identifier"
        ]
    }
}
