{
    "title": "target gene",
    "type": "object",
    "level": "optional",
    "properties": {
        "target gene": {
            "description": "Targeted gene or locus name for marker gene studies",
            "type": "string"
        }
    }
}