{
    "title": "gynecological disorder",
    "type": "object",
    "level": "optional",
    "properties": {
        "gynecological disorder": {
            "description": "History of gynecological disorders; can include multiple disorders. The terms should be chosen from the DO (Human Disease Ontology) at http://www.disease-ontology.org, female reproductive system disease (https://disease-ontology.org/?id=DOID:229).",
            "type": "string"
        }
    }
}