{
    "title": "original geographic location (longitude)",
    "type": "object",
    "level": "optional",
    "properties": {
        "original geographic location (longitude)": {
            "description": "For use if the specimen is from a zoo, botanic garden or culture collection etc. and has a known origin elsewhere. Please record the geographic location where the specimen or sample was originally taken as defined by longitude. The values should be reported in decimal degrees and in WGS84 system",
            "type": "string",
            "pattern": "(^[+-]?[0-9]+.?[0-9]{0,8}$)"
        },
        "unit": {
            "type": "string",
            "enum": [
                "DD"
            ]
        }
    }
}