{
    "title": "current vegetation method",
    "type": "object",
    "level": "recommended",
    "properties": {
        "current vegetation method": {
            "description": "reference or method used in vegetation classification",
            "type": "string"
        }
    }
}