{
    "title": "alkalinity",
    "type": "object",
    "level": "optional",
    "properties": {
        "alkalinity": {
            "description": "alkalinity, the ability of a solution to neutralize acids to the equivalence point of carbonate or bicarbonate",
            "type": "string",
            "pattern": "(0|((0\\.)|([1-9][0-9]*\\.?))[0-9]*)([Ee][+-]?[0-9]+)?"
        },
        "unit": {
            "type": "string",
            "enum": [
                "mEq/L"
            ]
        }
    }
}