{
    "title": "biocide",
    "type": "object",
    "level": "optional",
    "properties": {
        "biocide": {
            "description": "Substance intended for preventing, neutralizing, destroying, repelling, or mitigating the effects of any pest or microorganism; that inhibits the growth, reproduction, and activity of organisms, including fungal cells; decreases the number of fungi or pests present; deters microbial growth and degradation of other ingredients in the formulation. Indicate the biocide used on the location where the sample was taken. Multiple terms can be separated by pipes.",
            "type": "string"
        },
        "unit": {
            "type": "string",
            "enum": [
                "\u00b0C"
            ]
        }
    }
}