{
    "title": "sample capture status",
    "type": "object",
    "level": "optional",
    "properties": {
        "sample capture status": {
            "description": "Reason for the sample collection.",
            "type": "string",
            "enum": [
                "active surveillance in response to outbreak",
                "active surveillance not initiated by an outbreak",
                "farm sample",
                "market sample",
                "other",
                "pet sample",
                "zoo sample"
            ]
        }
    }
}