{
    "title": "assembly software",
    "type": "object",
    "level": "recommended",
    "properties": {
        "assembly software": {
            "description": "Tool(s) used for assembly, including version number and parameters in the format {software};{version};{parameters} e.g. metaSPAdes;3.11.0;kmer set 21,33,55,77,99,121, default parameters otherwise",
            "type": "string"
        }
    }
}