{
    "title": "sample storage conditions",
    "type": "object",
    "level": "optional",
    "properties": {
        "sample storage conditions": {
            "description": "Conditions at which sample was stored, usually storage temperature, duration and location. In soil context: Explain how and for how long the soil sample was stored before DNA extraction (fresh/frozen/other).",
            "type": "string"
        }
    }
}