{
    "title": "chemical treatment",
    "type": "object",
    "level": "optional",
    "properties": {
        "chemical treatment": {
            "description": "List of chemical compounds administered upstream the sampling location where sampling occurred (e.g. Glycols, H2S scavenger, corrosion and scale inhibitors, demulsifiers, and other production chemicals etc.). The commercial name of the product and name of the supplier should be provided. The date of administration should also be included",
            "type": "string"
        }
    }
}