{
    "title": "other pathogens tested",
    "type": "object",
    "level": "mandatory",
    "properties": {
        "other pathogens tested": {
            "description": "Classification of pathogenic organisms other than influenza virus tested in the current assessment of a sample. If multiple tests were performed, please state them separated by semicolon. If no other pathogens test was performed, please state 'none'.",
            "type": "string",
            "example": null
        }
    },
    "required": [
        "other pathogens tested"
    ]
}