{
    "title": "filter type",
    "type": "object",
    "level": "mandatory",
    "properties": {
        "filter type": {
            "description": "a device which removes solid particulates or airborne molecular contaminants",
            "type": "string",
            "enum": [
                "HEPA filter",
                "chemical air filter",
                "electrostatic air treatment",
                "gas-phase air treatment",
                "low-MERV pleated media",
                "particulate air filter",
                "ultraviolet air treatment"
            ]
        }
    },
    "required": [
        "filter type"
    ]
}