{
    "title": "soil_taxonomic/local classification method",
    "type": "object",
    "level": "recommended",
    "properties": {
        "soil_taxonomic/local classification method": {
            "description": "reference or method used in determining the local soil classification",
            "type": "string"
        }
    }
}