{
    "title": "Conference title",
    "description": "Title of conference.",
    "level": "optional",
    "type": "string",
    "example": "20th International Conference on Computing in High Energy and Nuclear Physics"
}
