{
    "title": "average temperature",
    "type": "object",
    "level": "optional",
    "properties": {
        "average temperature": {
            "description": "The average of temperatures taken at the beginning of every hour over a 24 hour period on the sampling day",
            "type": "string",
            "pattern": "(0|((0\\.)|([1-9][0-9]*\\.?))[0-9]*)([Ee][+-]?[0-9]+)?"
        }
    }
}