{
    "title": "relative location of sample",
    "type": "object",
    "level": "optional",
    "properties": {
        "relative location of sample": {
            "description": "Location of sampled soil to other parts of the farm e.g. under crop plant, near irrigation ditch, from the dirt road.",
            "type": "string"
        }
    }
}