{
    "title": "sieving",
    "type": "object",
    "level": "optional",
    "properties": {
        "sieving": {
            "description": "Collection design of pooled samples and/or sieve size and amount of sample sieved",
            "type": "string"
        }
    }
}