{
    "title": "Latitude Start",
    "type": "object",
    "level": "mandatory",
    "properties": {
        "Latitude Start": {
            "description": "Latitude of the location where the sampling event started, e.g. each CTD cast, net tow, or bucket collection is a distinct event. Format: ##.####, Decimal degrees; North= +, South= -; Use WGS 84 for GPS data.",
            "type": "string",
            "pattern": "[+-]?[0-9]+.?[0-9]*",
            "example": "[+-]?[0-9]+.?[0-9]*"
        },
        "unit": {
            "type": "string",
            "enum": [
                "DD"
            ]
        }
    },
    "required": [
        "Latitude Start"
    ]
}