{
    "title": "sample disease status",
    "type": "object",
    "level": "recommended",
    "properties": {
        "sample disease status": {
            "description": "list of diseases with which the subject has been diagnosed at the time of sample collection; can include multiple diagnoses; the value of the field depends on subject; e.g. Charcoal rot (Macrophomina phaseolina), Late wilt (Cephalosporium maydis)",
            "type": "string"
        }
    }
}