{
    "title": "ancestral data",
    "type": "object",
    "level": "optional",
    "properties": {
        "ancestral data": {
            "description": "information about either pedigree or other description of ancestral information (e.g. parental variety in case of mutant or selection), e.g. A/3*B (meaning [(A x B) x B] x B)",
            "type": "string"
        }
    }
}