{
    "title": "biological sample replicate",
    "type": "object",
    "level": "optional",
    "properties": {
        "biological sample replicate": {
            "description": "Measurements of biologically distinct samples that show biological variation.",
            "type": "string"
        },
        "unit": {
            "type": "string",
            "enum": [
                "century",
                "month",
                "week",
                "year"
            ]
        }
    }
}