{
    "title": "receipt date",
    "type": "object",
    "level": "optional",
    "properties": {
        "receipt date": {
            "description": "Date on which the sample was received. Format:YYYY-MM-DD. Please provide the highest precision possible. If the sample was received by the institution and not collected, the 'receipt date' must be provided instead. Either the 'collection date' or 'receipt date' must be provided. If available, provide both dates.",
            "type": "string",
            "pattern": "^[0-9]{4}(-[0-9]{2}(-[0-9]{2})?)?$"
        }
    }
}