{
    "title": "host body habitat",
    "type": "object",
    "level": "optional",
    "properties": {
        "host body habitat": {
            "description": "original body habitat where the sample was obtained from",
            "type": "string"
        }
    }
}