{
    "title": "library vector",
    "type": "object",
    "level": "optional",
    "properties": {
        "library vector": {
            "description": "Cloning vector type(s) used in construction of libraries",
            "type": "string"
        }
    }
}