{
    "title": "food shipping transportation vehicle",
    "type": "object",
    "level": "optional",
    "properties": {
        "food shipping transportation vehicle": {
            "description": "A descriptor for the mobile machine which is used to transport food commodities along the food distribution system. This field accepts terms listed under vehicle (http://purl.obolibrary.org/obo/ENVO_01000604). If the proper descrptor is not listed please use text to describe the mode of travel. Multiple terms can be separated by one or more pipes.",
            "type": "string"
        }
    }
}