{
    "title": "gravidity",
    "type": "object",
    "level": "optional",
    "properties": {
        "gravidity": {
            "description": "Whether or not the subject is gravid. If so, report date due or date post-conception and specify which of these two dates is being reported.",
            "type": "string"
        }
    }
}