{
    "title": "microbiological culture medium",
    "type": "object",
    "level": "optional",
    "properties": {
        "microbiological culture medium": {
            "description": "A culture medium used to select for, grow, and maintain prokaryotic microorganisms. Can be in either liquid (broth) or solidified (e.g. with agar) forms. This field accepts terms listed under microbiological culture medium (http://purl.obolibrary.org/obo/MICRO_0000067). If the proper descriptor is not listed please use text to describe the culture medium.",
            "type": "string"
        },
        "unit": {
            "type": "string",
            "enum": [
                "N/m2",
                "Pa"
            ]
        }
    }
}