{
    "title": "reference for biomaterial",
    "type": "object",
    "level": "optional",
    "properties": {
        "reference for biomaterial": {
            "description": "Primary publication if isolated before genome publication; otherwise, primary genome report. Mandatory for MIGS of bacteria and archaea.",
            "type": "string"
        }
    }
}