{
    "title": "host of the symbiotic host genotype",
    "type": "object",
    "level": "optional",
    "properties": {
        "host of the symbiotic host genotype": {
            "description": "Observed genotype of the host of the symbiotic host organism.",
            "type": "string"
        },
        "unit": {
            "type": "string",
            "enum": [
                "century",
                "month",
                "week",
                "year"
            ]
        }
    }
}