{
    "title": "standing water regimen",
    "type": "object",
    "level": "optional",
    "properties": {
        "standing water regimen": {
            "description": "treatment involving an exposure to standing water during a plant's life span, types can be flood water or standing water; can include multiple regimens",
            "type": "string"
        }
    }
}