{
    "title": "strain",
    "type": "object",
    "level": "recommended",
    "properties": {
        "strain": {
            "description": "Name of the strain from which the sample was obtained.",
            "type": "string"
        }
    }
}