{
    "title": "light intensity",
    "type": "object",
    "level": "optional",
    "properties": {
        "light intensity": {
            "description": "measurement of light intensity",
            "type": "string",
            "pattern": "(0|((0\\.)|([1-9][0-9]*\\.?))[0-9]*)([Ee][+-]?[0-9]+)?"
        },
        "unit": {
            "type": "string",
            "enum": [
                "lux"
            ]
        }
    }
}