{
    "title": "annotation source",
    "type": "object",
    "level": "optional",
    "properties": {
        "annotation source": {
            "description": "For cases where annotation was provided by a community jamboree or model organism database rather than by a specific submitter",
            "type": "string"
        }
    }
}