{
    "title": "symbiotic host organism life cycle type",
    "type": "object",
    "level": "optional",
    "properties": {
        "symbiotic host organism life cycle type": {
            "description": "Type of life cycle of the symbiotic host species (the thing being sampled). Simple life cycles occur within a single host, complex ones within multiple different hosts over the course of their normal life cycle.",
            "type": "string"
        }
    }
}