{
    "title": "sampling room id or name",
    "type": "object",
    "level": "optional",
    "properties": {
        "sampling room id or name": {
            "description": "Explain how and for how long the soil sample was stored before DNA extraction (fresh/frozen/other).",
            "type": "string"
        },
        "unit": {
            "type": "string",
            "enum": [
                "day",
                "hour",
                "month",
                "week",
                "year"
            ]
        }
    }
}