{
    "title": "Raw sequencing filetype",
    "description": "An enumeration of file types for raw sequencing: fastq, cram, bam or multifasq.",
    "type": "string",
    "enum": [
        "fastq",
        "cram",
        "bam",
        "multifasq"
    ]
}
