{
    "title": "isolation and growth condition",
    "type": "object",
    "level": "optional",
    "properties": {
        "isolation and growth condition": {
            "description": "Publication reference in the form of pubmed ID (pmid), digital object identifier (doi) or url for isolation and growth condition specifications of the organism/material. Mandatory for MIGS and MIMARKS Specimen.",
            "type": "string"
        }
    }
}