{
    "title": "amniotic fluid/maternal health status",
    "type": "object",
    "level": "optional",
    "properties": {
        "amniotic fluid/maternal health status": {
            "description": "specification of the maternal health status",
            "type": "string"
        }
    }
}