{
    "title": "Upload type",
    "type": "object",
    "description": "The type of upload, which determines additional required fields.",
    "slug": "upload_type",
    "format": "no_default",
    "oneOf": [
        {
            "title": "Dataset",
            "type": "object",
            "properties": {
                "upload_type": {
                    "const": "dataset",
                    "default": "dataset"
                }
            },
            "required": ["upload_type"]
        },
        {
            "title": "Event",
            "type": "object",
            "properties": {
                "upload_type": {
                    "const": "event",
                    "default": "event"
                }
            },
            "required": ["upload_type"]
        },
        {
            "title": "Image",
            "type": "object",
            "properties": {
                "upload_type": {
                    "const": "image",
                    "default": "image"
                },
                "image_type": {
                    "title": "Image type",
                    "description": "The type of image. Controlled vocabulary includes options such as figure, plot, drawing, or other.",
                    "type": "string",
                    "oneOf": [
                        { "title": "Figure", "const": "figure" },
                        { "title": "Plot", "const": "plot" },
                        { "title": "Drawing", "const": "drawing" },
                        { "title": "Diagram", "const": "diagram" },
                        { "title": "Photo", "const": "photo" },
                        { "title": "Other", "const": "other" }
                    ]
                }
            },
            "required": [
                "upload_type"
            ]
        },
        {
            "title": "Lesson",
            "type": "object",
            "properties": {
                "upload_type": {
                    "const": "lesson",
                    "default": "lesson"
                }
            },
            "required": ["upload_type"]
        },
        {
            "title": "Model",
            "type": "object",
            "properties": {
              "upload_type": {
                "const": "model",
                "default": "model"
              }
            },
            "required": ["upload_type"]
          },
          {
            "title": "Physical object",
            "type": "object",
            "properties": {
              "upload_type": {
                "const": "physicalobject",
                "default": "physicalobject"
              }
            },
            "required": ["upload_type"]
          },
          {
            "title": "Poster",
            "type": "object",
            "properties": {
                "upload_type": {
                    "const": "poster",
                    "default": "poster"
                }
            },
            "required": ["upload_type"]
        },
        {
            "title": "Presentation",
            "type": "object",
            "properties": {
                "upload_type": {
                    "const": "presentation",
                    "default": "presentation"
                }
            },
            "required": ["upload_type"]
        },
          {
            "title": "Publication",
            "type": "object",
            "properties": {
                "upload_type": {
                    "const": "publication",
                    "default": "publication"
                },
                "publication_type": {
                    "title": "Publication type",
                    "description": "The type of publication. Controlled vocabulary includes options such as journal article, book, thesis, or other.",
                    "type": "string",
                    "oneOf": [
                        { "title": "Annotation Collection", "const": "annotationcollection" },
                        { "title": "Book", "const": "book" },
                        { "title": "Book chapter", "const": "section" },
                        { "title": "Conference paper", "const": "conferencepaper" },
                        { "title": "Conference proceeding", "const": "conferenceproceeding" },
                        { "title": "Data paper", "const": "datapaper" },
                        { "title": "Dissertation", "const": "dissertation" },
                        { "title": "Journal", "const": "journal" },
                        { "title": "Journal article", "const": "article" },
                        { "title": "Output management plan", "const": "datamanagementplan" },
                        { "title": "Patent", "const": "patent" },
                        { "title": "Peer review", "const": "peerreview" },
                        { "title": "Preprint", "const": "preprint" },
                        { "title": "Project deliverable", "const": "deliverable" },
                        { "title": "Project milestone", "const": "milestone" },
                        { "title": "Proposal", "const": "proposal" },
                        { "title": "Report", "const": "report" },
                        { "title": "Software documentation", "const": "softwaredocumentation" },
                        { "title": "Standard", "const": "standard" },
                        { "title": "Taxonomic treatment", "const": "taxonomictreatment" },
                        { "title": "Technical note", "const": "technicalnote" },
                        { "title": "Thesis", "const": "thesis" },
                        { "title": "Working paper", "const": "workingpaper" },
                        { "title": "Other", "const": "other" }
                    ]
                }
            },
            "required": [
                "upload_type"
            ]
        },
        {
            "title": "Software",
            "type": "object",
            "properties": {
                "upload_type": {
                    "const": "software",
                    "default": "software"
                }
                ,
                "software_type": {
                    "title": "Software type",
                    "description": "The type of software.",
                    "type": "string",
                    "oneOf": [
                        { "title": "Computational notebook", "const": "computationalnotebook" }
                    ]
                }
            },
            "required": ["upload_type"]
        },
        {
            "title": "Video/Audio",
            "type": "object",
            "properties": {
                "upload_type": {
                    "const": "video",
                    "default": "video"
                }
            },
            "required": ["upload_type"]
        },
          {
            "title": "Workflow",
            "type": "object",
            "properties": {
              "upload_type": {
                "const": "workflow",
                "default": "workflow"
              }
            },
            "required": ["upload_type"]
          },
        {
            "title": "Other",
            "type": "object",
            "properties": {
                "upload_type": {
                    "const": "other",
                    "default": "other"
                }
            },
            "required": ["upload_type"]
        }
    ]
}
