{
    "title": "host body product",
    "type": "object",
    "level": "optional",
    "properties": {
        "host body product": {
            "description": "substance produced by the body, e.g. stool, mucus, where the sample was obtained from. For Foundational Model of Anatomy Ontology (FMA) (v 3.1) terms, please see http://purl.bioontology.org/ontology/FMA",
            "type": "string"
        }
    }
}