{
    "title": "cellular component",
    "type": "object",
    "level": "optional",
    "properties": {
        "cellular component": {
            "description": "The part of a cell or its extracellular environment in which a gene product is located.",
            "type": "string"
        }
    }
}