{
    "title": "Sample Status",
    "type": "object",
    "level": "recommended",
    "properties": {
        "Sample Status": {
            "description": "Refers to the completness of sample metadata validation.",
            "type": "string",
            "example": null
        }
    }
}