{
    "title": "chemical administration",
    "type": "object",
    "level": "optional",
    "properties": {
        "chemical administration": {
            "description": "list of chemical compounds administered to the host or site where sampling occurred, and when (e.g. antibiotics, N fertilizer, air filter); can include multiple compounds. For Chemical Entities of Biological Interest ontology (CHEBI) (v111), please see http://purl.bioontology.org/ontology/CHEBI",
            "type": "string"
        }
    }
}