{
    "title": "chimera check software",
    "type": "object",
    "level": "optional",
    "properties": {
        "chimera check software": {
            "description": "Tool(s) used for chimera checking, including version number and parameters, to discover and remove chimeric sequences. A chimeric sequence is comprised of two or more phylogenetically distinct parent sequences.",
            "type": "string"
        }
    }
}