{
  "title": "Sample",
  "type": "object",
  "properties": {
    "title": {
      "title": "Title",
      "description": "Sample title",
      "type": "string"
    },
    "alias": {
      "title": "Alias",
      "description": "A valid slug, which can contain letters, numbers, and hyphens but cannot start or end with a hyphen.",
      "type": "string",
      "pattern": "^[a-zA-Z0-9]+(?:-[a-zA-Z0-9]+)*$"
    }
  },
  "required": ["title", "alias"],
  "errorMessage": {
    "properties": {
      "alias": "Alias must be a valid slug (letters, numbers, hyphens only, and cannot start or end with a hyphen)"
    }
  }
}
