{
    "title": "viral identification software",
    "type": "object",
    "level": "mandatory",
    "properties": {
        "viral identification software": {
            "description": "Tool(s) used for the identification of UViG as a viral genome, software or protocol name including version number, parameters, and cutoffs used formatted {software};{version};{parameters} e.g. VirSorter; 1.0.4; Virome database, category 2",
            "type": "string"
        }
    },
    "required": [
        "viral identification software"
    ]
}