{
    "title": "water pH",
    "type": "object",
    "level": "optional",
    "properties": {
        "water pH": {
            "description": "pH measurement of the sample, or liquid portion of sample, or aqueous phase of the fluid.",
            "type": "string",
            "pattern": "[\\d][0-4]?(\\.[\\d]{1,10})?"
        }
    }
}