{
    "title": "host height",
    "type": "object",
    "level": "optional",
    "properties": {
        "host height": {
            "description": "the height of subject",
            "type": "string",
            "pattern": "((0|((0\\.)|([1-9][0-9]*\\.?))[0-9]*)([Ee][+-]?[0-9]+)?)|((^not collected$)|(^not provided$)|(^restricted access$)|(^missing: control sample$)|(^missing: sample group$)|(^missing: synthetic construct$)|(^missing: lab stock$)|(^missing: third party data$)|(^missing: data agreement established pre-2023$)|(^missing: endangered species$)|(^missing: human-identifiable$))"
        },
        "unit": {
            "type": "string",
            "enum": [
                "cm",
                "m",
                "mm"
            ]
        }
    }
}