{
    "title": "lat_lon",
    "type": "object",
    "level": "optional",
    "properties": {
        "lat_lon": {
            "description": "geographical coordinates of the location where the specimen was collected",
            "type": "string"
        }
    }
}