{
    "title": "tRNA extraction software",
    "type": "object",
    "level": "optional",
    "properties": {
        "tRNA extraction software": {
            "description": "Tools used for tRNA identification. Add names and versions of software(s), parameters used",
            "type": "string"
        }
    }
}