{
    "title": "ceiling texture",
    "type": "object",
    "level": "optional",
    "properties": {
        "ceiling texture": {
            "description": "The feel, appearance, or consistency of a ceiling surface",
            "type": "string"
        },
        "unit": {
            "type": "string",
            "enum": [
                "hour",
                "month",
                "week",
                "year"
            ]
        }
    }
}