{
    "title": "completeness software",
    "type": "object",
    "level": "recommended",
    "properties": {
        "completeness software": {
            "description": "Tools used for completion estimate, i.e. checkm, anvi'o, busco. Mandatory for all samples directly linked with SAGs or MAGs.",
            "type": "string"
        }
    }
}