{
    "title": "source rock lithology",
    "type": "object",
    "level": "optional",
    "properties": {
        "source rock lithology": {
            "description": "Lithology of source rock (https://en.wikipedia.org/wiki/Source_rock). If \"other\" is specified, please propose entry in \"additional info\" field",
            "type": "string"
        },
        "unit": {
            "type": "string",
            "enum": [
                "day",
                "hour",
                "minute",
                "month",
                "week",
                "year"
            ]
        }
    }
}