{
    "title": "bio_material",
    "type": "object",
    "level": "optional",
    "properties": {
        "bio_material": {
            "description": "Unique identifier that references the biological material from which the sample was obtained and that ideally exists in a curated collection (e.g. stock centres, seed banks, DNA banks). The ID should have the following structure: name of the institution (institution code) followed by the collection code (if available) and the voucher id (institution_code:collection_code:voucher_id). Please note institution codes and collection codes are taken from a controlled vocabulary maintained by the INSDC: https://ftp.ncbi.nih.gov/pub/taxonomy/biocollections/",
            "type": "string"
        }
    }
}