{
    "title": "pesticide regimen",
    "type": "object",
    "level": "optional",
    "properties": {
        "pesticide regimen": {
            "description": "information about treatment involving use of insecticides; should include the name of pesticide, amount administered, treatment duration, interval and total experimental duration; can include multiple pesticide regimens",
            "type": "string"
        }
    }
}