{
    "title": "negative control type",
    "type": "object",
    "level": "optional",
    "properties": {
        "negative control type": {
            "description": "The substance or equipment used as a negative control in an investigation",
            "type": "string"
        }
    }
}