{
    "title": "floor condition",
    "type": "object",
    "level": "optional",
    "properties": {
        "floor condition": {
            "description": "The physical condition of the floor at the time of sampling; photos or video preferred; use drawings to indicate location of damaged areas",
            "type": "string"
        },
        "unit": {
            "type": "string",
            "enum": [
                "\u00b0C"
            ]
        }
    }
}