{
    "title": "plant product",
    "type": "object",
    "level": "optional",
    "properties": {
        "plant product": {
            "description": "substance produced by the plant, where the sample was obtained from",
            "type": "string"
        }
    }
}