{
    "title": "Contributors",
    "description": "The contributors of the deposition.",
    "level": "optional",
    "type": "array",
    "items": {
        "type": "object",
        "properties": {
            "name": {
                "type": "string",
                "description": "Name of the contributor in the format Family name, Given names."
            },
            "type": {
                "type": "string",
                "enum": [
                    "ContactPerson",
                    "DataCollector",
                    "DataCurator",
                    "DataManager",
                    "Distributor",
                    "Editor",
                    "HostingInstitution",
                    "Producer",
                    "ProjectLeader",
                    "ProjectManager",
                    "ProjectMember",
                    "RegistrationAgency",
                    "RegistrationAuthority",
                    "RelatedPerson",
                    "Researcher",
                    "ResearchGroup",
                    "RightsHolder",
                    "Supervisor",
                    "Sponsor",
                    "WorkPackageLeader",
                    "Other"
                ]
            },
            "affiliation": {
                "type": "string",
                "description": "Affiliation of the contributor (optional)."
            },
            "orcid": {
                "type": "string",
                "format": "uri",
                "description": "ORCID identifier of the contributor (optional).",
                "pattern": "^(https://orcid.org/)?(\\d{4}-){3}\\d{3}(\\d|X)$"
            },
            "gnd": {
                "type": "string",
                "description": "GND identifier of the contributor (optional)."
            }
        }
    },
    "example": [
        {
            "name": "Doe, John",
            "affiliation": "Zenodo",
            "type": "Editor"
        }
    ]
}
