{
    "title": "address",
    "type": "object",
    "level": "optional",
    "properties": {
        "address": {
            "description": "The street name and building number where the sampling occurred.",
            "type": "string"
        }
    }
}