{
    "title": "WHO/OIE/FAO clade (required for HPAI H5N1 viruses)",
    "type": "object",
    "level": "optional",
    "properties": {
        "WHO/OIE/FAO clade (required for HPAI H5N1 viruses)": {
            "description": "WHO/OIE/FAO clade should be included for highly pathogenic H5N1 viruses.",
            "type": "string",
            "example": null
        }
    }
}