{
    "title": "Further Details",
    "type": "object",
    "level": "optional",
    "properties": {
        "Further Details": {
            "description": "Reference details related to a sample in form of an URI.",
            "type": "string"
        }
    }
}