{
    "title": "host health state",
    "type": "object",
    "level": "mandatory",
    "properties": {
        "host health state": {
            "description": "Health status of the host at the time of sample collection.",
            "type": "string",
            "enum": [
                "diseased",
                "healthy",
                "missing: control sample",
                "missing: data agreement established pre-2023",
                "missing: endangered species",
                "missing: human-identifiable",
                "missing: lab stock",
                "missing: sample group",
                "missing: synthetic construct",
                "missing: third party data",
                "not applicable",
                "not collected",
                "not provided",
                "restricted access"
            ]
        }
    },
    "required": [
        "host health state"
    ]
}