{
    "title": "growth condition",
    "type": "object",
    "level": "optional",
    "properties": {
        "growth condition": {
            "description": "A role that a material entity can play which enables particular conditions used to grow organisms or parts of the organism. This includes isolated environments such as cultures and open environments such as field studies.",
            "type": "string"
        }
    }
}