{
    "title": "chlorophyll",
    "type": "object",
    "level": "optional",
    "properties": {
        "chlorophyll": {
            "description": "concentration of chlorophyll",
            "type": "string",
            "pattern": "(0|((0\\.)|([1-9][0-9]*\\.?))[0-9]*)([Ee][+-]?[0-9]+)?"
        },
        "unit": {
            "type": "string",
            "enum": [
                "mg/m3",
                "\u00b5g/L"
            ]
        }
    }
}