{
    "title": "host body-mass index",
    "type": "object",
    "level": "optional",
    "properties": {
        "host body-mass index": {
            "description": "body mass index, calculated as weight/(height)squared",
            "type": "string",
            "pattern": "(0|((0\\.)|([1-9][0-9]*\\.?))[0-9]*)([Ee][+-]?[0-9]+)?"
        },
        "unit": {
            "type": "string",
            "enum": [
                "kg/m2"
            ]
        }
    }
}