{
    "title": "organism common name",
    "type": "object",
    "level": "recommended",
    "properties": {
        "organism common name": {
            "description": "common name of the subject organism, e.g. maize",
            "type": "string"
        }
    }
}