{
    "title": "built structure age",
    "type": "object",
    "level": "optional",
    "properties": {
        "built structure age": {
            "description": "The age of the built structure since construction",
            "type": "string",
            "pattern": "(0|((0\\.)|([1-9][0-9]*\\.?))[0-9]*)"
        },
        "unit": {
            "type": "string",
            "enum": [
                "day",
                "hour",
                "month",
                "week",
                "year"
            ]
        }
    }
}