{
    "title": "chemical mutagen",
    "type": "object",
    "level": "optional",
    "properties": {
        "chemical mutagen": {
            "description": "treatment involving use of mutagens; should include the name of mutagen, amount administered, treatment duration, interval and total experimental duration; can include multiple mutagen regimens",
            "type": "string"
        }
    }
}