{
    "title": "sample storage location",
    "type": "object",
    "level": "optional",
    "properties": {
        "sample storage location": {
            "description": "Location at which sample was stored, usually name of a specific freezer/room. Indicate the location name.",
            "type": "string"
        }
    }
}