{
  "type": "object",
  "oneOf": [
    {
      "title": "Predefined Sex Options",
      "type": "object",
      "properties": {
        "sex": {
          "description": "Select the sex of the individual.",
          "type": "string",
          "oneOf": [
            {
              "const": "Female",
              "title": "Female"
            },
            {
              "const": "Male",
              "title": "Male"
            },
            {
              "const": "Heramaphrodite",
              "title": "Heramaphrodite"
            }
          ]
        }
      },
      "required": ["sex"]
    },
    {
      "title": "Other",
      "type": "object",
      "properties": {
        "sex": {
          "type": "string",
          "description": "Free text field to specify sex if 'Other' is chosen."
        }
      },
      "not": {
        "properties": {
          "sex": {
            "oneOf": [
              { "const": "Female" },
              { "const": "Male" },
              { "const": "Heramaphrodite" }
            ]
          }
        }
      }
    }
  ]
}
