{
    "title": "architectural structure",
    "type": "object",
    "level": "optional",
    "properties": {
        "architectural structure": {
            "description": "An architectural structure is a human-made, free-standing, immobile outdoor construction",
            "type": "string"
        },
        "unit": {
            "type": "string",
            "enum": [
                "m2"
            ]
        }
    }
}