{
    "title": "library screening strategy",
    "type": "object",
    "level": "optional",
    "properties": {
        "library screening strategy": {
            "description": "Specific enrichment or screening methods applied before and/or after creating clone libraries in order to select a specific group of sequences",
            "type": "string"
        }
    }
}