{
    "title": "lab_host",
    "type": "object",
    "level": "optional",
    "properties": {
        "lab_host": {
            "description": "scientific name of the laboratory host used to propagate the source organism from which the sample was obtained",
            "type": "string"
        }
    }
}