{
    "title": "sample taxon name",
    "type": "object",
    "level": "mandatory",
    "properties": {
        "sample taxon name": {
            "description": "This field indicates if a sample is derived from a patient or xenograft. The following two options are available: Homo sapiens/Mus musculus xenograft (sample is from a Xenograft derived tumor/cell culture) or Homo sapiens (sample is from a patient tumor/cell culture). Please ensure the selected value here is identical to the value in the 'scientific name' column/field.",
            "type": "string",
            "enum": [
                "Homo sapiens",
                "Homo sapiens/Mus musculus xenograft"
            ]
        }
    },
    "required": [
        "sample taxon name"
    ]
}