{
    "title": "indoor surface",
    "type": "object",
    "level": "optional",
    "properties": {
        "indoor surface": {
            "description": "type of indoor surface",
            "type": "string",
            "enum": [
                "cabinet",
                "ceiling",
                "counter top",
                "door",
                "shelving",
                "vent cover",
                "wall",
                "window"
            ]
        }
    }
}