{
    "title": "organism count qpcr information",
    "type": "object",
    "level": "optional",
    "properties": {
        "organism count qpcr information": {
            "description": "If qpcr was used for the cell count, the target gene name, the primer sequence and the cycling conditions should also be provided. (Example: 16S rrna; FWD:ACGTAGCTATGACGT REV:GTGCTAGTCGAGTAC; initial denaturation:90C_5min; denaturation:90C_2min; annealing:52C_30 sec; elongation:72C_30 sec; 90 C for 1 min; final elongation:72C_5min; 30 cycles)",
            "type": "string"
        },
        "unit": {
            "type": "string",
            "enum": [
                "century",
                "month",
                "week",
                "year"
            ]
        }
    }
}