{
    "title": "estimated size",
    "type": "object",
    "level": "optional",
    "properties": {
        "estimated size": {
            "description": "The estimated size of the genome (in bp) prior to sequencing. Of particular importance in the sequencing of (eukaryotic) genome which could remain in draft form for a long or unspecified period. Mandatory for MIGS of eukaryotes.",
            "type": "string",
            "pattern": "[+-]?[0-9]+"
        }
    }
}