{
    "title": "collected_by",
    "type": "object",
    "level": "optional",
    "properties": {
        "collected_by": {
            "description": "name of persons or institute who collected the specimen"
        }
    }
}