{
    "title": "conductivity",
    "type": "object",
    "level": "optional",
    "properties": {
        "conductivity": {
            "description": "electrical conductivity of water",
            "type": "string",
            "pattern": "[1-9][0-9]*\\.?[0-9]*([Ee][+-]?[0-9]+)?"
        },
        "unit": {
            "type": "string",
            "enum": [
                "mS/cm"
            ]
        }
    }
}