{
    "title": "microbial starter preparation",
    "type": "object",
    "level": "optional",
    "properties": {
        "microbial starter preparation": {
            "description": "Information about the protocol or method used to prepare the starter inoculum.",
            "type": "string"
        },
        "unit": {
            "type": "string",
            "enum": [
                "day",
                "hour",
                "minute",
                "month",
                "week",
                "year"
            ]
        }
    }
}