{
    "title": "number of inoculated individuals",
    "type": "object",
    "level": "optional",
    "properties": {
        "number of inoculated individuals": {
            "description": "Number of host individuals inoculated for the experiment.",
            "type": "string"
        }
    }
}