{
    "title": "light type",
    "type": "object",
    "level": "mandatory",
    "properties": {
        "light type": {
            "description": "application of light to achieve some practical or aesthetic effect. Lighting includes the use of both artificial light sources such as lamps and light fixtures, as well as natural illumination by capturing daylight. Can also include absence of light",
            "type": "string",
            "enum": [
                "electric light",
                "natural light",
                "no light"
            ]
        }
    },
    "required": [
        "light type"
    ]
}