{
    "title": "plant water delivery method",
    "type": "object",
    "level": "recommended",
    "properties": {
        "plant water delivery method": {
            "description": "Description of the equipment or method used to distribute water to crops. This field accepts termed listed under irrigation process (http://purl.obolibrary.org/obo/AGRO_00000006). Multiple terms can be separated by pipes.",
            "type": "string"
        }
    }
}