{
    "title": "heating delivery locations",
    "type": "object",
    "level": "optional",
    "properties": {
        "heating delivery locations": {
            "description": "The location of heat delivery within the room",
            "type": "string"
        },
        "unit": {
            "type": "string",
            "enum": [
                "\u00b0C"
            ]
        }
    }
}