{
    "title": "experimental factor 2",
    "type": "object",
    "level": "optional",
    "properties": {
        "experimental factor 2": {
            "description": "A variable that the experiment is based on.",
            "type": "string",
            "enum": [
                "RNA",
                "age",
                "block",
                "cell line",
                "cell type",
                "chemical compound",
                "cultivar",
                "dev_stage",
                "disease staging",
                "dose",
                "ecotype",
                "environmental history",
                "environmental stress",
                "genotype",
                "growth condition",
                "immunoprecipitate",
                "individual",
                "infect",
                "initial time point",
                "organism",
                "organism part",
                "phenotype",
                "ploidy",
                "protein-bound",
                "protocol",
                "replicate",
                "rnase",
                "sample type",
                "sampling site",
                "sampling time point",
                "sex",
                "strain",
                "temperature",
                "time",
                "transgene"
            ]
        }
    }
}