{
    "title": "collection date",
    "type": "object",
    "level": "mandatory",
    "properties": {
        "collection date": {
            "description": "The date the sample was collected with the intention of sequencing, either as an instance (single point in time) or interval. In case no exact time is available, the date/time can be right truncated i.e. all of these are valid ISO8601 compliant times: 2008-01-23T19:23:10+00:00; 2008-01-23T19:23:10; 2008-01-23; 2008-01; 2008.",
            "type": "string",
            "pattern": "(^[12][0-9]{3}(-(0[1-9]|1[0-2])(-(0[1-9]|[12][0-9]|3[01])(T[0-9]{2}:[0-9]{2}(:[0-9]{2})?Z?([+-][0-9]{1,2})?)?)?)?(/[0-9]{4}(-[0-9]{2}(-[0-9]{2}(T[0-9]{2}:[0-9]{2}(:[0-9]{2})?Z?([+-][0-9]{1,2})?)?)?)?)?$)|(^not applicable$)|(^not collected$)|(^not provided$)|(^restricted access$)|(^missing: control sample$)|(^missing: sample group$)|(^missing: synthetic construct$)|(^missing: lab stock$)|(^missing: third party data$)|(^missing: data agreement established pre-2023$)|(^missing: endangered species$)|(^missing: human-identifiable$)|(^missing$)"
        }
    },
    "required": [
        "collection date"
    ]
}