{
    "title": "quadrant position",
    "type": "object",
    "level": "optional",
    "properties": {
        "quadrant position": {
            "description": "The quadrant position of the sampling room within the building",
            "type": "string"
        },
        "unit": {
            "type": "string",
            "enum": [
                "\u00b0C"
            ]
        }
    }
}