[
    {
        "slug": "study",
        "name": "Study",
        "description": "A study (project) groups together data submitted to the archive and controls its release date. A study accession is typically used when citing data submitted to ENA. Note that all associated data and other objects are made public when the study is released."
    },
    {
        "slug": "sample",
        "name": "Sample",
        "description": "A sample contains information about the sequenced source material. Samples are associated with checklists, which define the fields used to annotate the samples. Samples are always associated with a taxon.",
        "groups": [
            {
                "slug": "erc000011",
                "name": "ERC000011 - Default sample checklist",
                "description": "Minimum information required for the sample"
            },
            {
                "slug": "erc000028",
                "name": "ERC000028 - Prokaryotic pathogen minimal sample checklist",
                "description": "Minimum information required for a prokaryotic pathogen sample"
            }
        ]
    },
    {
        "slug": "experiment",
        "name": "Experiment",
        "description": "An experiment contains information about a sequencing experiment including library and instrument details."
    },
    {
        "slug": "run",
        "name": "Run",
        "description": "A run is part of an experiment and refers to data files containing sequence reads."
    },
    {
        "slug": "analysis",
        "name": "Analysis",
        "description": "An analysis contains secondary analysis results derived from sequence reads (e.g. a genome assembly)."
    },
    {
        "slug": "submission",
        "name": "Submission",
        "description": "A submission contains submission actions to be performed by the archive. A submission can add more objects to the archive, update already submitted objects or make objects publicly available."
    }
]
