{
    "title": "organism count",
    "type": "object",
    "level": "optional",
    "properties": {
        "organism count": {
            "description": "Total cell count of any organism (or group of organisms) per gram, volume or area of sample, should include name of organism followed by count. The method that was used for the enumeration (e.g. qPCR, atp, mpn, etc.) Should also be provided. (example: total prokaryotes; 3.5e7 cells per ml; qpcr)",
            "type": "string"
        }
    }
}