{
    "title": "host disease outcome",
    "type": "object",
    "level": "recommended",
    "properties": {
        "host disease outcome": {
            "description": "Disease outcome in the host.",
            "type": "string",
            "enum": [
                "dead",
                "recovered",
                "recovered with sequelae"
            ]
        }
    }
}