{
    "title": "travel-relation",
    "type": "object",
    "level": "optional",
    "properties": {
        "travel-relation": {
            "description": "Designates the relation of the main diagnosis to the patient's travel.",
            "type": "string",
            "enum": [
                "not ascertainable",
                "not travel-related",
                "travel-related"
            ]
        }
    }
}