{
    "title": "name of the sampling site",
    "type": "object",
    "level": "recommended",
    "properties": {
        "name of the sampling site": {
            "description": "Refers to the name of the site/station where data/sample collection is performed.",
            "type": "string"
        }
    }
}