{
    "title": "extreme weather event",
    "type": "object",
    "level": "optional",
    "properties": {
        "extreme weather event": {
            "description": "Unusual weather events that may have affected microbial populations. Multiple terms can be separated by pipes, listed in reverse chronological order.",
            "type": "string"
        },
        "unit": {
            "type": "string",
            "enum": [
                "m"
            ]
        }
    }
}