{
    "title": "fertilizer administration date",
    "type": "object",
    "level": "optional",
    "properties": {
        "fertilizer administration date": {
            "description": "Date of administration of soil amendment or fertilizer. Multiple terms may apply and can be separated by pipes, listing in reverse chronological order.",
            "type": "string",
            "format": "date"
        }
    }
}