{
    "title": "bacterial carbon production",
    "type": "object",
    "level": "optional",
    "properties": {
        "bacterial carbon production": {
            "description": "measurement of bacterial carbon production",
            "type": "string",
            "pattern": "(0|((0\\.)|([1-9][0-9]*\\.?))[0-9]*)([Ee][+-]?[0-9]+)?"
        },
        "unit": {
            "type": "string",
            "enum": [
                "ng/h"
            ]
        }
    }
}