{
    "title": "sample material processing",
    "type": "object",
    "level": "optional",
    "properties": {
        "sample material processing": {
            "description": "A brief description of any processing applied to the sample during or after retrieving the sample from environment, or a link to the relevant protocol(s) performed.",
            "type": "string"
        }
    }
}