{
    "title": "wall thermal mass",
    "type": "object",
    "level": "optional",
    "properties": {
        "wall thermal mass": {
            "description": "The ability of the wall to provide inertia against temperature fluctuations. Generally this means concrete or concrete block that is either exposed or covered only with paint",
            "type": "string",
            "pattern": "(0|((0\\.)|([1-9][0-9]*\\.?))[0-9]*)([Ee][+-]?[0-9]+)?"
        },
        "unit": {
            "type": "string",
            "enum": [
                "Cth",
                "J/K",
                "J/\u00b0C"
            ]
        }
    }
}