{
    "title": "sequence quality check",
    "type": "object",
    "level": "optional",
    "properties": {
        "sequence quality check": {
            "description": "Indicate if the sequence has been called by automatic systems (none) or undergone a manual editing procedure (e.g. by inspecting the raw data or chromatograms). Applied only for sequences that are not submitted to SRA or DRA",
            "type": "string",
            "enum": [
                "manual",
                "none",
                "software"
            ]
        }
    }
}