{
    "title": "gaseous substances",
    "type": "object",
    "level": "optional",
    "properties": {
        "gaseous substances": {
            "description": "amount or concentration of substances such as hydrogen sulfide, carbon dioxide, methane, etc.; can include multiple substances",
            "type": "string",
            "pattern": "(0|((0\\.)|([1-9][0-9]*\\.?))[0-9]*)([Ee][+-]?[0-9]+)?"
        },
        "unit": {
            "type": "string",
            "enum": [
                "\u00b5mol/L"
            ]
        }
    }
}