{
    "title": "propagation",
    "type": "object",
    "level": "optional",
    "properties": {
        "propagation": {
            "description": "The type of reproduction from the parent stock. Values for this field is specific to different taxa. For phage or virus: lytic/lysogenic/temperate/obligately lytic. For plasmids: incompatibility group. For eukaryotes: sexual/asexual. Mandatory for MIGs of eukayotes, plasmids and viruses.",
            "type": "string"
        }
    }
}