{
    "title": "spike-in with antibiotics",
    "type": "object",
    "level": "optional",
    "properties": {
        "spike-in with antibiotics": {
            "description": "Antimicrobials used in research study to assess effects of exposure on microbiome of a specific site. Please list antimicrobial, common name and/or class and concentration used for spike-in.",
            "type": "string"
        },
        "unit": {
            "type": "string",
            "enum": [
                "m2"
            ]
        }
    }
}