{
    "title": "known pathogenicity",
    "type": "object",
    "level": "optional",
    "properties": {
        "known pathogenicity": {
            "description": "To what is the entity pathogenic, for instance plant, fungi, bacteria",
            "type": "string"
        }
    }
}