{
    "title": "radiation regimen",
    "type": "object",
    "level": "optional",
    "properties": {
        "radiation regimen": {
            "description": "information about treatment involving exposure of plant or a plant part to a particular radiation regimen; should include the radiation type, amount or intensity administered, treatment duration, interval and total experimental duration; can include multiple radiation regimens",
            "type": "string"
        }
    }
}