{
    "title": "drawings",
    "type": "object",
    "level": "optional",
    "properties": {
        "drawings": {
            "description": "The buildings architectural drawings; if design is chosen, indicate phase-conceptual, schematic, design development, and construction documents",
            "type": "string"
        },
        "unit": {
            "type": "string",
            "enum": [
                "century",
                "month",
                "week",
                "year"
            ]
        }
    }
}