{
    "title": "relevant electronic resources",
    "type": "object",
    "level": "optional",
    "properties": {
        "relevant electronic resources": {
            "description": "A related resource that is referenced, cited, or otherwise associated to the sequence in the format of a PMID, DOI or URL",
            "type": "string"
        }
    }
}