{
    "title": "geographic location (longitude)",
    "type": "object",
    "level": "mandatory",
    "properties": {
        "geographic location (longitude)": {
            "description": "The geographical origin of the sample as defined by longitude. The values should be reported in decimal degrees and in WGS84 system",
            "type": "string",
            "pattern": "(^[+-]?[0-9]+.?[0-9]{0,8}$)|(^not applicable$)|(^not collected$)|(^not provided$)|(^restricted access$)|(^missing: control sample$)|(^missing: sample group$)|(^missing: synthetic construct$)|(^missing: lab stock$)|(^missing: third party data$)|(^missing: data agreement established pre-2023$)|(^missing: endangered species$)|(^missing: human-identifiable$)|(^missing$)"
        },
        "unit": {
            "type": "string",
            "enum": [
                "DD"
            ]
        }
    },
    "required": [
        "geographic location (longitude)"
    ]
}