{
    "title": "dissolved organic nitrogen",
    "type": "object",
    "level": "optional",
    "properties": {
        "dissolved organic nitrogen": {
            "description": "dissolved organic nitrogen concentration measured as; total dissolved nitrogen - NH4 - NO3 - NO2",
            "type": "string",
            "pattern": "(0|((0\\.)|([1-9][0-9]*\\.?))[0-9]*)([Ee][+-]?[0-9]+)?"
        },
        "unit": {
            "type": "string",
            "enum": [
                "mg/L",
                "\u00b5g/L"
            ]
        }
    }
}