{
    "title": "pH",
    "type": "object",
    "level": "optional",
    "properties": {
        "pH": {
            "description": "pH measurement",
            "type": "string",
            "pattern": "(0|((0\\.)|([1-9][0-9]*\\.?))[0-9]*)([Ee][+-]?[0-9]+)?"
        }
    }
}