{
    "title": "environmental_sample",
    "type": "object",
    "level": "optional",
    "properties": {
        "environmental_sample": {
            "description": "identifies sequences derived by direct molecular isolation from a bulk environmental DNA sample (by PCR with or without subsequent cloning of the product, DGGE, or other anonymous methods) with no reliable identification of the source organism",
            "type": "string",
            "enum": [
                "No",
                "Yes"
            ]
        }
    }
}