{
    "title": "contamination screening parameters",
    "type": "object",
    "level": "optional",
    "properties": {
        "contamination screening parameters": {
            "description": "Specific parameters used in the decontamination sofware, such as reference database, coverage, and kmers. Combinations of these parameters may also be used, i.e. kmer and coverage, or reference database and kmer",
            "type": "string"
        }
    }
}