{
    "title": "experimental factor",
    "type": "object",
    "level": "optional",
    "properties": {
        "experimental factor": {
            "description": "Experimental factors are essentially the variable aspects of an experiment design which can be used to describe an experiment, or set of experiments, in an increasingly detailed manner. This field accepts ontology terms from Experimental Factor Ontology (EFO) and/or Ontology for Biomedical Investigations (OBI). For a browser of EFO (v 2.95) terms, please see http://purl.bioontology.org/ontology/EFO; for a browser of OBI (v 2018-02-12) terms please see http://purl.bioontology.org/ontology/OBI. E.g. time series design [EFO:EFO_0001779]",
            "type": "string"
        }
    }
}