{
    "title": "water cut",
    "type": "object",
    "level": "optional",
    "properties": {
        "water cut": {
            "description": "Current amount of water (%) in a produced fluid stream; or the average of the combined streams",
            "type": "string"
        },
        "unit": {
            "type": "string",
            "enum": [
                "day",
                "hour",
                "minute",
                "month",
                "week",
                "year"
            ]
        }
    }
}