{
    "title": "sampled age",
    "type": "object",
    "level": "optional",
    "properties": {
        "sampled age": {
            "description": "age of subject at the time of sample collection; relevant scale depends on species and study; e.g. 2 weeks old",
            "type": "string"
        }
    }
}