{
    "title": "sample disease stage",
    "type": "object",
    "level": "optional",
    "properties": {
        "sample disease stage": {
            "description": "stage of the disease at the time of sample collection, e.g. inoculation, penetration, infection, growth and reproduction, dissemination of pathogen",
            "type": "string"
        }
    }
}