{
    "title": "Publications collection",
    "description": "List of publication",
    "type": "array",
    "items": {
        "oneOf": [
            {
                "$ref": "/api/schemas/referential/related-identifier"
            }
        ]
    },
    "minItems": 1,
    "uniqueItems": true
}