{
    "title": "number of standard tRNAs extracted",
    "type": "object",
    "level": "optional",
    "properties": {
        "number of standard tRNAs extracted": {
            "description": "The total number of tRNAs identified from the bin, SAG or MAG",
            "type": "string",
            "pattern": "[+-]?[0-9]+"
        }
    }
}