{
    "title": "sample storage temperature",
    "type": "object",
    "level": "recommended",
    "properties": {
        "sample storage temperature": {
            "description": "temperature at which sample was stored, e.g. -80",
            "type": "string",
            "pattern": "[+-]?(0|((0\\.)|([1-9][0-9]*\\.?))[0-9]*)([Ee][+-]?[0-9]+)?"
        },
        "unit": {
            "type": "string",
            "enum": [
                "\u00b0C"
            ]
        }
    }
}