{
    "title": "mean seasonal precipitation",
    "type": "object",
    "level": "optional",
    "properties": {
        "mean seasonal precipitation": {
            "description": "The average of all seasonal precipitation values known, or an estimated equivalent value derived by such methods as regional indexes or Isohyetal maps.",
            "type": "string",
            "pattern": "(0|((0\\.)|([1-9][0-9]*\\.?))[0-9]*)([Ee][+-]?[0-9]+)?"
        },
        "unit": {
            "type": "string",
            "enum": [
                "mm"
            ]
        }
    }
}