{
    "title": "host diet treatment",
    "type": "object",
    "level": "mandatory",
    "properties": {
        "host diet treatment": {
            "description": "Experimental diet treatment/additive to normal host feed e.g. Probiotic (GalliPro EPB5)",
            "type": "string"
        }
    },
    "required": [
        "host diet treatment"
    ]
}