{
    "title": "liver disorder",
    "type": "object",
    "level": "optional",
    "properties": {
        "liver disorder": {
            "description": "History of liver disorders; can include multiple disorders. The terms should be chosen from the DO (Human Disease Ontology) at http://www.disease-ontology.org, liver disease (https://disease-ontology.org/?id=DOID:409).",
            "type": "string"
        }
    }
}