{
    "title": "host phenotype",
    "type": "object",
    "level": "optional",
    "properties": {
        "host phenotype": {
            "description": "phenotype of host. For Phenotypic quality Ontology (PATO) (v 2013-10-28) terms, please see http://purl.bioontology.org/ontology/PATO",
            "type": "string"
        }
    }
}