{
    "title": "fertilizer administration",
    "type": "object",
    "level": "optional",
    "properties": {
        "fertilizer administration": {
            "description": "Type of fertilizer or amendment added to the soil or water for the purpose of improving substrate health and quality for plant growth. This field accepts terms listed under agronomic fertilizer (http://purl.obolibrary.org/obo/AGRO_00002062). Multiple terms may apply and can be separated by pipes, listing in reverse chronological order. N.B. Old ENA definition as \"fertilizer regimen\": information about treatment involving the use of fertilizers; should include the name fertilizer, amount administered, treatment duration, interval and total experimental duration; can include multiple fertilizer regimens",
            "type": "string"
        }
    }
}