{
    "title": "soil texture method",
    "type": "object",
    "level": "optional",
    "properties": {
        "soil texture method": {
            "description": "reference or method used in determining soil texture",
            "type": "string"
        }
    }
}