{
    "title": "patient tumor type",
    "type": "object",
    "level": "mandatory",
    "properties": {
        "patient tumor type": {
            "description": "For a primary sample (a tumor at the original site of origin), please select \u201cPrimary Neoplasm\u201d . For a metastatic sample (a tumor that has spread from its original (primary) site of growth to another site, close to or distant from the primary site), please select \u201cMetastatic Neoplasm\u201d . For a recurring neoplasm sample (neoplasm returning after a period of remission at the same location), please select \u201cRecurrent Neoplasm\u201d . If unknown tumor type, please select \u201cnot provided\u201d.",
            "type": "string",
            "enum": [
                "Metastatic Neoplasm",
                "Primary Neoplasm",
                "Recurrent Neoplasm",
                "not provided"
            ]
        }
    },
    "required": [
        "patient tumor type"
    ]
}