{
    "title": "host specificity or range",
    "type": "object",
    "level": "optional",
    "properties": {
        "host specificity or range": {
            "description": "The range and diversity of host species that an organism is capable of infecting, defined by NCBI taxonomy identifier.",
            "type": "string"
        }
    }
}