{
    "title": "carbon/nitrogen ratio",
    "type": "object",
    "level": "optional",
    "properties": {
        "carbon/nitrogen ratio": {
            "description": "ratio of amount or concentrations of carbon to nitrogen",
            "type": "string",
            "pattern": "(0|((0\\.)|([1-9][0-9]*\\.?))[0-9]*)([Ee][+-]?[0-9]+)?"
        }
    }
}