{
    "title": "host specificity",
    "type": "object",
    "level": "recommended",
    "properties": {
        "host specificity": {
            "description": "Level of specificity of symbiont-host interaction: e.g. generalist (symbiont able to establish associations with distantly related hosts) or species-specific.",
            "type": "string"
        }
    }
}