{
    "title": "library size",
    "type": "object",
    "level": "optional",
    "properties": {
        "library size": {
            "description": "Total number of clones in the library prepared for the project",
            "type": "string",
            "pattern": "[+-]?[0-9]+"
        }
    }
}