{
  "title": "Taxon",
  "description": "JSON object representing a taxon based on the NCBI taxonomy.",
  "type": "object",
  "properties": {
    "scientificName": {
        "type": "string",
        "description": "The scientific name of the taxon.",
        "format": "ncbi-taxon-sn"
      },
    "taxonID": {
      "type": "string",
      "format": "ncbi-taxon-id",
      "readOnly": true,
      "description": "The unique identifier of the taxon in the NCBI taxonomy."
    },
    "commonName": {
      "type": "string",
      "description": "The common name of the taxon (optional)."
    }
  },
  "required": ["taxonID", "scientificName"]
}
