{
    "title": "spike-in bacterial serovar or serotype",
    "type": "object",
    "level": "optional",
    "properties": {
        "spike-in bacterial serovar or serotype": {
            "description": "Taxonomic information about the spike-in organism(s) at the serovar or serotype level. This field accepts terms under organism (http://purl.obolibrary.org/obo/NCIT_C14250). This field also accepts identification numbers from NCBI under https://www.ncbi.nlm.nih.gov/taxonomy. Multiple terms can be separated by pipes.",
            "type": "string"
        },
        "unit": {
            "type": "string",
            "enum": [
                "day",
                "hour",
                "minute",
                "month",
                "week",
                "year"
            ]
        }
    }
}