{
    "title": "door signs of water/mold",
    "type": "object",
    "level": "optional",
    "properties": {
        "door signs of water/mold": {
            "description": "Signs of the presence of mold or mildew on a door",
            "type": "string"
        },
        "unit": {
            "type": "string",
            "enum": [
                "%",
                "minute"
            ]
        }
    }
}