{
    "title": "Creators",
    "description": "The creators/authors of the deposition. Each creator includes a name, and optionally, affiliation, ORCID, and GND identifiers.",
    "level": "mandatory",
    "type": "array",
    "items": {
        "type": "object",
        "properties": {
            "name": {
                "type": "string",
                "description": "Name of the creator in the format 'Family name, Given names'.",
                "minLength": 1
            },
            "affiliation": {
                "type": "string",
                "description": "Affiliation of the creator."
            },
            "orcid": {
                "type": "string",
                "format": "uri",
                "description": "ORCID identifier of the creator.",
                "pattern": "^(https://orcid.org/)?(\\d{4}-){3}\\d{3}(\\d|X)$"
            },
            "gnd": {
                "type": "string",
                "description": "GND identifier of the creator."
            }
        },
        "required": [
            "name"
        ]
    },
    "minItems": 1
}
