{
    "title": "tidal stage",
    "type": "object",
    "level": "optional",
    "properties": {
        "tidal stage": {
            "description": "stage of tide",
            "type": "string",
            "enum": [
                "high",
                "low"
            ]
        }
    }
}