{
    "title": "tissue_lib",
    "type": "object",
    "level": "optional",
    "properties": {
        "tissue_lib": {
            "description": "tissue library from which sample was obtained",
            "type": "string"
        }
    }
}