{
    "title": "plant reproductive part",
    "type": "object",
    "level": "optional",
    "properties": {
        "plant reproductive part": {
            "description": "Plant reproductive part used in the field during planting to start the crop.",
            "type": "string"
        }
    }
}