{
    "title": "total depth of water column",
    "type": "object",
    "level": "optional",
    "properties": {
        "total depth of water column": {
            "description": "measurement of total depth of water column",
            "type": "string",
            "pattern": "(0|((0\\.)|([1-9][0-9]*\\.?))[0-9]*)([Ee][+-]?[0-9]+)?"
        },
        "unit": {
            "type": "string",
            "enum": [
                "m"
            ]
        }
    }
}