{
    "title": "identified_by",
    "type": "object",
    "level": "optional",
    "properties": {
        "identified_by": {
            "description": "name of the expert who identified the specimen taxonomically",
            "type": "string"
        }
    }
}