{
    "title": "host of the symbiont role",
    "type": "object",
    "level": "recommended",
    "properties": {
        "host of the symbiont role": {
            "description": "Role of the host in the life cycle of the symbiotic organism.",
            "type": "string"
        }
    }
}