{
    "title": "bishomohopanol",
    "type": "object",
    "level": "optional",
    "properties": {
        "bishomohopanol": {
            "description": "concentration of bishomohopanol",
            "type": "string",
            "pattern": "(0|((0\\.)|([1-9][0-9]*\\.?))[0-9]*)([Ee][+-]?[0-9]+)?"
        },
        "unit": {
            "type": "string",
            "enum": [
                "\u00b5g/L",
                "\u00b5g/g"
            ]
        }
    }
}