{
    "title": "Title",
    "description": "Title of the study",
    "type": "object",
    "level": "mandatory",
    "properties": {
        "title": {
            "description": "Title of the study",
            "type": "string"
        }
    },
    "required": [
        "title"
    ]
}
