{
    "title": "climate environment",
    "type": "object",
    "level": "recommended",
    "properties": {
        "climate environment": {
            "description": "treatment involving an exposure to a particular climate; can include multiple climates",
            "type": "string"
        }
    }
}