{
    "title": "frequency of cleaning",
    "type": "object",
    "level": "optional",
    "properties": {
        "frequency of cleaning": {
            "description": "The number of times the sample location is cleaned. Frequency of cleaning might be on a Daily basis, Weekly, Monthly, Quarterly or Annually.",
            "type": "string",
            "enum": [
                "Annually",
                "Daily",
                "Monthly",
                "Quarterly",
                "Weekly"
            ]
        },
        "unit": {
            "type": "string",
            "enum": [
                "day",
                "hour",
                "minute",
                "month",
                "week",
                "year"
            ]
        }
    }
}