{
    "title": "DOI",
    "description": "Digital Object Identifier.",
    "type": "object",
    "properties": {
        "doi": {
            "type": "string",
            "pattern": "^10[.][0-9]{2,}(?:[.][0-9]+)*/(?:(?![%\"#? ])\\S)+$",
            "format": "doi"
        },
        "title": {
            "type": "string",
            "description": "The title of the article",
            "readOnly": true
        }
    },
    "required": [
        "doi",
        "title"
    ]
}