{
    "title": "host color",
    "type": "object",
    "level": "optional",
    "properties": {
        "host color": {
            "description": "the color of host",
            "type": "string"
        }
    }
}