{
    "title": "broad-scale environmental context",
    "type": "object",
    "level": "optional",
    "properties": {
        "broad-scale environmental context": {
            "description": "Report the major environmental system the sample or specimen came from. The system(s) identified should have a coarse spatial grain, to provide the general environmental context of where the sampling was done (e.g. in the desert or a rainforest). We recommend using subclasses of EnvO\u2019s biome class: http://purl.obolibrary.org/obo/ENVO_00000428. EnvO documentation about how to use the field: https://github.com/EnvironmentOntology/envo/wiki/Using-ENVO-with-MIxS.",
            "type": "string"
        }
    }
}