{
    "title": "equipment shared with other farms",
    "type": "object",
    "level": "optional",
    "properties": {
        "equipment shared with other farms": {
            "description": "List of planting, growing or harvesting equipment shared with other farms. This field accepts terms listed under agricultural implement (http://purl.obolibrary.org/obo/AGRO_00000416). Multiple terms can be separated by pipes.",
            "type": "string"
        }
    }
}