{
    "title": "source rock kerogen type",
    "type": "object",
    "level": "optional",
    "properties": {
        "source rock kerogen type": {
            "description": "Origin of kerogen. Type I: Algal (aquatic), Type II: planktonic and soft plant material (aquatic or terrestrial), Type III: terrestrial woody/ fibrous plant material (terrestrial), Type IV: oxidized recycled woody debris (terrestrial) (additional information: https://en.wikipedia.org/wiki/Kerogen). If \"other\" is specified, please propose entry in \"additional info\" field",
            "type": "string"
        },
        "unit": {
            "type": "string",
            "enum": [
                "hour",
                "month",
                "week",
                "year"
            ]
        }
    }
}