{
    "title": "fireplace type",
    "type": "object",
    "level": "optional",
    "properties": {
        "fireplace type": {
            "description": "A firebox with chimney",
            "type": "string"
        },
        "unit": {
            "type": "string",
            "enum": [
                "\u00b0C"
            ]
        }
    }
}