{
    "title": "medical history performed",
    "type": "object",
    "level": "optional",
    "properties": {
        "medical history performed": {
            "description": "whether full medical history was collected",
            "type": "string",
            "enum": [
                "No",
                "Yes"
            ]
        }
    }
}