{
    "title": "history/agrochemical additions",
    "type": "object",
    "level": "optional",
    "properties": {
        "history/agrochemical additions": {
            "description": "addition of fertilizers, pesticides, etc. - amount and time of applications",
            "type": "string"
        }
    }
}