{
    "title": "library preparation kit",
    "type": "object",
    "level": "optional",
    "properties": {
        "library preparation kit": {
            "description": "Packaged kits (containing adapters, indexes, enzymes, buffers etc.), tailored for specific sequencing workflows, which allow the simplified preparation of sequencing-ready libraries for small genomes, amplicons, and plasmids.",
            "type": "string"
        }
    }
}