{
    "title": "observed host symbionts",
    "type": "object",
    "level": "optional",
    "properties": {
        "observed host symbionts": {
            "description": "The taxonomic name of the organism(s) found living in mutualistic, commensalistic, or parasitic symbiosis with the specific host.",
            "type": "string"
        }
    }
}