{
    "title": "nose/mouth/teeth/throat disorder",
    "type": "object",
    "level": "optional",
    "properties": {
        "nose/mouth/teeth/throat disorder": {
            "description": "History of nose/mouth/teeth/throat disorders; can include multiple disorders. The terms should be chosen from the DO (Human Disease Ontology) at http://www.disease-ontology.org, nose disease (https://disease-ontology.org/?id=DOID:2825), mouth disease (https://disease-ontology.org/?id=DOID:403), tooth disease (https://disease-ontology.org/?id=DOID:1091), or upper respiratory tract disease (https://disease-ontology.org/?id=DOID:974).",
            "type": "string"
        }
    }
}