{
    "title": "binning parameters",
    "type": "object",
    "level": "mandatory",
    "properties": {
        "binning parameters": {
            "description": "The parameters that have been applied during the extraction of genomes from metagenomic datasets e.g. coverage and kmer",
            "type": "string"
        }
    },
    "required": [
        "binning parameters"
    ]
}