{
    "title": "Date",
    "description": "Date in a more or less precise form",
        "anyOf": [
            {
                "title": "Date",
                "type": "string",
                "format": "date",
                "default": ""
            },
            {
                "title": "Year",
                "type": "string",
                "pattern": "^(\\d{1,4})$",
                "default": ""
            },
            {
                "title": "Date time",
                "type": "string",
                "format": "date-time",
                "default": ""
            }
        ]
 }