{
    "title": "reservoir name",
    "type": "object",
    "level": "optional",
    "properties": {
        "reservoir name": {
            "description": "Name of the reservoir (e.g. Carapebus)",
            "type": "string"
        },
        "unit": {
            "type": "string",
            "enum": [
                "\u00b0C"
            ]
        }
    }
}