{
    "title": "floor area",
    "type": "object",
    "level": "optional",
    "properties": {
        "floor area": {
            "description": "The area of the floor space within the room",
            "type": "string",
            "pattern": "[0-9]*(\\.[0-9]*)?"
        }
    }
}