\relax 
\providecommand\hyper@newdestlabel[2]{}
\providecommand\babel@aux[2]{}
\@nameuse{bbl@beforestart}
\catcode `:\active 
\catcode `;\active 
\catcode `!\active 
\catcode `?\active 
\providecommand\HyperFirstAtBeginDocument{\AtBeginDocument}
\HyperFirstAtBeginDocument{\ifx\hyper@anchor\@undefined
\global\let\oldcontentsline\contentsline
\gdef\contentsline#1#2#3#4{\oldcontentsline{#1}{#2}{#3}}
\global\let\oldnewlabel\newlabel
\gdef\newlabel#1#2{\newlabelxx{#1}#2}
\gdef\newlabelxx#1#2#3#4#5#6{\oldnewlabel{#1}{{#2}{#3}}}
\AtEndDocument{\ifx\hyper@anchor\@undefined
\let\contentsline\oldcontentsline
\let\newlabel\oldnewlabel
\fi}
\fi}
\global\let\hyper@last\relax 
\gdef\HyperFirstAtBeginDocument#1{#1}
\providecommand\HyField@AuxAddToFields[1]{}
\providecommand\HyField@AuxAddToCoFields[2]{}
\babel@aux{french}{}
\newlabel{index::doc}{{}{1}{}{section*.2}{}}
\@writefile{toc}{\contentsline {chapter}{\numberline {1}Navigation}{3}{chapter.1}\protected@file@percent }
\@writefile{lof}{\addvspace {10\p@ }}
\@writefile{lot}{\addvspace {10\p@ }}
\newlabel{index:navigation}{{1}{3}{Navigation}{chapter.1}{}}
\@writefile{toc}{\contentsline {section}{\numberline {1.1}Objectives}{3}{section.1.1}\protected@file@percent }
\newlabel{overview_objectifs:objectives}{{1.1}{3}{Objectives}{section.1.1}{}}
\newlabel{overview_objectifs::doc}{{1.1}{3}{Objectives}{section.1.1}{}}
\@writefile{toc}{\contentsline {subsection}{\numberline {1.1.1}Why Metark ?}{3}{subsection.1.1.1}\protected@file@percent }
\newlabel{overview_objectifs:why-metark}{{1.1.1}{3}{Why Metark ?}{subsection.1.1.1}{}}
\@writefile{toc}{\contentsline {subsection}{\numberline {1.1.2}The proposed solution}{3}{subsection.1.1.2}\protected@file@percent }
\newlabel{overview_objectifs:the-proposed-solution}{{1.1.2}{3}{The proposed solution}{subsection.1.1.2}{}}
\@writefile{toc}{\contentsline {section}{\numberline {1.2}Strengths of the project}{3}{section.1.2}\protected@file@percent }
\newlabel{overview_points_forts:strengths-of-the-project}{{1.2}{3}{Strengths of the project}{section.1.2}{}}
\newlabel{overview_points_forts::doc}{{1.2}{3}{Strengths of the project}{section.1.2}{}}
\@writefile{toc}{\contentsline {subsection}{\numberline {1.2.1}Quality controls}{3}{subsection.1.2.1}\protected@file@percent }
\newlabel{overview_points_forts:quality-controls}{{1.2.1}{3}{Quality controls}{subsection.1.2.1}{}}
\@writefile{toc}{\contentsline {subsection}{\numberline {1.2.2}API}{4}{subsection.1.2.2}\protected@file@percent }
\newlabel{overview_points_forts:api}{{1.2.2}{4}{API}{subsection.1.2.2}{}}
\@writefile{toc}{\contentsline {subsection}{\numberline {1.2.3}Reproducibility}{4}{subsection.1.2.3}\protected@file@percent }
\newlabel{overview_points_forts:reproducibility}{{1.2.3}{4}{Reproducibility}{subsection.1.2.3}{}}
\@writefile{toc}{\contentsline {subsection}{\numberline {1.2.4}Open source technologies}{4}{subsection.1.2.4}\protected@file@percent }
\newlabel{overview_points_forts:open-source-technologies}{{1.2.4}{4}{Open source technologies}{subsection.1.2.4}{}}
\@writefile{toc}{\contentsline {section}{\numberline {1.3}Requirements}{4}{section.1.3}\protected@file@percent }
\newlabel{dev_requirements:requirements}{{1.3}{4}{Requirements}{section.1.3}{}}
\newlabel{dev_requirements::doc}{{1.3}{4}{Requirements}{section.1.3}{}}
\@writefile{toc}{\contentsline {subsection}{\numberline {1.3.1}Docker}{4}{subsection.1.3.1}\protected@file@percent }
\newlabel{dev_requirements:docker}{{1.3.1}{4}{Docker}{subsection.1.3.1}{}}
\@writefile{toc}{\contentsline {subsection}{\numberline {1.3.2}Docker\sphinxhyphen {}compose}{4}{subsection.1.3.2}\protected@file@percent }
\newlabel{dev_requirements:docker-compose}{{1.3.2}{4}{Docker\sphinxhyphen {}compose}{subsection.1.3.2}{}}
\@writefile{toc}{\contentsline {subsection}{\numberline {1.3.3}GitLab}{4}{subsection.1.3.3}\protected@file@percent }
\newlabel{dev_requirements:gitlab}{{1.3.3}{4}{GitLab}{subsection.1.3.3}{}}
\@writefile{toc}{\contentsline {section}{\numberline {1.4}Django}{4}{section.1.4}\protected@file@percent }
\newlabel{dev_django:django}{{1.4}{4}{Django}{section.1.4}{}}
\newlabel{dev_django::doc}{{1.4}{4}{Django}{section.1.4}{}}
\@writefile{toc}{\contentsline {subsection}{\numberline {1.4.1}Create a new app}{5}{subsection.1.4.1}\protected@file@percent }
\newlabel{dev_django:create-a-new-app}{{1.4.1}{5}{Create a new app}{subsection.1.4.1}{}}
\@writefile{toc}{\contentsline {subsection}{\numberline {1.4.2}Composition of a Django application}{5}{subsection.1.4.2}\protected@file@percent }
\newlabel{dev_django:composition-of-a-django-application}{{1.4.2}{5}{Composition of a Django application}{subsection.1.4.2}{}}
\@writefile{toc}{\contentsline {subsection}{\numberline {1.4.3}Make migrations in database}{5}{subsection.1.4.3}\protected@file@percent }
\newlabel{dev_django:make-migrations-in-database}{{1.4.3}{5}{Make migrations in database}{subsection.1.4.3}{}}
\@writefile{toc}{\contentsline {section}{\numberline {1.5}Code quality}{5}{section.1.5}\protected@file@percent }
\newlabel{dev_code_quality:code-quality}{{1.5}{5}{Code quality}{section.1.5}{}}
\newlabel{dev_code_quality::doc}{{1.5}{5}{Code quality}{section.1.5}{}}
\@writefile{toc}{\contentsline {subsection}{\numberline {1.5.1}Overview}{5}{subsection.1.5.1}\protected@file@percent }
\newlabel{dev_code_quality:overview}{{1.5.1}{5}{Overview}{subsection.1.5.1}{}}
\@writefile{toc}{\contentsline {subsection}{\numberline {1.5.2}Coverage}{5}{subsection.1.5.2}\protected@file@percent }
\newlabel{dev_code_quality:coverage}{{1.5.2}{5}{Coverage}{subsection.1.5.2}{}}
\@writefile{toc}{\contentsline {subsection}{\numberline {1.5.3}Flake8}{6}{subsection.1.5.3}\protected@file@percent }
\newlabel{dev_code_quality:flake8}{{1.5.3}{6}{Flake8}{subsection.1.5.3}{}}
\@writefile{toc}{\contentsline {section}{\numberline {1.6}Application ISA}{6}{section.1.6}\protected@file@percent }
\newlabel{dev_isa:application-isa}{{1.6}{6}{Application ISA}{section.1.6}{}}
\newlabel{dev_isa::doc}{{1.6}{6}{Application ISA}{section.1.6}{}}
\@writefile{toc}{\contentsline {subsection}{\numberline {1.6.1}How to add an API?}{6}{subsection.1.6.1}\protected@file@percent }
\newlabel{dev_isa:how-to-add-an-api}{{1.6.1}{6}{How to add an API?}{subsection.1.6.1}{}}
\@writefile{toc}{\contentsline {subsection}{\numberline {1.6.2}Key files of the « ISA » application}{6}{subsection.1.6.2}\protected@file@percent }
\newlabel{dev_isa:key-files-of-the-isa-application}{{1.6.2}{6}{Key files of the « ISA » application}{subsection.1.6.2}{}}
\@writefile{toc}{\contentsline {subsubsection}{api.py}{6}{subsubsection*.3}\protected@file@percent }
\newlabel{dev_isa:module-apps.isa.apis}{{1.6.2}{6}{api.py}{subsubsection*.3}{}}
\newlabel{dev_isa:api-py}{{1.6.2}{6}{api.py}{subsubsection*.3}{}}
\newlabel{dev_isa:apps.isa.apis.AssayManagement}{{1.6.2}{6}{api.py}{section*.4}{}}
\newlabel{dev_isa:apps.isa.apis.AssayManagement.serializer_class}{{1.6.2}{6}{api.py}{section*.5}{}}
\newlabel{dev_isa:apps.isa.apis.CommentManagement}{{1.6.2}{6}{api.py}{section*.6}{}}
\newlabel{dev_isa:apps.isa.apis.CommentManagement.serializer_class}{{1.6.2}{6}{api.py}{section*.7}{}}
\newlabel{dev_isa:apps.isa.apis.ContactManagement}{{1.6.2}{6}{api.py}{section*.8}{}}
\newlabel{dev_isa:apps.isa.apis.ContactManagement.pagination_class}{{1.6.2}{6}{api.py}{section*.9}{}}
\newlabel{dev_isa:apps.isa.apis.ContactManagement.serializer_class}{{1.6.2}{6}{api.py}{section*.10}{}}
\newlabel{dev_isa:apps.isa.apis.CustomPagination}{{1.6.2}{6}{api.py}{section*.11}{}}
\newlabel{dev_isa:apps.isa.apis.ISAManagement}{{1.6.2}{6}{api.py}{section*.12}{}}
\newlabel{dev_isa:apps.isa.apis.ISAManagement.serializer_class}{{1.6.2}{6}{api.py}{section*.13}{}}
\newlabel{dev_isa:apps.isa.apis.InvestigationDetail}{{1.6.2}{6}{api.py}{section*.14}{}}
\newlabel{dev_isa:apps.isa.apis.InvestigationDetail.get_queryset}{{1.6.2}{6}{api.py}{section*.15}{}}
\newlabel{dev_isa:apps.isa.apis.InvestigationDetail.pagination_class}{{1.6.2}{7}{api.py}{section*.16}{}}
\newlabel{dev_isa:apps.isa.apis.InvestigationDetail.serializer_class}{{1.6.2}{7}{api.py}{section*.17}{}}
\newlabel{dev_isa:apps.isa.apis.PersonContactManagement}{{1.6.2}{7}{api.py}{section*.18}{}}
\newlabel{dev_isa:apps.isa.apis.PersonContactManagement.serializer_class}{{1.6.2}{7}{api.py}{section*.19}{}}
\newlabel{dev_isa:apps.isa.apis.PublicationManagement}{{1.6.2}{7}{api.py}{section*.20}{}}
\newlabel{dev_isa:apps.isa.apis.PublicationManagement.pagination_class}{{1.6.2}{7}{api.py}{section*.21}{}}
\newlabel{dev_isa:apps.isa.apis.PublicationManagement.serializer_class}{{1.6.2}{7}{api.py}{section*.22}{}}
\newlabel{dev_isa:apps.isa.apis.RoleManagement}{{1.6.2}{7}{api.py}{section*.23}{}}
\newlabel{dev_isa:apps.isa.apis.RoleManagement.serializer_class}{{1.6.2}{7}{api.py}{section*.24}{}}
\newlabel{dev_isa:apps.isa.apis.SearchForUsers}{{1.6.2}{7}{api.py}{section*.25}{}}
\newlabel{dev_isa:apps.isa.apis.SearchForUsers.pagination_class}{{1.6.2}{7}{api.py}{section*.26}{}}
\newlabel{dev_isa:apps.isa.apis.SearchForUsers.serializer_class}{{1.6.2}{7}{api.py}{section*.27}{}}
\newlabel{dev_isa:apps.isa.apis.StudyManagement}{{1.6.2}{7}{api.py}{section*.28}{}}
\newlabel{dev_isa:apps.isa.apis.StudyManagement.serializer_class}{{1.6.2}{7}{api.py}{section*.29}{}}
\newlabel{dev_isa:apps.isa.apis.TagManagement}{{1.6.2}{7}{api.py}{section*.30}{}}
\newlabel{dev_isa:apps.isa.apis.TagManagement.pagination_class}{{1.6.2}{7}{api.py}{section*.31}{}}
\newlabel{dev_isa:apps.isa.apis.TagManagement.serializer_class}{{1.6.2}{7}{api.py}{section*.32}{}}
\@writefile{toc}{\contentsline {subsubsection}{serializers.py}{7}{subsubsection*.33}\protected@file@percent }
\newlabel{dev_isa:serializers-py}{{1.6.2}{7}{serializers.py}{subsubsection*.33}{}}
\newlabel{dev_isa:module-apps.isa.serializers}{{1.6.2}{7}{serializers.py}{section*.34}{}}
\newlabel{dev_isa:apps.isa.serializers.AssayResumeSerializer}{{1.6.2}{7}{serializers.py}{section*.35}{}}
\newlabel{dev_isa:apps.isa.serializers.AssaySerializer}{{1.6.2}{7}{serializers.py}{section*.36}{}}
\newlabel{dev_isa:apps.isa.serializers.CommentSerializer}{{1.6.2}{7}{serializers.py}{section*.37}{}}
\newlabel{dev_isa:apps.isa.serializers.ContactSerializer}{{1.6.2}{8}{serializers.py}{section*.38}{}}
\newlabel{dev_isa:apps.isa.serializers.DataFileSerializer}{{1.6.2}{8}{serializers.py}{section*.39}{}}
\newlabel{dev_isa:apps.isa.serializers.DesignTypeSerializer}{{1.6.2}{8}{serializers.py}{section*.40}{}}
\newlabel{dev_isa:apps.isa.serializers.FactorSerializer}{{1.6.2}{8}{serializers.py}{section*.41}{}}
\newlabel{dev_isa:apps.isa.serializers.ISAResumeSerializer}{{1.6.2}{8}{serializers.py}{section*.42}{}}
\newlabel{dev_isa:apps.isa.serializers.InvestigationResumeSerializer}{{1.6.2}{8}{serializers.py}{section*.43}{}}
\newlabel{dev_isa:apps.isa.serializers.InvestigationSerializer}{{1.6.2}{8}{serializers.py}{section*.44}{}}
\newlabel{dev_isa:apps.isa.serializers.MeasurementTypeSerializer}{{1.6.2}{8}{serializers.py}{section*.45}{}}
\newlabel{dev_isa:apps.isa.serializers.PersonContactSerializer}{{1.6.2}{8}{serializers.py}{section*.46}{}}
\newlabel{dev_isa:apps.isa.serializers.ProtocolSerializer}{{1.6.2}{8}{serializers.py}{section*.47}{}}
\newlabel{dev_isa:apps.isa.serializers.PublicationSerializer}{{1.6.2}{8}{serializers.py}{section*.48}{}}
\newlabel{dev_isa:apps.isa.serializers.RoleSerializer}{{1.6.2}{8}{serializers.py}{section*.49}{}}
\newlabel{dev_isa:apps.isa.serializers.StudyResumeSerializer}{{1.6.2}{8}{serializers.py}{section*.50}{}}
\newlabel{dev_isa:apps.isa.serializers.StudySerializer}{{1.6.2}{8}{serializers.py}{section*.51}{}}
\newlabel{dev_isa:apps.isa.serializers.TagSerializer}{{1.6.2}{8}{serializers.py}{section*.52}{}}
\newlabel{dev_isa:apps.isa.serializers.UserSerializer}{{1.6.2}{8}{serializers.py}{section*.53}{}}
\@writefile{toc}{\contentsline {subsubsection}{test.py}{8}{subsubsection*.54}\protected@file@percent }
\newlabel{dev_isa:module-apps.isa.tests}{{1.6.2}{8}{test.py}{subsubsection*.54}{}}
\newlabel{dev_isa:test-py}{{1.6.2}{8}{test.py}{subsubsection*.54}{}}
\@writefile{toc}{\contentsline {section}{\numberline {1.7}Gestion de la documentation}{8}{section.1.7}\protected@file@percent }
\newlabel{dev_documentation:gestion-de-la-documentation}{{1.7}{8}{Gestion de la documentation}{section.1.7}{}}
\newlabel{dev_documentation::doc}{{1.7}{8}{Gestion de la documentation}{section.1.7}{}}
\@writefile{toc}{\contentsline {subsection}{\numberline {1.7.1}La page de configuration}{8}{subsection.1.7.1}\protected@file@percent }
\newlabel{dev_documentation:la-page-de-configuration}{{1.7.1}{8}{La page de configuration}{subsection.1.7.1}{}}
\@writefile{toc}{\contentsline {subsection}{\numberline {1.7.2}La page d’index}{8}{subsection.1.7.2}\protected@file@percent }
\newlabel{dev_documentation:la-page-d-index}{{1.7.2}{8}{La page d’index}{subsection.1.7.2}{}}
\@writefile{toc}{\contentsline {subsection}{\numberline {1.7.3}Les pages de documentation}{9}{subsection.1.7.3}\protected@file@percent }
\newlabel{dev_documentation:les-pages-de-documentation}{{1.7.3}{9}{Les pages de documentation}{subsection.1.7.3}{}}
\@writefile{toc}{\contentsline {subsection}{\numberline {1.7.4}Générer les pages HTML}{9}{subsection.1.7.4}\protected@file@percent }
\newlabel{dev_documentation:generer-les-pages-html}{{1.7.4}{9}{Générer les pages HTML}{subsection.1.7.4}{}}
\@writefile{toc}{\contentsline {subsubsection}{1 \sphinxhyphen {} PDF}{9}{subsubsection*.55}\protected@file@percent }
\newlabel{dev_documentation:pdf}{{1.7.4}{9}{1 \sphinxhyphen {} PDF}{subsubsection*.55}{}}
\@writefile{toc}{\contentsline {subsubsection}{2 \sphinxhyphen {} EPUB}{9}{subsubsection*.56}\protected@file@percent }
\newlabel{dev_documentation:epub}{{1.7.4}{9}{2 \sphinxhyphen {} EPUB}{subsubsection*.56}{}}
\@writefile{toc}{\contentsline {subsubsection}{3\sphinxhyphen {} HTML}{9}{subsubsection*.57}\protected@file@percent }
\newlabel{dev_documentation:html}{{1.7.4}{9}{3\sphinxhyphen {} HTML}{subsubsection*.57}{}}
\@writefile{toc}{\contentsline {subsubsection}{4\sphinxhyphen {} Un script}{9}{subsubsection*.58}\protected@file@percent }
\newlabel{dev_documentation:un-script}{{1.7.4}{9}{4\sphinxhyphen {} Un script}{subsubsection*.58}{}}
\@writefile{toc}{\contentsline {chapter}{Index des modules Python}{11}{section*.59}\protected@file@percent }
\@writefile{toc}{\contentsline {chapter}{Index}{13}{section*.60}\protected@file@percent }
\gdef \@abspage@last{18}
