{
  "_type" : "rooms  ",
  "data" : {
    "type" : "object",
    "properties" : {
      "building" : {
        "type" : "string"
      },
      "floor" : {
        "type" : "string"
      },
      "room-number" : {
        "type" : "string"
      },
      "name" : {
        "type" : "string"
      },
      "access" : {
        "type" : "array",
        "items": {
          "type": "string"
        }
      }
    },
    "required" : ["building", "floor", "room-number", "name", "access"]
  }
}