{
  "_type" : "boards",
  "data" : {
    "type" : "object",
    "properties" : {
      "title" : {
        "type" : "string"
      },
      "description" : {
        "type" : "string"
      },
      "lists" : {
        "type" : "array",
        "items" : {
          "type": "object",
          "properties": {
            "title": {
              "type": "string"
            },
            "open": {
              "type": "boolean"
            },
            "closed": {
              "type": "boolean"
            },
            "badges": {
              "type": "array",
              "items": {
                "type": "string"
              }
            },
            "assignees": {
              "type": "array",
              "items": {
                "type": "string"
              }
            },
            "milestone": {
              "type": "string"
            },
            "group": {
              "type": "string"
            },
            "issues": {
              "type": "array",
              "items": {
                "type": "string"
              }
            }
          },
          "required": [
            "title",
            "open",
            "closed",
            "badges",
            "assignees",
            "milestone",
            "group",
            "issues"
          ]
        }
      }
    },
    "required" : ["title", "description", "lists"]
  }
}