{
  "type": "GOD_HAND",
  "definitions": [
    {
      "id": "god_hand_96",
      "defaultDefinition": true,
      "data": {}
    },
    {
      "id": "god_hand_94",
      "data": {
        "mainReelSet": {
          "parser": "ReelSetParser",
          "id": "main",
          "reels": [
            ["D_w815", "F_w230", "G_w96", "FG_w38", "BL_w11100"]
          ]
        }
      }
    },
    {
      "id": "god_hand_92",
      "data": {
        "mainReelSet": {
          "parser": "ReelSetParser",
          "id": "main",
          "reels": [
            ["D_w900", "F_w160", "G_w71", "FG_w38", "BL_w11100"]
          ]
        }
      }
    }
  ],
  "data": {
    "paylines": {
      "parser": "PaylinesHorizontalParser",
      "list": [[0]]
    },
    "sceneSize": {
      "parser": "SceneSizeRectangularParser",
      "width": 1,
      "height": 1
    },
    "symbols": {
      "parser": "SymbolsParser",
      "list": ["A", "B", "C", "D", "E", "F", "G", "H", "I", "J", "K", "L", "M"]
    },

    "event_Normal_Win": {
      "parser": "SlotEventParser",
      "id": "event_Normal_Win"
    },
    "event_monkeys_1": {
      "parser": "SlotEventParser",
      "id": "event_monkeys_1"
    },
    "event_monkeys_2": {
      "parser": "SlotEventParser",
      "id": "event_monkeys_2"
    },
    "event_monkeys_3": {
      "parser": "SlotEventParser",
      "id": "event_monkeys_3"
    },
    "event_God_Flash_Blue": {
      "parser": "SlotEventParser",
      "id": "event_God_Flash_Blue"
    },
    "event_God_Flash_Green": {
      "parser": "SlotEventParser",
      "id": "event_God_Flash_Green"
    },
    "event_God_Flash_Red": {
      "parser": "SlotEventParser",
      "id": "event_God_Flash_Red"
    },
    "event_God_Flash_Gold": {
      "parser": "SlotEventParser",
      "id": "event_God_Flash_Gold"
    },
    "event_God_Flash_Sp1_Blue": {
      "parser": "SlotEventParser",
      "id": "event_God_Flash_Sp1_Blue"
    },
    "event_God_Flash_Sp1_Green": {
      "parser": "SlotEventParser",
      "id": "event_God_Flash_Sp1_Green"
    },
    "event_God_Flash_Sp1_Red": {
      "parser": "SlotEventParser",
      "id": "event_God_Flash_Sp1_Red"
    },
    "event_God_Flash_Sp1_Gold": {
      "parser": "SlotEventParser",
      "id": "event_God_Flash_Sp1_Gold"
    },
    "event_God_Flash_Sp2_Blue": {
      "parser": "SlotEventParser",
      "id": "event_God_Flash_Sp2_Blue"
    },
    "event_God_Flash_Sp2_Green": {
      "parser": "SlotEventParser",
      "id": "event_God_Flash_Sp2_Green"
    },
    "event_God_Flash_Sp2_Red": {
      "parser": "SlotEventParser",
      "id": "event_God_Flash_Sp2_Red"
    },
    "event_God_Flash_Sp2_Gold": {
      "parser": "SlotEventParser",
      "id": "event_God_Flash_Sp2_Gold"
    },

    "event_Ball_Blue": {
      "parser": "SlotEventParser",
      "id": "event_Ball_Blue"
    },
    "event_Ball_Green": {
      "parser": "SlotEventParser",
      "id": "event_Ball_Green"
    },
    "event_Ball_Red": {
      "parser": "SlotEventParser",
      "id": "event_Ball_Red"
    },
    "event_Ball_Gold": {
      "parser": "SlotEventParser",
      "id": "event_Ball_Gold"
    },

    "event_Ball_On_D": {
      "parser": "ListOfWeightedEntriesParser",
      "values": ["#event_Ball_Blue", "#event_Ball_Green", "#event_Ball_Red"],
      "weights": [100, 30, 0]
    },
    "calculator_event_Ball_On_D": {
      "parser": "GenerateRandomEventCalculatorParser",
      "events": "#event_Ball_On_D"
    },

    "event_On_D": {
      "parser": "ListOfWeightedEntriesParser",
      "values": ["#event_Normal_Win", "#event_monkeys_1"],
      "weights": [715, 0]
    },
    "calculator_event_On_D": {
      "parser": "GenerateRandomEventCalculatorParser",
      "events": "#event_On_D"
    },

    "symbol_D": {
      "parser": "HasSymbolOnWindowPredicateParser",
      "symbol": "D"
    },
    "calculator_Ball_On_D": {
      "parser": "ConditionalCalculatorParser",
      "gamePredicate": "#symbol_D",
      "delegate": "#calculator_event_Ball_On_D"
    },
    "calculator_On_D": {
      "parser": "ConditionalCalculatorParser",
      "gamePredicate": "#symbol_D",
      "delegate": "#calculator_event_On_D"
    },

    "event_Ball_On_F": {
      "parser": "ListOfWeightedEntriesParser",
      "values": ["#event_Ball_Blue", "#event_Ball_Green", "#event_Ball_Red"],
      "weights": [0, 100, 50]
    },
    "calculator_event_Ball_On_F": {
      "parser": "GenerateRandomEventCalculatorParser",
      "events": "#event_Ball_On_F"
    },

    "event_On_F": {
      "parser": "ListOfWeightedEntriesParser",
      "values": ["#event_Normal_Win", "#event_monkeys_1", "#event_monkeys_2", "#event_God_Flash_Sp1_Blue", "#event_God_Flash_Sp2_Blue"],
      "weights": [21673, 4495, 751, 1363, 218]
    },
    "calculator_event_On_F": {
      "parser": "GenerateRandomEventCalculatorParser",
      "events": "#event_On_F"
    },

    "symbol_F": {
      "parser": "HasSymbolOnWindowPredicateParser",
      "symbol": "F"
    },
    "calculator_Ball_On_F": {
      "parser": "ConditionalCalculatorParser",
      "gamePredicate": "#symbol_F",
      "delegate": "#calculator_event_Ball_On_F"
    },
    "calculator_On_F": {
      "parser": "ConditionalCalculatorParser",
      "gamePredicate": "#symbol_F",
      "delegate": "#calculator_event_On_F"
    },

    "event_Ball_On_G": {
      "parser": "ListOfWeightedEntriesParser",
      "values": ["#event_Ball_Blue", "#event_Ball_Green", "#event_Ball_Red"],
      "weights": [0, 0, 100]
    },
    "calculator_event_Ball_On_G": {
      "parser": "GenerateRandomEventCalculatorParser",
      "events": "#event_Ball_On_G"
    },

    "event_On_G": {
      "parser": "ListOfWeightedEntriesParser",
      "values": [
        "#event_Normal_Win",
        "#event_monkeys_1", "#event_monkeys_2", "#event_monkeys_3",
        "#event_God_Flash_Sp1_Blue", "#event_God_Flash_Sp1_Red",
        "#event_God_Flash_Sp2_Blue", "#event_God_Flash_Sp2_Red"
      ],
      "weights": [
        9328,
        100, 61, 400,
        588, 1217,
        999, 309
      ]
    },
    "calculator_event_On_G": {
      "parser": "GenerateRandomEventCalculatorParser",
      "events": "#event_On_G"
    },

    "symbol_G": {
      "parser": "HasSymbolOnWindowPredicateParser",
      "symbol": "G"
    },
    "calculator_Ball_On_G": {
      "parser": "ConditionalCalculatorParser",
      "gamePredicate": "#symbol_G",
      "delegate": "#calculator_event_Ball_On_G"
    },
    "calculator_On_G": {
      "parser": "ConditionalCalculatorParser",
      "gamePredicate": "#symbol_G",
      "delegate": "#calculator_event_On_G"
    },

    "event_Ball_On_FG": {
      "parser": "ListOfWeightedEntriesParser",
      "values": ["#event_Ball_Gold", "#event_Ball_Green", "#event_Ball_Red"],
      "weights": [100, 0, 0]
    },
    "calculator_event_Ball_On_FG": {
      "parser": "GenerateRandomEventCalculatorParser",
      "events": "#event_Ball_On_FG"
    },

    "event_On_FG": {
      "parser": "ListOfWeightedEntriesParser",
      "values": [
        "#event_monkeys_1", "#event_monkeys_2", "#event_monkeys_3",
        "#event_God_Flash_Blue", "#event_God_Flash_Red", "#event_God_Flash_Gold",
        "#event_God_Flash_Sp1_Blue", "#event_God_Flash_Sp1_Red", "#event_God_Flash_Sp1_Gold",
        "#event_God_Flash_Sp2_Blue", "#event_God_Flash_Sp2_Red", "#event_God_Flash_Sp2_Gold"
      ],
      "weights": [
        400, 400, 400,
        4, 4, 132,
        400, 599, 132,
        599, 599, 132
      ]
    },
    "calculator_event_On_FG": {
      "parser": "GenerateRandomEventCalculatorParser",
      "events": "#event_On_FG"
    },

    "symbol_FG": {
      "parser": "HasSymbolOnWindowPredicateParser",
      "symbol": "FG"
    },
    "calculator_Ball_On_FG": {
      "parser": "ConditionalCalculatorParser",
      "gamePredicate": "#symbol_FG",
      "delegate": "#calculator_event_Ball_On_FG"
    },
    "calculator_On_FG": {
      "parser": "ConditionalCalculatorParser",
      "gamePredicate": "#symbol_FG",
      "delegate": "#calculator_event_On_FG"
    },

    "mainEventRandomCalculators": {
      "parser": "AllCalculatorsParser",
      "delegates": [
        "#calculator_On_D", "#calculator_Ball_On_D",
        "#calculator_On_F", "#calculator_Ball_On_F",
        "#calculator_On_G", "#calculator_Ball_On_G",
        "#calculator_On_FG", "#calculator_Ball_On_FG"
      ]
    },

    "event_FS_Coin": {
      "parser": "SlotEventParser",
      "id": "event_FS_Coin"
    },
    "event_FS_Grail": {
      "parser": "SlotEventParser",
      "id": "event_FS_Grail"
    },
    "event_FS_Dia": {
      "parser": "SlotEventParser",
      "id": "event_FS_Dia"
    },
    "event_FS_Crown": {
      "parser": "SlotEventParser",
      "id": "event_FS_Crown"
    },

    "symbol_H": {
      "parser": "HasSymbolOnWindowPredicateParser",
      "symbol": "H"
    },
    "event_FS_On_H": {
      "parser": "ListOfWeightedEntriesParser",
      "values": ["#event_FS_Coin", "#event_FS_Grail", "#event_FS_Dia", "#event_FS_Crown"],
      "weights": [100, 0, 0, 0]
    },
    "calculator_event_FS_On_H": {
      "parser": "GenerateRandomEventCalculatorParser",
      "events": "#event_FS_On_H"
    },
    "calculator_FS_On_H": {
      "parser": "ConditionalCalculatorParser",
      "gamePredicate": "#symbol_H",
      "delegate": "#calculator_event_FS_On_H"
    },

    "symbol_I": {
      "parser": "HasSymbolOnWindowPredicateParser",
      "symbol": "I"
    },
    "event_FS_On_I": {
      "parser": "ListOfWeightedEntriesParser",
      "values": ["#event_FS_Coin", "#event_FS_Grail", "#event_FS_Dia", "#event_FS_Crown"],
      "weights": [30, 100, 0, 0]
    },
    "calculator_event_FS_On_I": {
      "parser": "GenerateRandomEventCalculatorParser",
      "events": "#event_FS_On_I"
    },
    "calculator_FS_On_I": {
      "parser": "ConditionalCalculatorParser",
      "gamePredicate": "#symbol_I",
      "delegate": "#calculator_event_FS_On_I"
    },

    "symbol_J": {
      "parser": "HasSymbolOnWindowPredicateParser",
      "symbol": "J"
    },
    "event_FS_On_J": {
      "parser": "ListOfWeightedEntriesParser",
      "values": ["#event_FS_Coin", "#event_FS_Grail", "#event_FS_Dia", "#event_FS_Crown"],
      "weights": [5, 70, 80, 0]
    },
    "calculator_event_FS_On_J": {
      "parser": "GenerateRandomEventCalculatorParser",
      "events": "#event_FS_On_J"
    },
    "calculator_FS_On_J": {
      "parser": "ConditionalCalculatorParser",
      "gamePredicate": "#symbol_J",
      "delegate": "#calculator_event_FS_On_J"
    },

    "symbol_K": {
      "parser": "HasSymbolOnWindowPredicateParser",
      "symbol": "K"
    },
    "event_FS_On_K": {
      "parser": "ListOfWeightedEntriesParser",
      "values": ["#event_FS_Coin", "#event_FS_Grail", "#event_FS_Dia", "#event_FS_Crown"],
      "weights": [0, 6, 100, 80]
    },
    "calculator_event_FS_On_K": {
      "parser": "GenerateRandomEventCalculatorParser",
      "events": "#event_FS_On_K"
    },
    "calculator_FS_On_K": {
      "parser": "ConditionalCalculatorParser",
      "gamePredicate": "#symbol_K",
      "delegate": "#calculator_event_FS_On_K"
    },

    "symbol_L": {
      "parser": "HasSymbolOnWindowPredicateParser",
      "symbol": "L"
    },
    "event_FS_On_L": {
      "parser": "ListOfWeightedEntriesParser",
      "values": ["#event_FS_Coin", "#event_FS_Grail", "#event_FS_Dia", "#event_FS_Crown"],
      "weights": [0, 0, 25, 100]
    },
    "calculator_event_FS_On_L": {
      "parser": "GenerateRandomEventCalculatorParser",
      "events": "#event_FS_On_L"
    },
    "calculator_FS_On_L": {
      "parser": "ConditionalCalculatorParser",
      "gamePredicate": "#symbol_L",
      "delegate": "#calculator_event_FS_On_L"
    },

    "symbol_M": {
      "parser": "HasSymbolOnWindowPredicateParser",
      "symbol": "M"
    },
    "event_FS_On_M": {
      "parser": "ListOfWeightedEntriesParser",
      "values": ["#event_FS_Coin", "#event_FS_Grail", "#event_FS_Dia", "#event_FS_Crown"],
      "weights": [1, 0, 0, 100]
    },
    "calculator_event_FS_On_M": {
      "parser": "GenerateRandomEventCalculatorParser",
      "events": "#event_FS_On_M"
    },
    "calculator_FS_On_M": {
      "parser": "ConditionalCalculatorParser",
      "gamePredicate": "#symbol_M",
      "delegate": "#calculator_event_FS_On_M"
    },

    "freeEventRandomCalculators": {
      "parser": "AllCalculatorsParser",
      "delegates": [
        "#calculator_FS_On_H",
        "#calculator_FS_On_I",
        "#calculator_FS_On_J",
        "#calculator_FS_On_K",
        "#calculator_FS_On_L",
        "#calculator_FS_On_M"
      ]
    },
    
    "retriggerFS": {
      "parser": "HasEventPredicateParser",
      "eventId": "addFreeSpins"
    },
    "triggerFS": {
      "parser": "HasEventPredicateParser",
      "eventId": "startScene"
    },
    
    "event_BGM_Off": {
      "parser": "SlotEventParser",
      "id": "event_BGM_Off"
    },
    "event_BGM_On": {
      "parser": "SlotEventParser",
      "id": "event_BGM_On"
    },
    "event_BGM": {
      "parser": "ListOfWeightedEntriesParser",
      "values": ["#event_BGM_Off", "#event_BGM_On"],
      "weights": [70, 30]
    },
    "calculator_event_BGM": {
      "parser": "GenerateRandomEventCalculatorParser",
      "events": "#event_BGM"
    },
    "calculator_retrigger_event_BGM": {
      "parser": "ConditionalCalculatorParser",
      "gamePredicate": "#retriggerFS",
      "delegate": "#calculator_event_BGM"
    },

    "event_gr_monkeys_1": {
      "parser": "SlotEventParser",
      "id": "event_gr_monkeys_1"
    },
    "event_gr_monkeys_2": {
      "parser": "SlotEventParser",
      "id": "event_gr_monkeys_2"
    },
    "event_gr_monkeys_3": {
      "parser": "SlotEventParser",
      "id": "event_gr_monkeys_3"
    },
    "event_free_a_monkey": {
      "parser": "ListOfWeightedEntriesParser",
      "values": ["#event_gr_monkeys_1", "#event_gr_monkeys_2", "#event_gr_monkeys_3"],
      "weights": [99, 1, 0]
    },
    "event_free_b_monkey": {
      "parser": "ListOfWeightedEntriesParser",
      "values": ["#event_gr_monkeys_1", "#event_gr_monkeys_2", "#event_gr_monkeys_3"],
      "weights": [95, 5, 0]
    },
    "event_free_c_monkey": {
      "parser": "ListOfWeightedEntriesParser",
      "values": ["#event_gr_monkeys_1", "#event_gr_monkeys_2", "#event_gr_monkeys_3"],
      "weights": [89, 10, 1]
    },
    "event_free_d_monkey": {
      "parser": "ListOfWeightedEntriesParser",
      "values": ["#event_gr_monkeys_1", "#event_gr_monkeys_2", "#event_gr_monkeys_3"],
      "weights": [70, 25, 5]
    },
    "event_free_e_monkey": {
      "parser": "ListOfWeightedEntriesParser",
      "values": ["#event_gr_monkeys_1", "#event_gr_monkeys_2", "#event_gr_monkeys_3"],
      "weights": [70, 5, 25]
    },
    "event_free_monkey": {
      "parser": "MapStringToReferenceParser",
      "free_a": "#event_free_a_monkey",
      "free_b": "#event_free_b_monkey",
      "free_c": "#event_free_c_monkey",
      "free_d": "#event_free_d_monkey",
      "free_e": "#event_free_e_monkey"
    },
    "event_free_monkey_provider": {
      "parser": "SceneDependantOneParser",
      "mapBySceneIds": "#event_free_monkey"
    },
    "calculator_free_monkey": {
      "parser": "GenerateRandomEventCalculatorParser",
      "eventsProvider": "#event_free_monkey_provider"
    },
    "firstFreeSpinInSetPredicate": {
      "parser": "FreeSpinsRemainedPredicateParser",
      "allowed": 10
    },
    "lastFreeSpinBeforeNextSetPredicate": {
      "parser": "FreeSpinsRemainedPredicateParser",
      "allowed": 11
    },
    "calculator_retrigger_monkey": {
      "parser": "ConditionalCalculatorParser",
      "gamePredicate": "#lastFreeSpinBeforeNextSetPredicate",
      "delegate": "#calculator_free_monkey"
    },

    "event_trigger_free_monkey_provider": {
      "parser": "StartSceneDependantOneParser",
      "mapBySceneIds": "#event_free_monkey"
    },
    "calculator_trigger_free_monkey": {
      "parser": "GenerateRandomEventCalculatorParser",
      "eventsProvider": "#event_trigger_free_monkey_provider"
    },
    "calculator_trigger_monkey": {
      "parser": "ConditionalCalculatorParser",
      "gamePredicate": "#triggerFS",
      "delegate": "#calculator_trigger_free_monkey"
    },

    "paytable": {
      "parser": "PaytableParser",
      "id": "main",
      "paytable": {
        "A": [4],
        "B": [10],
        "C": [16],
        "D": [20],
        "E": [40],
        "F": [60],
        "G": [100],
        "H": [200],
        "I": [400],
        "J": [600],
        "K": [1000],
        "L": [2000],
        "M": [6000]
      }
    },
    "paytableProvider": {
      "parser": "BasePaytableProviderParser",
      "paytable": "#paytable"
    },

    "mainReelSet": {
      "parser": "ReelSetParser",
      "id": "main",
      "reels": [
        ["D_w715", "F_w285", "G_w130", "FG_w38", "BL_w11100"]
      ]
    },
    "mainSceneReelsProvider": {
      "parser": "BaseReelsProviderParser",
      "sceneSize": "#sceneSize",
      "reelSet": "#mainReelSet"
    },

    "combinationSettings": {
      "parser": "CombinationSettingsParser",
      "symbolsRef": "#symbols"
    },
    "combinationSupplier": {
      "parser": "LineCombinationSupplierParser",
      "paylines": "#paylines",
      "combinationSettings": "#combinationSettings"
    },
    "winCalculator": {
      "parser": "WinCalculatorParser",
      "combinationSupplier": "#combinationSupplier"
    },

    "freeSpinCountMap": {
      "parser": "MapIntegerToIntegerParser",
      "1": 10
    },
    "triggerCombinationSettings": {
      "parser": "CombinationSettingsParser",
      "symbols": ["FG"]
    },
    "triggerCombinationSettingsSupplier": {
      "parser": "LineCombinationSupplierParser",
      "paylines": "#paylines",
      "combinationSettings": "#triggerCombinationSettings"
    },
    "startFreeSpinCombination": {
      "parser": "CombinationStartSceneSettingsParser",
      "spinsLengthMapping": "#freeSpinCountMap",
      "combinationSupplier": "#triggerCombinationSettingsSupplier"
    },

    "freeSpinIdWeights": {
      "parser": "ListOfWeightedEntriesParser",
      "values": ["free_a", "free_b", "free_c", "free_d", "free_e"],
      "weights": [100, 220, 240, 100, 15]
    },
    "freeSpinIdProvider": {
      "parser": "WeightedOneParser",
      "weightEntries": "#freeSpinIdWeights"
    },
    "startFreeSpinCalculator": {
      "parser": "StartSceneCalculatorParser",
      "sceneIdProvider": "#freeSpinIdProvider",
      "settings": "#startFreeSpinCombination"
    },

    "mainSceneCalculators": {
      "parser": "ListOfReferencesParser",
      "list": ["#winCalculator", "#mainEventRandomCalculators", "#startFreeSpinCalculator", "#calculator_trigger_monkey"]
    },

    "mainSceneBehavior": {
      "parser": "MainSceneBehaviorParser"
    },

    "mainScene": {
      "parser": "ReelSceneParser",
      "id": "main",
      "credits": 20,
      "reelsProvider": "#mainSceneReelsProvider",
      "paytableProvider": "#paytableProvider",
      "calculators": "#mainSceneCalculators",
      "behavior": "#mainSceneBehavior"
    },

    "freeReelSet": {
      "parser": "ReelSetParser",
      "id": "free",
      "reels": [
        ["H_w1700", "I_w540", "J_w240", "K_w135", "L_w40", "M_w1"]
      ]
    },
    "freeSceneReelsProvider": {
      "parser": "BaseReelsProviderParser",
      "sceneSize": "#sceneSize",
      "reelSet": "#freeReelSet"
    },

    "addFreeSpinWeightMap_a": {
      "parser": "MapIntegerToIntegerParser",
      "0": 90,
      "10": 10
    },
    "addFreeSpinWeightMap_b": {
      "parser": "MapIntegerToIntegerParser",
      "0": 80,
      "10": 20
    },
    "addFreeSpinWeightMap_c": {
      "parser": "MapIntegerToIntegerParser",
      "0": 75,
      "10": 25
    },
    "addFreeSpinWeightMap_d": {
      "parser": "MapIntegerToIntegerParser",
      "0": 50,
      "10": 50
    },
    "addFreeSpinWeightMap_e": {
      "parser": "MapIntegerToIntegerParser",
      "0": 20,
      "10": 80
    },
    "addFreeSpinWeightMap": {
      "parser": "MapStringToReferenceParser",
      "free_a": "#addFreeSpinWeightMap_a",
      "free_b": "#addFreeSpinWeightMap_b",
      "free_c": "#addFreeSpinWeightMap_c",
      "free_d": "#addFreeSpinWeightMap_d",
      "free_e": "#addFreeSpinWeightMap_e"
    },
    "addFreeSpinWeightMapProvider": {
      "parser": "SceneDependantOneParser",
      "mapBySceneIds": "#addFreeSpinWeightMap"
    },

    "addFreeSpinsCombination": {
      "parser": "WeightBasedAddFreeSpinsSettingsParser",
      "countToWeightMapping": "#addFreeSpinWeightMapProvider"
    },
    "addFreeSpinsCalculator": {
      "parser": "AddFreeSpinsCalculatorParser",
      "settings": "#addFreeSpinsCombination"
    },
    "freeSpinRetriggerCalculator": {
      "parser": "ConditionalCalculatorParser",
      "gamePredicate": "#firstFreeSpinInSetPredicate",
      "delegate": "#addFreeSpinsCalculator"
    },
    "freeSceneCalculators": {
      "parser": "ListOfReferencesParser",
      "list": [
        "#winCalculator", 
        "#freeEventRandomCalculators",
        "#calculator_retrigger_monkey", 
        "#freeSpinRetriggerCalculator",
        "#calculator_retrigger_event_BGM"
      ]
    },

    "freeSceneBehavior_a": {
      "parser": "FreeSpinSceneBehaviorParser"
    },
    "freeSceneBehavior_b": {
      "parser": "FreeSpinSceneBehaviorParser"
    },
    "freeSceneBehavior_c": {
      "parser": "FreeSpinSceneBehaviorParser"
    },
    "freeSceneBehavior_d": {
      "parser": "FreeSpinSceneBehaviorParser"
    },
    "freeSceneBehavior_e": {
      "parser": "FreeSpinSceneBehaviorParser"
    },

    "freeScene_a": {
      "parser": "ReelSceneParser",
      "id": "free_a",
      "credits": 20,
      "reelsProvider": "#freeSceneReelsProvider",
      "paytableProvider": "#paytableProvider",
      "calculators": "#freeSceneCalculators",
      "behavior": "#freeSceneBehavior_a"
    },
    "freeScene_b": {
      "parser": "ReelSceneParser",
      "id": "free_b",
      "credits": 20,
      "reelsProvider": "#freeSceneReelsProvider",
      "paytableProvider": "#paytableProvider",
      "calculators": "#freeSceneCalculators",
      "behavior": "#freeSceneBehavior_b"
    },
    "freeScene_c": {
      "parser": "ReelSceneParser",
      "id": "free_c",
      "credits": 20,
      "reelsProvider": "#freeSceneReelsProvider",
      "paytableProvider": "#paytableProvider",
      "calculators": "#freeSceneCalculators",
      "behavior": "#freeSceneBehavior_c"
    },
    "freeScene_d": {
      "parser": "ReelSceneParser",
      "id": "free_d",
      "credits": 20,
      "reelsProvider": "#freeSceneReelsProvider",
      "paytableProvider": "#paytableProvider",
      "calculators": "#freeSceneCalculators",
      "behavior": "#freeSceneBehavior_d"
    },
    "freeScene_e": {
      "parser": "ReelSceneParser",
      "id": "free_e",
      "credits": 20,
      "reelsProvider": "#freeSceneReelsProvider",
      "paytableProvider": "#paytableProvider",
      "calculators": "#freeSceneCalculators",
      "behavior": "#freeSceneBehavior_e"
    },

    "scenes": {
      "parser": "ListOfReferencesParser",
      "list": ["#mainScene", "#freeScene_a", "#freeScene_b", "#freeScene_c", "#freeScene_d", "#freeScene_e"]
    }
  }
}