{
  "type": "JEWELRY_CATS",
  "definitions": [
    {
      "id": "jewelry_cats_96",
      "defaultDefinition": true,
      "data": {}
    },
    {
      "id": "jewelry_cats_92",
      "data": {
        "symbol_table_weights": {
          "parser": "ListOfWeightedEntriesParser",
          "values": ["#symbol_table_00", "#symbol_table_01", "#symbol_table_02", "#symbol_table_03", "#symbol_table_04", "#symbol_table_05", "#symbol_table_06", "#symbol_table_07"],
          "weights": [24575, 100, 200, 200, 400, 400, 800, 800]
        }
      }
    },
    {
      "id": "jewelry_cats_94",
      "data": {
        "symbol_table_weights": {
          "parser": "ListOfWeightedEntriesParser",
          "values": ["#symbol_table_00", "#symbol_table_01", "#symbol_table_02", "#symbol_table_03", "#symbol_table_04", "#symbol_table_05", "#symbol_table_06", "#symbol_table_07"],
          "weights": [23400, 100, 200, 200, 400, 400, 800, 800]
        }
      }
    }
  ],
  "data": {
    "paylines": {
      "parser": "PaylinesHorizontalParser",
      "list": []
    },
    "sceneSize": {
      "parser": "SceneSizeRectangularParser",
      "width": 5,
      "height": 5
    },
    "jackpotSceneSize": {
      "parser": "SceneSizeRectangularParser",
      "width": 1,
      "height": 7
    },
    "symbols": {
      "parser": "SymbolsParser",
      "list": ["WL", "A", "B", "C", "D", "E", "F", "G"]
    },

    "paytable": {
      "parser": "PaytableParser",
      "id": "main",
      "paytable": {
        "JP3": [0, 0, 120, 0, 0],
        "JP2": [0, 0, 30, 0, 0],
        "JP1": [0, 0, 15, 0, 0],
        "WL": [0, 0, 0, 0, 300],
        "A": [0, 0, 5, 10, 100],
        "B": [0, 0, 3, 5, 50],
        "C": [0, 0, 3, 5, 50],
        "D": [0, 0, 2, 3, 30],
        "E": [0, 0, 2, 3, 30],
        "F": [0, 0, 1, 2, 20],
        "G": [0, 0, 1, 2, 20]
      }
    },
    "paytableProvider": {
      "parser": "BasePaytableProviderParser",
      "paytable": "#paytable"
    },

    "symbol_table_00": {
      "parser": "ListOfWeightedEntriesParser",
      "values": ["A", "B", "C", "D", "E", "F", "G"],
      "weights": [20, 28, 28, 30, 30, 32, 32],
      "convertor": "SYMBOL_TYPE"
    },
    "symbol_table_01": {
      "parser": "ListOfWeightedEntriesParser",
      "values": ["A", "B", "C", "D", "E", "F", "G"],
      "weights": [3, 1, 1, 1, 1, 1, 1],
      "convertor": "SYMBOL_TYPE"
    },
    "symbol_table_02": {
      "parser": "ListOfWeightedEntriesParser",
      "values": ["A", "B", "C", "D", "E", "F", "G"],
      "weights": [1, 3, 1, 1, 1, 1, 1],
      "convertor": "SYMBOL_TYPE"
    },
    "symbol_table_03": {
      "parser": "ListOfWeightedEntriesParser",
      "values": ["A", "B", "C", "D", "E", "F", "G"],
      "weights": [1, 1, 3, 1, 1, 1, 1],
      "convertor": "SYMBOL_TYPE"
    },
    "symbol_table_04": {
      "parser": "ListOfWeightedEntriesParser",
      "values": ["A", "B", "C", "D", "E", "F", "G"],
      "weights": [1, 1, 1, 4, 1, 1, 1],
      "convertor": "SYMBOL_TYPE"
    },
    "symbol_table_05": {
      "parser": "ListOfWeightedEntriesParser",
      "values": ["A", "B", "C", "D", "E", "F", "G"],
      "weights": [1, 1, 1, 1, 4, 1, 1],
      "convertor": "SYMBOL_TYPE"
    },
    "symbol_table_06": {
      "parser": "ListOfWeightedEntriesParser",
      "values": ["A", "B", "C", "D", "E", "F", "G"],
      "weights": [1, 1, 1, 1, 1, 5, 1],
      "convertor": "SYMBOL_TYPE"
    },
    "symbol_table_07": {
      "parser": "ListOfWeightedEntriesParser",
      "values": ["A", "B", "C", "D", "E", "F", "G"],
      "weights": [1, 1, 1, 1, 1, 1, 5],
      "convertor": "SYMBOL_TYPE"
    },

    "symbol_table_weights": {
      "parser": "ListOfWeightedEntriesParser",
      "values": ["#symbol_table_00", "#symbol_table_01", "#symbol_table_02", "#symbol_table_03", "#symbol_table_04", "#symbol_table_05", "#symbol_table_06", "#symbol_table_07"],
      "weights": [22280, 100, 200, 200, 400, 400, 800, 800]
    },
    "symbolWeightsProvider": {
      "parser": "WeightedOneParser",
      "weightEntries": "#symbol_table_weights"
    },

    "respin_symbol_table_weights": {
      "parser": "ListOfWeightedEntriesParser",
      "values": ["#symbol_table_00", "#symbol_table_01", "#symbol_table_02", "#symbol_table_03", "#symbol_table_04", "#symbol_table_05", "#symbol_table_06", "#symbol_table_07"],
      "weights": [120, 1, 2, 2, 4, 4, 8, 8]
    },
    "reSpinSymbolWeightsProvider": {
      "parser": "WeightedOneParser",
      "weightEntries": "#respin_symbol_table_weights"
    },

    "initialPawCountWeightsProvider": {
      "parser": "ListOfWeightedEntriesParser",
      "values": [0, 1, 2, 3, 4, 5, 6, 7, 8, 9, 10],
      "weights": [192, 89, 55, 34, 21, 13, 8, 5, 3, 2, 1]
    },
    "reSpinPawCountWeights_01": {
      "parser": "ListOfWeightedEntriesParser",
      "values": [0, 1, 2, 3, 4, 5, 6, 7, 8, 9, 10],
      "weights": [0, 512, 256, 128, 64, 32, 16, 8, 4, 2, 1]
    },
    "reSpinPawCountWeights_02": {
      "parser": "ListOfWeightedEntriesParser",
      "values": [0, 1, 2, 3, 4, 5, 6, 7, 8, 9, 10],
      "weights": [0, 89, 55, 34, 21, 13, 8, 5, 3, 2, 1]
    },
    "reSpinPawCountWeights_03": {
      "parser": "ListOfWeightedEntriesParser",
      "values": [0, 1, 2, 3, 4, 5, 6, 7, 8, 9, 10],
      "weights": [0, 10, 9, 8, 7, 6, 5, 4, 3, 2, 1]
    },
    "reSpinPawCountWeights": {
      "parser": "ListOfWeightedEntriesParser",
      "values": ["#reSpinPawCountWeights_01", "#reSpinPawCountWeights_02", "#reSpinPawCountWeights_03"],
      "weights": [3200, 2000, 1000]
    },
    "reSpinPawCountWeightsProvider": {
      "parser": "WeightedOneParser",
      "weightEntries": "#reSpinPawCountWeights"
    },

    "jackpotReelSet_1": {
      "parser": "ReelSetParser",
      "id": "jackpot_1",
      "reels": [
        ["JP3", "JP3", "JP2", "JP2", "JP1", "JP1", "JP1"]
      ]
    },
    "jackpotReelSet_2": {
      "parser": "ReelSetParser",
      "id": "jackpot_2",
      "reels": [
        ["JP3", "JP3", "JP2", "JP2", "JP1", "JP1", "JP2"]
      ]
    },
    "jackpotReelSet_3": {
      "parser": "ReelSetParser",
      "id": "jackpot_3",
      "reels": [
        ["JP3", "JP3", "JP2", "JP2", "JP1", "JP1", "JP3"]
      ]
    },
    "jackpotReelStopsProvider": {
      "parser": "FromManyReelStopsProviderParser",
      "values": [0]
    },
    "jackpotReels1Provider": {
      "parser": "BaseReelsProviderParser",
      "sceneSize": "#jackpotSceneSize",
      "reelSet": "#jackpotReelSet_1",
      "reelStopsProvider": "#jackpotReelStopsProvider"
    },
    "jackpotReels2Provider": {
      "parser": "BaseReelsProviderParser",
      "sceneSize": "#jackpotSceneSize",
      "reelSet": "#jackpotReelSet_2",
      "reelStopsProvider": "#jackpotReelStopsProvider"
    },
    "jackpotReels3Provider": {
      "parser": "BaseReelsProviderParser",
      "sceneSize": "#jackpotSceneSize",
      "reelSet": "#jackpotReelSet_3",
      "reelStopsProvider": "#jackpotReelStopsProvider"
    },
    "jackpotReelsWeights": {
      "parser": "WeightedByIndexOneParser",
      "list": [500, 50, 10]
    },
    "jackpotRegularReelsProvider": {
      "parser": "SelectReelsProviderParser",
      "list": ["#jackpotReels1Provider", "#jackpotReels2Provider", "#jackpotReels3Provider"],
      "weightsByIndex": "#jackpotReelsWeights"
    },
    "jackpotShuffledReelsProvider": {
      "parser": "SymbolShufflingReelsProviderParser",
      "delegate": "#jackpotRegularReelsProvider"
    },
    "jackpotPartiallyShuffledReelsProvider": {
      "parser": "SymbolShufflingReelsProviderParser",
      "delegate": "#jackpotRegularReelsProvider",
      "freezePositions": [6]
    },
    "jackpotScenarioWeights": {
      "parser": "WeightedByIndexOneParser",
      "list": [8, 2]
    },
    "jackpotReelsProvider": {
      "parser": "SelectReelsProviderParser",
      "list": ["#jackpotPartiallyShuffledReelsProvider", "#jackpotShuffledReelsProvider"],
      "weightsByIndex": "#jackpotScenarioWeights"
    },

    "initialPawSeedCalculator": {
      "parser": "GenerateRandomPositionsCalculatorParser",
      "symbolCountWeights": "#initialPawCountWeightsProvider",
      "eventId": "pawSeed"
    },

    "mainReelsProvider": {
      "parser": "GridReelsProviderParser",
      "sceneSize": "#sceneSize",
      "symbolWeights": "#symbolWeightsProvider"
    },
    "combinationSettings": {
      "parser": "CombinationSettingsParser",
      "symbolsRef": "#symbols",
      "substitutesBy": ["WL"]
    },
    "linesCombinationSettings": {
      "parser": "CombinationSettingsParser",
      "symbolsRef": "#symbols",
      "substitutesBy": ["WL"],
      "allSubstitutesAllowed": false
    },
    "combinationSupplier": {
      "parser": "OrthogonalCombinationSupplierParser",
      "combinationSettings": "#combinationSettings",
      "linesCombinationSettings": "#linesCombinationSettings",
      "minLength": 3
    },
    "winCalculator": {
      "parser": "WinCalculatorParser",
      "combinationSupplier": "#combinationSupplier"
    },
    "initialDrawCalculator": {
      "parser": "MiniSceneDelegateCalculatorParser",
      "delegate": "#winCalculator",
      "eventId": "initialWindow"
    },

    "wild": {
      "parser": "SymbolsParser",
      "list": ["WL"]
    },
    "pawSeedEvents": {
      "parser": "EventsManyParser",
      "eventIds": ["pawSeed"]
    },
    "pawSeedLastEvent": {
      "parser": "LastOneParser",
      "provider": "#pawSeedEvents"
    },
    "pawPositions": {
      "parser": "PositionsManyParser",
      "provider": "#pawSeedLastEvent"
    },

    "windowUpdateEvents": {
      "parser": "EventsManyParser",
      "eventIds": ["initialWindow", "updatedWindow", "reSpinWindow"]
    },
    "windowUpdateLastEvent": {
      "parser": "LastOneParser",
      "provider": "#windowUpdateEvents"
    },
    "wildPositions": {
      "parser": "PositionsOnWindowManyParser",
      "symbolTypes": "#wild",
      "provider": "#windowUpdateLastEvent"
    },
    "winPositions": {
      "parser": "WinPositionsManyParser",
      "provider": "#windowUpdateLastEvent"
    },
    "unconvertedPawPositions": {
      "parser": "SubtractionManyParser",
      "source": "#pawPositions",
      "subtractors": ["#wildPositions"]
    },
    "newWildsPositions": {
      "parser": "IntersectionManyParser",
      "providers": ["#unconvertedPawPositions", "#winPositions"]
    },
    "newWildsCalculator": {
      "parser": "GeneratePositionsEventCalculatorParser",
      "positions": "#newWildsPositions",
      "eventId": "newWilds"
    },

    "newWildsEvents": {
      "parser": "EventsManyParser",
      "eventIds": ["newWilds"]
    },
    "newWildsLastEvent": {
      "parser": "LastOneParser",
      "provider": "#newWildsEvents"
    },
    "newWildsLastEventPositions": {
      "parser": "PositionsManyParser",
      "provider": "#newWildsLastEvent"
    },

    "lastWindowReelsProvider": {
      "parser": "LastWindowReelsProviderParser",
      "sceneSize": "#sceneSize"
    },
    "lastWindowWithNewWildsReelsProvider": {
      "parser": "SymbolLandingReelsProviderParser",
      "delegate": "#lastWindowReelsProvider",
      "symbolType": "WL",
      "positions": "#newWildsLastEventPositions"
    },
    "updatedWindowCalculator": {
      "parser": "MiniSceneDelegateCalculatorParser",
      "reelsProvider": "#lastWindowWithNewWildsReelsProvider",
      "delegate": "#winCalculator",
      "eventId": "updatedWindow"
    },
    "winAndLocateWildsCalculator": {
      "parser": "AllCalculatorsParser",
      "delegates": ["#updatedWindowCalculator", "#newWildsCalculator"]
    },

    "hasNewWilds": {
      "parser": "LastEventPredicateParser",
      "eventId": "newWilds"
    },
    "whileNewWildsAppearCalculator": {
      "parser": "WhileCalculatorParser",
      "gamePredicate": "#hasNewWilds",
      "delegate": "#winAndLocateWildsCalculator"
    },

    "currentRewards": {
      "parser": "RewardsManyParser",
      "provider": "#windowUpdateLastEvent"
    },
    "currentRewardsSize": {
      "parser": "SizeOneParser",
      "provider": "#currentRewards"
    },

    "winPositionsSize": {
      "parser": "SizeOneParser",
      "provider": "#winPositions"
    },
    "jackpotTriggerPredicate": {
      "parser": "InRangePredicateParser",
      "value": "#winPositionsSize",
      "min": 25
    },
    "jackpotNotPossiblePredicate": {
      "parser": "InRangePredicateParser",
      "value": "#winPositionsSize",
      "max": 24
    },

    "enoughRewardsForReSpinPredicate": {
      "parser": "InRangePredicateParser",
      "value": "#currentRewardsSize",
      "min": 3
    },
    "reSpinTriggerPredicate": {
      "parser": "AllMatchPredicateParser",
      "delegates": ["#enoughRewardsForReSpinPredicate", "#jackpotNotPossiblePredicate"]
    },

    "reSpinPawSeedCalculator": {
      "parser": "GenerateRandomPositionsCalculatorParser",
      "symbolCountWeights": "#reSpinPawCountWeightsProvider",
      "avoidPositions": "#winPositions",
      "eventId": "pawSeed"
    },

    "reSpinWindowReelsProvider": {
      "parser": "WindowUpdateReelsProviderParser",
      "delegate": "#lastWindowReelsProvider",
      "symbolWeights": "#reSpinSymbolWeightsProvider",
      "exceptPositions": "#winPositions"
    },
    "reSpinWindowCalculator": {
      "parser": "MiniSceneDelegateCalculatorParser",
      "reelsProvider": "#reSpinWindowReelsProvider",
      "delegate": "#winCalculator",
      "eventId": "reSpinWindow"
    },

    "currentWin": {
      "parser": "TotalWinOneParser",
      "provider": "#windowUpdateLastEvent"
    },
    "savedWin": {
      "parser": "PropertyOneParser",
      "key": "currentWin"
    },
    "saveCurrentWinCalculator": {
      "parser": "WritePropertyCalculatorParser",
      "key": "currentWin",
      "value": "#currentWin"
    },
    "winNotChangedPredicate": {
      "parser": "AllEqualsPredicateParser",
      "values": ["#currentWin", "#savedWin"]
    },
    "winChangedPredicate": {
      "parser": "NotPredicateParser",
      "delegate": "#winNotChangedPredicate"
    },
    "reSpinReTriggerPredicate": {
      "parser": "AllMatchPredicateParser",
      "delegates": ["#winChangedPredicate", "#jackpotNotPossiblePredicate"]
    },

    "singleReSpinCalculators": {
      "parser": "AllCalculatorsParser",
      "delegates": [
        "#saveCurrentWinCalculator",
        "#reSpinPawSeedCalculator",
        "#reSpinWindowCalculator",
        "#newWildsCalculator",
        "#whileNewWildsAppearCalculator"
      ]
    },
    "whileWinChangedCalculator": {
      "parser": "WhileCalculatorParser",
      "gamePredicate": "#reSpinReTriggerPredicate",
      "delegate": "#singleReSpinCalculators"
    },
    "reSpinSeriesCalculators": {
      "parser": "AllCalculatorsParser",
      "delegates": [
        "#singleReSpinCalculators",
        "#whileWinChangedCalculator",
        "#saveCurrentWinCalculator"
      ]
    },
    "reSpinCalculator": {
      "parser": "ConditionalCalculatorParser",
      "gamePredicate": "#reSpinTriggerPredicate",
      "delegate": "#reSpinSeriesCalculators"
    },

    "wildCount": {
      "parser": "SizeOneParser",
      "provider": "#wildPositions"
    },
    "groupRewardsCalculator": {
      "parser": "MiniSceneGroupRewardsCalculatorParser",
      "winMultiplier": "#wildCount"
    },

    "jackpotCombinationSettings": {
      "parser": "CombinationSettingsParser",
      "symbols": ["JP1", "JP2", "JP3"]
    },
    "scatterWinSupplier": {
      "parser": "ScatterWinSupplierParser"
    },
    "jackpotScatterWinCalculator": {
      "parser": "AnyWinCalculatorParser",
      "combinationSettings": "#jackpotCombinationSettings",
      "winSupplier": "#scatterWinSupplier"
    },
    "jackpotWinCalculator": {
      "parser": "MiniSceneDelegateCalculatorParser",
      "reelsProvider": "#jackpotReelsProvider",
      "delegate": "#jackpotScatterWinCalculator",
      "eventId": "jackpot"
    },
    "jackpotCalculators": {
      "parser": "AllCalculatorsParser",
      "delegates": ["#jackpotWinCalculator", "#groupRewardsCalculator"]
    },
    "jackpotCalculator": {
      "parser": "ConditionalCalculatorParser",
      "gamePredicate": "#jackpotTriggerPredicate",
      "delegate": "#jackpotCalculators"
    },

    "mainSceneCalculators": {
      "parser": "ListOfReferencesParser",
      "list": [
        "#initialPawSeedCalculator",
        "#initialDrawCalculator",
        "#newWildsCalculator",
        "#whileNewWildsAppearCalculator",
        "#reSpinCalculator",
        "#groupRewardsCalculator",
        "#jackpotCalculator"
      ]
    },

    "mainSceneBehavior": {
      "parser": "MainSceneBehaviorParser"
    },

    "mainScene": {
      "parser": "ReelSceneParser",
      "id": "main",
      "credits": 10,
      "reelsProvider": "#mainReelsProvider",
      "paytableProvider": "#paytableProvider",
      "calculators": "#mainSceneCalculators",
      "behavior": "#mainSceneBehavior"
    },

    "scenes": {
      "parser": "ListOfReferencesParser",
      "list": ["#mainScene"]
    }
  }
}